{"text_format":"1","workbook":"xlsx","n_sheets":12,"sheets":["Cover","Navigator","Style Guide","Model Parameters","Hierarchical Data Validation","Interdependent Data Validation","Data","Quarter Data Validation","Division Data Validation","Unit No Data Validation","Manager Data Validation","Error Checks"],"not_rendered":{"charts":0,"images":1,"macros":1,"external_links":0,"defined_names":40,"comments":0,"pivot_tables":0},"unopened":[],"bounds":{"document_bytes":16777216,"sheet_cells":100000,"rows_first":2000,"rows_last":500,"rows_between":2000,"halvings":0,"cell_chars":16384,"cell_head_chars":4096},"cells_cut":0,"cells_raw":0,"read":"whole","date_system":"1900"}

{"sheet":"Cover","index":0,"n_rows":22,"n_cols":7,"rows_kept":22,"cut":false,"hidden":false,"merged":[[16,2,16,9],[17,2,17,9],[20,6,20,8],[21,6,21,8]]}
[]
[]
["Navigator"]
[]
[null,null,{"$f":"Client_Name","v":"SumProduct Pty Limited"}]
[null,null,{"$f":"Model_Name","v":"SP Examples of Dependent Data Validation.xlsm"}]
[]
[]
[]
[]
[]
[]
[]
[null,null,"Primary Developer:  Liam Bastick"]
[]
{"$rows_left_out":8}
{"sheet":"Navigator","index":1,"n_rows":19,"n_cols":7,"rows_kept":19,"cut":false,"hidden":false,"merged":[]}
["Navigator"]
[{"$f":"Model_Name","v":"SP Examples of Dependent Data Validation.xlsm"}]
["Navigator"]
[null,null,null,null,"Error Checks:",null,{"$f":"Overall_Error_Check","v":0}]
[]
[]
[null,1,"Table of Contents"]
[]
[null,null,null,null,null,"Cover"]
[null,null,null,null,null,"Style Guide"]
[null,null,null,null,null,"Model Parameters"]
[null,null,null,null,null,"Hierarchical Data Validation"]
[null,null,null,null,null,"Interdependent Data Validation"]
[null,null,null,null,null,"Data"]
[null,null,null,null,null,"Quarter Data Validation"]
{"$rows_left_out":5}
{"sheet":"Style Guide","index":2,"n_rows":74,"n_cols":11,"rows_kept":74,"cut":false,"hidden":false,"merged":[[16,2,16,6],[2,0,2,4],[7,2,7,6],[8,2,8,6],[9,2,9,6],[10,2,10,6],[11,2,11,6],[12,2,12,6],[13,2,13,6],[14,2,14,6],[15,2,15,6],[34,2,34,6],[17,2,17,6],[18,2,18,6],[19,2,19,6],[24,2,24,6],[25,2,25,6],[26,2,26,6],[27,2,27,6],[28,2,28,6],[29,2,29,6],[30,2,30,6],[31,2,31,6],[46,2,46,6],[35,2,35,6],[36,2,36,6],[37,2,37,6],[38,2,38,6],[39,2,39,6],[40,2,40,6],[41,2,41,6],[42,2,42,6],[43,2,43,6],[44,2,44,6],[45,2,45,6],[61,2,61,6],[47,2,47,6],[48,2,48,6],[49,2,49,6],[50,2,50,6],[51,2,51,6],[52,2,52,6],[53,2,53,6],[54,2,54,6],[57,2,57,6],[59,2,59,6],[60,2,60,6],[73,2,73,6],[62,2,62,6],[63,2,63,6],[64,2,64,6],[65,2,65,6],[66,2,66,6],[67,2,67,6],[68,2,68,6],[69,2,69,6],[70,2,70,6],[71,2,71,6],[72,2,72,6],[80,2,80,6],[74,2,74,6],[75,2,75,6],[76,2,76,6],[77,2,77,6],[78,2,78,6],[79,2,79,6]]}
[{"$f":"IF(ISERROR(RIGHT(CELL(\"filename\",A1),LEN(CELL(\"filename\",A1))-FIND(\"]\",CELL(\"filename\",A1)))),\n\"\",\nRIGHT(CELL(\"filename\",A1),LEN(CELL(\"filename\",A1))-FIND(\"]\",CELL(\"filename\",A1))))","v":"Style Guide"}]
[{"$f":"Model_Name","v":"SP Examples of Dependent Data Validation.xlsm"}]
["Navigator"]
[null,null,null,null,"Error Checks:",null,null,null,{"$f":"Overall_Error_Check","v":0}]
[]
[null,{"$f":"MAX($B$5:$B5)+1","v":1},"Formatting of Headers / Dividers"]
[]
[null,null,"Description",null,null,null,null,null,"Display",null,"Style Name"]
[]
[null,null,"Sheet Title",null,null,null,null,null,{"$f":"C10","v":"Sheet Title"},null,"Sheet Title"]
[null,null,"Model Name",null,null,null,null,null,{"$f":"C11","v":"Model Name"},null,"Model Name"]
[]
[null,null,"Header 1",null,null,null,null,null,{"$f":"C13","v":"Header 1"},null,"Header 1"]
[null,null,"Header 2",null,null,null,null,null,{"$f":"C14","v":"Header 2"},null,"Header 2"]
[null,null,"Header 3",null,null,null,null,null,{"$f":"C15","v":"Header 3"},null,"Header 3"]
{"$rows_left_out":60}
{"sheet":"Model Parameters","index":3,"n_rows":31,"n_cols":9,"rows_kept":31,"cut":false,"hidden":false,"merged":[[0,9,0,10],[2,0,2,4],[10,6,10,13],[11,6,11,13]]}
[{"$f":"IF(ISERROR(RIGHT(CELL(\"filename\",A1),LEN(CELL(\"filename\",A1))-FIND(\"]\",CELL(\"filename\",A1)))),\n\"\",\nRIGHT(CELL(\"filename\",A1),LEN(CELL(\"filename\",A1))-FIND(\"]\",CELL(\"filename\",A1))))","v":"Model Parameters"}]
[{"$f":"Model_Name","v":"SP Examples of Dependent Data Validation.xlsm"}]
["Navigator"]
[null,null,null,null,"Error Checks:",null,null,null,{"$f":"Overall_Error_Check","v":0}]
[]
[null,{"$f":"MAX($B$5:$B5)+1","v":1},"General"]
[]
[null,null,"Key Inputs"]
[]
[null,null,null,null,"General"]
[null,null,null,null,"Model Name",null,{"$f":"IF(ISERROR(OR(FIND(\"[\",CELL(\"filename\",A1)),FIND(\"]\",CELL(\"filename\",A1)))),\"\",MID(CELL(\"filename\",A1),FIND(\"[\",CELL(\"filename\",A1))+1,FIND(\"]\",CELL(\"filename\",A1))-FIND(\"[\",CELL(\"filename\",A1))-1))","v":"SP Examples of Dependent Data Validation.xlsm"}]
[null,null,null,null,"Client Name",null,"SumProduct Pty Limited"]
[]
[]
[null,{"$f":"MAX($B$5:$B14)+1","v":2},"General Range Names"]
{"$rows_left_out":17}
{"sheet":"Hierarchical Data Validation","index":4,"n_rows":37,"n_cols":10,"rows_kept":37,"cut":false,"hidden":false,"merged":[[2,0,2,4]]}
[{"$f":"IF(ISERROR(RIGHT(CELL(\"filename\",A1),LEN(CELL(\"filename\",A1))-FIND(\"]\",CELL(\"filename\",A1)))),\n\"\",\nRIGHT(CELL(\"filename\",A1),LEN(CELL(\"filename\",A1))-FIND(\"]\",CELL(\"filename\",A1))))","v":"Hierarchical Data Validation"}]
[{"$f":"Model_Name","v":"SP Examples of Dependent Data Validation.xlsm"}]
["Navigator"]
[null,null,null,null,"Error Checks:",null,null,null,{"$f":"Overall_Error_Check","v":0}]
[]
[null,{"$f":"MAX($B$5:$B5)+1","v":1},"Source Data"]
[]
[null,null,"Assumptions"]
[]
[null,null,null,{"$f":"\"For Use with \"&A1","v":"For Use with Hierarchical Data Validation"}]
[]
[null,null,null,null,null,"Income_Statement","Balance_Sheet","Cash_Flow_Statement",null,"Financial_Statements"]
[null,null,null,null,null,"Revenue","Current Assets","Operating Cash Flow"]
[null,null,null,null,null,"COGS","Non-Current Assets","Investing Cash Flow"]
[null,null,null,null,null,"Gross Profit","Total Assets","Financing Cash Flow"]
{"$rows_left_out":23}
{"sheet":"Interdependent Data Validation","index":5,"n_rows":22,"n_cols":11,"rows_kept":22,"cut":false,"hidden":false,"merged":[[2,0,2,4]]}
[{"$f":"IF(ISERROR(RIGHT(CELL(\"filename\",A1),LEN(CELL(\"filename\",A1))-FIND(\"]\",CELL(\"filename\",A1)))),\n\"\",\nRIGHT(CELL(\"filename\",A1),LEN(CELL(\"filename\",A1))-FIND(\"]\",CELL(\"filename\",A1))))","v":"Interdependent Data Validation"}]
[{"$f":"Model_Name","v":"SP Examples of Dependent Data Validation.xlsm"}]
["Navigator"]
[null,null,null,null,"Error Checks:",null,null,{"$f":"Overall_Error_Check","v":0}]
[]
[null,{"$f":"MAX($B$5:$B5)+1","v":1},"Example"]
[]
[null,null,"For Calculation"]
[]
[null,null,null,{"$f":"A1","v":"Interdependent Data Validation"}]
[]
[null,null,null,{"$f":"(MIN(D13:D22)=0)*1","v":0},"#",{"$f":"Data[[#Headers],[Quarter]]","v":"Quarter"},{"$f":"Data[[#Headers],[Division]]","v":"Division"},{"$f":"Data[[#Headers],[Unit No]]","v":"Unit No"},{"$f":"Data[[#Headers],[Manager]]","v":"Manager"},{"$f":"Data[[#Headers],[Sales Invoiced]]","v":"Sales Invoiced"},{"$f":"Data[[#Headers],[Sales Received]]","v":"Sales Received"}]
[null,null,null,{"$f":"IF(OR(F13=\"\",G13=\"\",H13=\"\",I13=\"\"),1,COUNTIFS(Data[Quarter],$F13,Data[Division],$G13,Data[Unit No],$H13,Data[Manager],$I13))","v":1},{"$f":"N($E12)+1","v":1},1,"Alpha",5,"Erin Johns",{"$f":"SUMIFS(Data[Sales Invoiced],Data[Quarter],$F13,Data[Division],$G13,Data[Unit No],$H13,Data[Manager],$I13)","v":951.64},{"$f":"SUMIFS(Data[Sales Received],Data[Quarter],$F13,Data[Division],$G13,Data[Unit No],$H13,Data[Manager],$I13)","v":951.64}]
[null,null,null,{"$f":"IF(OR(F14=\"\",G14=\"\",H14=\"\",I14=\"\"),1,COUNTIFS(Data[Quarter],$F14,Data[Division],$G14,Data[Unit No],$H14,Data[Manager],$I14))","v":1},{"$f":"N($E13)+1","v":2},3,"Kilo",55,"Ishaan Hardy",{"$f":"SUMIFS(Data[Sales Invoiced],Data[Quarter],$F14,Data[Division],$G14,Data[Unit No],$H14,Data[Manager],$I14)","v":901},{"$f":"SUMIFS(Data[Sales Received],Data[Quarter],$F14,Data[Division],$G14,Data[Unit No],$H14,Data[Manager],$I14)","v":901}]
[null,null,null,{"$f":"IF(OR(F15=\"\",G15=\"\",H15=\"\",I15=\"\"),1,COUNTIFS(Data[Quarter],$F15,Data[Division],$G15,Data[Unit No],$H15,Data[Manager],$I15))","v":1},3,3,"Papa",76,"Carter Obrien",{"$f":"SUMIFS(Data[Sales Invoiced],Data[Quarter],$F15,Data[Division],$G15,Data[Unit No],$H15,Data[Manager],$I15)","v":845.4},{"$f":"SUMIFS(Data[Sales Received],Data[Quarter],$F15,Data[Division],$G15,Data[Unit No],$H15,Data[Manager],$I15)","v":845.4}]
{"$rows_left_out":8}
{"sheet":"Data","index":6,"n_rows":2012,"n_cols":11,"rows_kept":2012,"cut":false,"hidden":false,"merged":[[2,0,2,4]]}
[{"$f":"IF(ISERROR(RIGHT(CELL(\"filename\",A1),LEN(CELL(\"filename\",A1))-FIND(\"]\",CELL(\"filename\",A1)))),\n\"\",\nRIGHT(CELL(\"filename\",A1),LEN(CELL(\"filename\",A1))-FIND(\"]\",CELL(\"filename\",A1))))","v":"Data"}]
[{"$f":"Model_Name","v":"SP Examples of Dependent Data Validation.xlsm"}]
["Navigator"]
[null,null,null,null,"Error Checks:",null,null,{"$f":"Overall_Error_Check","v":0}]
[]
[null,{"$f":"MAX($B$5:$B5)+1","v":1},{"$f":"A1","v":"Data"}]
[]
[null,null,"Source Data"]
[]
[null,null,null,"Records Used for List"]
[]
[null,null,null,null,null,"Quarter","Division","Unit No","Manager","Sales Invoiced","Sales Received"]
[null,null,null,null,null,1,"Kilo",51,"Markus Benson",709.7,327.11]
[null,null,null,null,null,4,"Quebec",83,"Emery Estes",256.75,256.75]
[null,null,null,null,null,4,"Papa",78,"Frederick Knapp",887.86,502.24]
{"$rows_left_out":1998}
{"sheet":"Quarter Data Validation","index":7,"n_rows":22,"n_cols":9,"rows_kept":22,"cut":false,"hidden":false,"merged":[[2,0,2,4]]}
[{"$f":"IF(ISERROR(RIGHT(CELL(\"filename\",A1),LEN(CELL(\"filename\",A1))-FIND(\"]\",CELL(\"filename\",A1)))),\n\"\",\nRIGHT(CELL(\"filename\",A1),LEN(CELL(\"filename\",A1))-FIND(\"]\",CELL(\"filename\",A1))))","v":"Quarter Data Validation"}]
[{"$f":"Model_Name","v":"SP Examples of Dependent Data Validation.xlsm"}]
["Navigator"]
[null,null,null,null,"Error Checks:",null,null,null,{"$f":"Overall_Error_Check","v":0}]
[]
[null,{"$f":"MAX($B$5:$B5)+1","v":1},"Workings"]
[]
[null,null,"For Calculation"]
[]
[null,null,null,{"$f":"A1","v":"Quarter Data Validation"}]
[]
[null,null,null,null,"#"]
[null,null,null,null,{"$f":"N($E12)+1","v":1},{"$f":"TRANSPOSE(_xlfn._xlws.SORT(_xlfn.UNIQUE(_xlfn._xlws.FILTER(Data[Quarter],\nIF(ISBLANK('Interdependent Data Validation'!$G13),1,(Data[Division]='Interdependent Data Validation'!$G13)*1)\n*IF(ISBLANK('Interdependent Data Validation'!$H13),1,(Data[Unit No]='Interdependent Data Validation'!$H13)*1)\n*IF(ISBLANK('Interdependent Data Validation'!$I13),1,(Data[Manager]='Interdependent Data Validation'!$I13)*1)))))","v":1}]
[null,null,null,null,{"$f":"N($E13)+1","v":2},{"$f":"TRANSPOSE(_xlfn._xlws.SORT(_xlfn.UNIQUE(_xlfn._xlws.FILTER(Data[Quarter],\nIF(ISBLANK('Interdependent Data Validation'!$G14),1,(Data[Division]='Interdependent Data Validation'!$G14)*1)\n*IF(ISBLANK('Interdependent Data Validation'!$H14),1,(Data[Unit No]='Interdependent Data Validation'!$H14)*1)\n*IF(ISBLANK('Interdependent Data Validation'!$I14),1,(Data[Manager]='Interdependent Data Validation'!$I14)*1)))))","v":3}]
[null,null,null,null,3,{"$f":"TRANSPOSE(_xlfn._xlws.SORT(_xlfn.UNIQUE(_xlfn._xlws.FILTER(Data[Quarter],\nIF(ISBLANK('Interdependent Data Validation'!$G15),1,(Data[Division]='Interdependent Data Validation'!$G15)*1)\n*IF(ISBLANK('Interdependent Data Validation'!$H15),1,(Data[Unit No]='Interdependent Data Validation'!$H15)*1)\n*IF(ISBLANK('Interdependent Data Validation'!$I15),1,(Data[Manager]='Interdependent Data Validation'!$I15)*1)))))","v":3}]
{"$rows_left_out":8}
{"sheet":"Division Data Validation","index":8,"n_rows":22,"n_cols":31,"rows_kept":22,"cut":false,"hidden":false,"merged":[[2,0,2,4]]}
[{"$f":"IF(ISERROR(RIGHT(CELL(\"filename\",A1),LEN(CELL(\"filename\",A1))-FIND(\"]\",CELL(\"filename\",A1)))),\n\"\",\nRIGHT(CELL(\"filename\",A1),LEN(CELL(\"filename\",A1))-FIND(\"]\",CELL(\"filename\",A1))))","v":"Division Data Validation"}]
[{"$f":"Model_Name","v":"SP Examples of Dependent Data Validation.xlsm"}]
["Navigator"]
[null,null,null,null,"Error Checks:",null,null,null,{"$f":"Overall_Error_Check","v":0}]
[]
[null,{"$f":"MAX($B$5:$B5)+1","v":1},"Workings"]
[]
[null,null,"For Calculation"]
[]
[null,null,null,{"$f":"A1","v":"Division Data Validation"}]
[]
[null,null,null,null,"#"]
[null,null,null,null,{"$f":"N($E12)+1","v":1},{"$f":"TRANSPOSE(_xlfn._xlws.SORT(_xlfn.UNIQUE(_xlfn._xlws.FILTER(Data[Division],\nIF(ISBLANK('Interdependent Data Validation'!$F13),1,(Data[Quarter]='Interdependent Data Validation'!$F13)*1)\n*IF(ISBLANK('Interdependent Data Validation'!$H13),1,(Data[Unit No]='Interdependent Data Validation'!$H13)*1)\n*IF(ISBLANK('Interdependent Data Validation'!$I13),1,(Data[Manager]='Interdependent Data Validation'!$I13)*1)))))","v":"Alpha"}]
[null,null,null,null,{"$f":"N($E13)+1","v":2},{"$f":"TRANSPOSE(_xlfn._xlws.SORT(_xlfn.UNIQUE(_xlfn._xlws.FILTER(Data[Division],\nIF(ISBLANK('Interdependent Data Validation'!$F14),1,(Data[Quarter]='Interdependent Data Validation'!$F14)*1)\n*IF(ISBLANK('Interdependent Data Validation'!$H14),1,(Data[Unit No]='Interdependent Data Validation'!$H14)*1)\n*IF(ISBLANK('Interdependent Data Validation'!$I14),1,(Data[Manager]='Interdependent Data Validation'!$I14)*1)))))","v":"Kilo"}]
[null,null,null,null,3,{"$f":"TRANSPOSE(_xlfn._xlws.SORT(_xlfn.UNIQUE(_xlfn._xlws.FILTER(Data[Division],\nIF(ISBLANK('Interdependent Data Validation'!$F15),1,(Data[Quarter]='Interdependent Data Validation'!$F15)*1)\n*IF(ISBLANK('Interdependent Data Validation'!$H15),1,(Data[Unit No]='Interdependent Data Validation'!$H15)*1)\n*IF(ISBLANK('Interdependent Data Validation'!$I15),1,(Data[Manager]='Interdependent Data Validation'!$I15)*1)))))","v":"Papa"}]
{"$rows_left_out":8}
{"sheet":"Unit No Data Validation","index":9,"n_rows":22,"n_cols":135,"rows_kept":22,"cut":false,"hidden":false,"merged":[[2,0,2,4]]}
[{"$f":"IF(ISERROR(RIGHT(CELL(\"filename\",A1),LEN(CELL(\"filename\",A1))-FIND(\"]\",CELL(\"filename\",A1)))),\n\"\",\nRIGHT(CELL(\"filename\",A1),LEN(CELL(\"filename\",A1))-FIND(\"]\",CELL(\"filename\",A1))))","v":"Unit No Data Validation"}]
[{"$f":"Model_Name","v":"SP Examples of Dependent Data Validation.xlsm"}]
["Navigator"]
[null,null,null,null,"Error Checks:",null,null,null,{"$f":"Overall_Error_Check","v":0}]
[]
[null,{"$f":"MAX($B$5:$B5)+1","v":1},"Workings"]
[]
[null,null,"For Calculation"]
[]
[null,null,null,{"$f":"A1","v":"Unit No Data Validation"}]
[]
[null,null,null,null,"#"]
[null,null,null,null,{"$f":"N($E12)+1","v":1},{"$f":"TRANSPOSE(_xlfn._xlws.SORT(_xlfn.UNIQUE(_xlfn._xlws.FILTER(Data[Unit No],\nIF(ISBLANK('Interdependent Data Validation'!$F13),1,(Data[Quarter]='Interdependent Data Validation'!$F13)*1)\n*IF(ISBLANK('Interdependent Data Validation'!$G13),1,(Data[Division]='Interdependent Data Validation'!$G13)*1)\n*IF(ISBLANK('Interdependent Data Validation'!$I13),1,(Data[Manager]='Interdependent Data Validation'!$I13)*1)))))","v":1},5]
[null,null,null,null,{"$f":"N($E13)+1","v":2},{"$f":"TRANSPOSE(_xlfn._xlws.SORT(_xlfn.UNIQUE(_xlfn._xlws.FILTER(Data[Unit No],\nIF(ISBLANK('Interdependent Data Validation'!$F14),1,(Data[Quarter]='Interdependent Data Validation'!$F14)*1)\n*IF(ISBLANK('Interdependent Data Validation'!$G14),1,(Data[Division]='Interdependent Data Validation'!$G14)*1)\n*IF(ISBLANK('Interdependent Data Validation'!$I14),1,(Data[Manager]='Interdependent Data Validation'!$I14)*1)))))","v":55}]
[null,null,null,null,3,{"$f":"TRANSPOSE(_xlfn._xlws.SORT(_xlfn.UNIQUE(_xlfn._xlws.FILTER(Data[Unit No],\nIF(ISBLANK('Interdependent Data Validation'!$F15),1,(Data[Quarter]='Interdependent Data Validation'!$F15)*1)\n*IF(ISBLANK('Interdependent Data Validation'!$G15),1,(Data[Division]='Interdependent Data Validation'!$G15)*1)\n*IF(ISBLANK('Interdependent Data Validation'!$I15),1,(Data[Manager]='Interdependent Data Validation'!$I15)*1)))))","v":76}]
{"$rows_left_out":8}
{"sheet":"Manager Data Validation","index":10,"n_rows":22,"n_cols":105,"rows_kept":22,"cut":false,"hidden":false,"merged":[[2,0,2,4]]}
[{"$f":"IF(ISERROR(RIGHT(CELL(\"filename\",A1),LEN(CELL(\"filename\",A1))-FIND(\"]\",CELL(\"filename\",A1)))),\n\"\",\nRIGHT(CELL(\"filename\",A1),LEN(CELL(\"filename\",A1))-FIND(\"]\",CELL(\"filename\",A1))))","v":"Manager Data Validation"}]
[{"$f":"Model_Name","v":"SP Examples of Dependent Data Validation.xlsm"}]
["Navigator"]
[null,null,null,null,"Error Checks:",null,null,null,{"$f":"Overall_Error_Check","v":0}]
[]
[null,{"$f":"MAX($B$5:$B5)+1","v":1},"Workings"]
[]
[null,null,"For Calculation"]
[]
[null,null,null,{"$f":"A1","v":"Manager Data Validation"}]
[]
[null,null,null,null,"#"]
[null,null,null,null,{"$f":"N($E12)+1","v":1},{"$f":"TRANSPOSE(_xlfn._xlws.SORT(_xlfn.UNIQUE(_xlfn._xlws.FILTER(Data[Manager],\nIF(ISBLANK('Interdependent Data Validation'!$F13),1,(Data[Quarter]='Interdependent Data Validation'!$F13)*1)\n*IF(ISBLANK('Interdependent Data Validation'!$G13),1,(Data[Division]='Interdependent Data Validation'!$G13)*1)\n*IF(ISBLANK('Interdependent Data Validation'!$H13),1,(Data[Unit No]='Interdependent Data Validation'!$H13)*1)\n))))","v":"Erin Johns"},"Everett Gill"]
[null,null,null,null,{"$f":"N($E13)+1","v":2},{"$f":"TRANSPOSE(_xlfn._xlws.SORT(_xlfn.UNIQUE(_xlfn._xlws.FILTER(Data[Manager],\nIF(ISBLANK('Interdependent Data Validation'!$F14),1,(Data[Quarter]='Interdependent Data Validation'!$F14)*1)\n*IF(ISBLANK('Interdependent Data Validation'!$G14),1,(Data[Division]='Interdependent Data Validation'!$G14)*1)\n*IF(ISBLANK('Interdependent Data Validation'!$H14),1,(Data[Unit No]='Interdependent Data Validation'!$H14)*1)\n))))","v":"Catalina Richards"},"Christopher Bates","Dixie Stanton","Douglas Barry","Ishaan Hardy","Jasmine Newton","Laura Barrett","Maren Sweeney","Savanna Dixon","Shaniya Franklin"]
[null,null,null,null,3,{"$f":"TRANSPOSE(_xlfn._xlws.SORT(_xlfn.UNIQUE(_xlfn._xlws.FILTER(Data[Manager],\nIF(ISBLANK('Interdependent Data Validation'!$F15),1,(Data[Quarter]='Interdependent Data Validation'!$F15)*1)\n*IF(ISBLANK('Interdependent Data Validation'!$G15),1,(Data[Division]='Interdependent Data Validation'!$G15)*1)\n*IF(ISBLANK('Interdependent Data Validation'!$H15),1,(Data[Unit No]='Interdependent Data Validation'!$H15)*1)\n))))","v":"Amber Spence"},"Carter Obrien","Everett Gill","Tyler Lynch"]
{"$rows_left_out":8}
{"sheet":"Error Checks","index":11,"n_rows":17,"n_cols":9,"rows_kept":17,"cut":false,"hidden":false,"merged":[[0,8,0,9],[2,0,2,4]]}
[{"$f":"IF(ISERROR(RIGHT(CELL(\"filename\",A1),LEN(CELL(\"filename\",A1))-FIND(\"]\",CELL(\"filename\",A1)))),\n\"\",\nRIGHT(CELL(\"filename\",A1),LEN(CELL(\"filename\",A1))-FIND(\"]\",CELL(\"filename\",A1))))","v":"Error Checks"}]
[{"$f":"Model_Name","v":"SP Examples of Dependent Data Validation.xlsm"}]
["Navigator"]
[null,"Error Checks:",null,null,null,{"$f":"Overall_Error_Check","v":0}]
[]
[null,{"$f":"MAX($B$5:$B5)+1","v":1},"Error Checks"]
[]
[null,null,"Summary of Errors"]
[]
[null,null,null,"Assumptions"]
[]
[null,null,null,null,"Hierarchical Data Validation OK",null,null,null,{"$f":"HL_Hierarchical_Data_Validation_OK","v":0}]
[null,null,null,null,"Interpendent Data Validation OK",null,null,null,{"$f":"HL_Input_Error","v":0}]
[]
[]
{"$rows_left_out":2}