{"text_format":"1","workbook":"xlsx","n_sheets":13,"sheets":["Cover","Navigator","Style Guide","Model Parameters","First List","Second List","Third List","Fourth List","Fifth List","Lookup Data","Summary Table","PivotTable Result","Error Checks"],"not_rendered":{"charts":0,"images":1,"macros":1,"external_links":0,"defined_names":39,"comments":0,"pivot_tables":1},"unopened":[],"bounds":{"document_bytes":16777216,"sheet_cells":100000,"rows_first":2000,"rows_last":500,"rows_between":2000,"halvings":0,"cell_chars":16384,"cell_head_chars":4096},"cells_cut":0,"cells_raw":0,"read":"whole","date_system":"1900"}

{"sheet":"Cover","index":0,"n_rows":22,"n_cols":7,"rows_kept":22,"cut":false,"hidden":false,"merged":[[16,2,16,9],[17,2,17,9],[20,6,20,8],[21,6,21,8]]}
[]
[]
["Navigator"]
[]
[null,null,{"$f":"Client_Name","v":"SumProduct Pty Ltd"}]
[null,null,{"$f":"Model_Name","v":"SP - Comparing Lists.xlsm"}]
[]
[]
[]
[]
[]
[]
[]
[null,null,"Primary Developer:  Liam Bastick"]
[]
[null,null,"General Cover Notes:"]
[null,null,"How to compare lists using PivotTables."]
[]
[]
[]
{"$rows_left_out":3}
{"sheet":"Navigator","index":1,"n_rows":20,"n_cols":7,"rows_kept":20,"cut":false,"hidden":false,"merged":[]}
["Navigator"]
[{"$f":"Model_Name","v":"SP - Comparing Lists.xlsm"}]
["Navigator"]
[null,null,null,null,"Error Checks:",null,{"$f":"Overall_Error_Check","v":0}]
[]
[]
[null,1,"Table of Contents"]
[]
[null,null,null,null,null,"Cover"]
[null,null,null,null,null,"Style Guide"]
[null,null,null,null,null,"Model Parameters"]
[null,null,null,null,null,"First List"]
[null,null,null,null,null,"Second List"]
[null,null,null,null,null,"Third List"]
[null,null,null,null,null,"Fourth List"]
[null,null,null,null,null,"Fifth List"]
[null,null,null,null,null,"Lookup Data"]
[null,null,null,null,null,"Summary Table"]
[null,null,null,null,null,"PivotTable Result"]
[null,null,null,null,null,"Error Checks"]
{"$rows_left_out":1}
{"sheet":"Style Guide","index":2,"n_rows":74,"n_cols":11,"rows_kept":74,"cut":false,"hidden":false,"merged":[[80,2,80,6],[74,2,74,6],[75,2,75,6],[76,2,76,6],[77,2,77,6],[78,2,78,6],[79,2,79,6],[73,2,73,6],[62,2,62,6],[63,2,63,6],[64,2,64,6],[65,2,65,6],[66,2,66,6],[67,2,67,6],[68,2,68,6],[69,2,69,6],[70,2,70,6],[71,2,71,6],[72,2,72,6],[61,2,61,6],[47,2,47,6],[48,2,48,6],[49,2,49,6],[50,2,50,6],[51,2,51,6],[52,2,52,6],[53,2,53,6],[54,2,54,6],[57,2,57,6],[59,2,59,6],[60,2,60,6],[46,2,46,6],[35,2,35,6],[36,2,36,6],[37,2,37,6],[38,2,38,6],[39,2,39,6],[40,2,40,6],[41,2,41,6],[42,2,42,6],[43,2,43,6],[44,2,44,6],[45,2,45,6],[34,2,34,6],[17,2,17,6],[18,2,18,6],[19,2,19,6],[24,2,24,6],[25,2,25,6],[26,2,26,6],[27,2,27,6],[28,2,28,6],[29,2,29,6],[30,2,30,6],[31,2,31,6],[16,2,16,6],[2,0,2,4],[7,2,7,6],[8,2,8,6],[9,2,9,6],[10,2,10,6],[11,2,11,6],[12,2,12,6],[13,2,13,6],[14,2,14,6],[15,2,15,6]]}
[{"$f":"IF(ISERROR(RIGHT(CELL(\"filename\",A1),LEN(CELL(\"filename\",A1))-FIND(\"]\",CELL(\"filename\",A1)))),\n\"\",\nRIGHT(CELL(\"filename\",A1),LEN(CELL(\"filename\",A1))-FIND(\"]\",CELL(\"filename\",A1))))","v":"Style Guide"}]
[{"$f":"Model_Name","v":"SP - Comparing Lists.xlsm"}]
["Navigator"]
[null,null,null,null,"Error Checks:",null,null,null,{"$f":"Overall_Error_Check","v":0}]
[]
[null,{"$f":"MAX($B$5:$B5)+1","v":1},"Formatting of Headers / Dividers"]
[]
[null,null,"Description",null,null,null,null,null,"Display",null,"Style Name"]
[]
[null,null,"Sheet Title",null,null,null,null,null,{"$f":"C10","v":"Sheet Title"},null,"Sheet Title"]
[null,null,"Model Name",null,null,null,null,null,{"$f":"C11","v":"Model Name"},null,"Model Name"]
[]
[null,null,"Header 1",null,null,null,null,null,{"$f":"C13","v":"Header 1"},null,"Header 1"]
[null,null,"Header 2",null,null,null,null,null,{"$f":"C14","v":"Header 2"},null,"Header 2"]
[null,null,"Header 3",null,null,null,null,null,{"$f":"C15","v":"Header 3"},null,"Header 3"]
[null,null,"Header 4",null,null,null,null,null,{"$f":"C16","v":"Header 4"},null,"Header 4"]
[]
[null,null,"Notes",null,null,null,null,null,{"$f":"C18","v":"Notes"},null,"Notes"]
[]
[null,null,"Table Heading",null,null,null,null,null,{"$f":"C20","v":"Table Heading"},null,"Table Heading"]
{"$rows_left_out":55}
{"sheet":"Model Parameters","index":3,"n_rows":31,"n_cols":9,"rows_kept":31,"cut":false,"hidden":false,"merged":[[0,9,0,10],[2,0,2,4],[10,6,10,13],[11,6,11,13]]}
[{"$f":"IF(ISERROR(RIGHT(CELL(\"filename\",A1),LEN(CELL(\"filename\",A1))-FIND(\"]\",CELL(\"filename\",A1)))),\n\"\",\nRIGHT(CELL(\"filename\",A1),LEN(CELL(\"filename\",A1))-FIND(\"]\",CELL(\"filename\",A1))))","v":"Model Parameters"}]
[{"$f":"Model_Name","v":"SP - Comparing Lists.xlsm"}]
["Navigator"]
[null,null,null,null,"Error Checks:",null,null,null,{"$f":"Overall_Error_Check","v":0}]
[]
[null,{"$f":"MAX($B$5:$B5)+1","v":1},"General"]
[]
[null,null,"Key Inputs"]
[]
[null,null,null,null,"General"]
[null,null,null,null,"Model Name",null,{"$f":"IF(ISERROR(OR(FIND(\"[\",CELL(\"filename\",A1)),FIND(\"]\",CELL(\"filename\",A1)))),\"\",MID(CELL(\"filename\",A1),FIND(\"[\",CELL(\"filename\",A1))+1,FIND(\"]\",CELL(\"filename\",A1))-FIND(\"[\",CELL(\"filename\",A1))-1))","v":"SP - Comparing Lists.xlsm"}]
[null,null,null,null,"Client Name",null,"SumProduct Pty Ltd"]
[]
[]
[null,{"$f":"MAX($B$5:$B14)+1","v":2},"General Range Names"]
[]
[null,null,"Technical Assumptions"]
[]
[null,null,null,null,"Days in Year",null,365]
[null,null,null,null,"Months in Month",null,1]
{"$rows_left_out":12}
{"sheet":"First List","index":4,"n_rows":22,"n_cols":8,"rows_kept":22,"cut":false,"hidden":false,"merged":[[2,0,2,4]]}
[{"$f":"IF(ISERROR(RIGHT(CELL(\"filename\",A1),LEN(CELL(\"filename\",A1))-FIND(\"]\",CELL(\"filename\",A1)))),\n\"\",\nRIGHT(CELL(\"filename\",A1),LEN(CELL(\"filename\",A1))-FIND(\"]\",CELL(\"filename\",A1))))","v":"First List"}]
[{"$f":"Model_Name","v":"SP - Comparing Lists.xlsm"}]
["Navigator"]
[null,"Error Checks:",null,null,null,{"$f":"Overall_Error_Check","v":0}]
[]
[null,{"$f":"MAX($B$5:$B5)+1","v":1},{"$f":"A1","v":"First List"}]
[]
[null,null,"Table 1"]
[]
[null,null,null,"Input Data"]
[]
[null,null,null,null,null,null,"Counter","Colour"]
[null,null,null,null,null,null,{"$f":"SUBTOTAL(3,INDEX(First_Table[Colour],1):First_Table[[#This Row],[Colour]])","v":1},"Red"]
[null,null,null,null,null,null,{"$f":"SUBTOTAL(3,INDEX(First_Table[Colour],1):First_Table[[#This Row],[Colour]])","v":2},"Orange"]
[null,null,null,null,null,null,{"$f":"SUBTOTAL(3,INDEX(First_Table[Colour],1):First_Table[[#This Row],[Colour]])","v":3},"Indigo"]
[null,null,null,null,null,null,{"$f":"SUBTOTAL(3,INDEX(First_Table[Colour],1):First_Table[[#This Row],[Colour]])","v":4},"Green"]
[null,null,null,null,null,null,{"$f":"SUBTOTAL(3,INDEX(First_Table[Colour],1):First_Table[[#This Row],[Colour]])","v":5},"Pink"]
[null,null,null,null,null,null,{"$f":"SUBTOTAL(3,INDEX(First_Table[Colour],1):First_Table[[#This Row],[Colour]])","v":6},"White"]
[null,null,null,null,null,null,{"$f":"SUBTOTAL(3,INDEX(First_Table[Colour],1):First_Table[[#This Row],[Colour]])","v":7},"Black"]
[null,null,null,null,null,null,{"$f":"SUBTOTAL(3,INDEX(First_Table[Colour],1):First_Table[[#This Row],[Colour]])","v":8},"Orange"]
{"$rows_left_out":3}
{"sheet":"Second List","index":5,"n_rows":24,"n_cols":8,"rows_kept":24,"cut":false,"hidden":false,"merged":[[2,0,2,4]]}
[{"$f":"IF(ISERROR(RIGHT(CELL(\"filename\",A1),LEN(CELL(\"filename\",A1))-FIND(\"]\",CELL(\"filename\",A1)))),\n\"\",\nRIGHT(CELL(\"filename\",A1),LEN(CELL(\"filename\",A1))-FIND(\"]\",CELL(\"filename\",A1))))","v":"Second List"}]
[{"$f":"Model_Name","v":"SP - Comparing Lists.xlsm"}]
["Navigator"]
[null,"Error Checks:",null,null,null,{"$f":"Overall_Error_Check","v":0}]
[]
[null,{"$f":"MAX($B$5:$B5)+1","v":1},{"$f":"A1","v":"Second List"}]
[]
[null,null,"Table 2"]
[]
[null,null,null,"Input Data"]
[]
[null,null,null,null,null,null,"Counter","Colour"]
[null,null,null,null,null,null,{"$f":"MAX(First_Table[Counter])+SUBTOTAL(3,INDEX(Second_Table[Colour],1):Second_Table[[#This Row],[Colour]])","v":11},"Yellow"]
[null,null,null,null,null,null,{"$f":"MAX(First_Table[Counter])+SUBTOTAL(3,INDEX(Second_Table[Colour],1):Second_Table[[#This Row],[Colour]])","v":12},"Indigo"]
[null,null,null,null,null,null,{"$f":"MAX(First_Table[Counter])+SUBTOTAL(3,INDEX(Second_Table[Colour],1):Second_Table[[#This Row],[Colour]])","v":13},"Black"]
[null,null,null,null,null,null,{"$f":"MAX(First_Table[Counter])+SUBTOTAL(3,INDEX(Second_Table[Colour],1):Second_Table[[#This Row],[Colour]])","v":14},"Pink"]
[null,null,null,null,null,null,{"$f":"MAX(First_Table[Counter])+SUBTOTAL(3,INDEX(Second_Table[Colour],1):Second_Table[[#This Row],[Colour]])","v":15},"Cyan"]
[null,null,null,null,null,null,{"$f":"MAX(First_Table[Counter])+SUBTOTAL(3,INDEX(Second_Table[Colour],1):Second_Table[[#This Row],[Colour]])","v":16},"White"]
[null,null,null,null,null,null,{"$f":"MAX(First_Table[Counter])+SUBTOTAL(3,INDEX(Second_Table[Colour],1):Second_Table[[#This Row],[Colour]])","v":17},"Blue"]
[null,null,null,null,null,null,{"$f":"MAX(First_Table[Counter])+SUBTOTAL(3,INDEX(Second_Table[Colour],1):Second_Table[[#This Row],[Colour]])","v":18},"Brown"]
{"$rows_left_out":5}
{"sheet":"Third List","index":6,"n_rows":19,"n_cols":8,"rows_kept":19,"cut":false,"hidden":false,"merged":[[2,0,2,4]]}
[{"$f":"IF(ISERROR(RIGHT(CELL(\"filename\",A1),LEN(CELL(\"filename\",A1))-FIND(\"]\",CELL(\"filename\",A1)))),\n\"\",\nRIGHT(CELL(\"filename\",A1),LEN(CELL(\"filename\",A1))-FIND(\"]\",CELL(\"filename\",A1))))","v":"Third List"}]
[{"$f":"Model_Name","v":"SP - Comparing Lists.xlsm"}]
["Navigator"]
[null,"Error Checks:",null,null,null,{"$f":"Overall_Error_Check","v":0}]
[]
[null,{"$f":"MAX($B$5:$B5)+1","v":1},{"$f":"A1","v":"Third List"}]
[]
[null,null,"Table 3"]
[]
[null,null,null,"Input Data"]
[]
[null,null,null,null,null,null,"Counter","Colour"]
[null,null,null,null,null,null,{"$f":"MAX(Second_Table[Counter])+SUBTOTAL(3,INDEX(Third_Table[Colour],1):Third_Table[[#This Row],[Colour]])","v":23},"Red"]
[null,null,null,null,null,null,{"$f":"MAX(Second_Table[Counter])+SUBTOTAL(3,INDEX(Third_Table[Colour],1):Third_Table[[#This Row],[Colour]])","v":24},"Orange"]
[null,null,null,null,null,null,{"$f":"MAX(Second_Table[Counter])+SUBTOTAL(3,INDEX(Third_Table[Colour],1):Third_Table[[#This Row],[Colour]])","v":25},"Black"]
[null,null,null,null,null,null,{"$f":"MAX(Second_Table[Counter])+SUBTOTAL(3,INDEX(Third_Table[Colour],1):Third_Table[[#This Row],[Colour]])","v":26},"Yellow"]
[null,null,null,null,null,null,{"$f":"MAX(Second_Table[Counter])+SUBTOTAL(3,INDEX(Third_Table[Colour],1):Third_Table[[#This Row],[Colour]])","v":27},"Indigo"]
[null,null,null,null,null,null,{"$f":"MAX(Second_Table[Counter])+SUBTOTAL(3,INDEX(Third_Table[Colour],1):Third_Table[[#This Row],[Colour]])","v":28},"Blue"]
[null,null,null,null,null,null,{"$f":"MAX(Second_Table[Counter])+SUBTOTAL(3,INDEX(Third_Table[Colour],1):Third_Table[[#This Row],[Colour]])","v":29},"Green"]

{"sheet":"Fourth List","index":7,"n_rows":22,"n_cols":8,"rows_kept":22,"cut":false,"hidden":false,"merged":[[2,0,2,4]]}
[{"$f":"IF(ISERROR(RIGHT(CELL(\"filename\",A1),LEN(CELL(\"filename\",A1))-FIND(\"]\",CELL(\"filename\",A1)))),\n\"\",\nRIGHT(CELL(\"filename\",A1),LEN(CELL(\"filename\",A1))-FIND(\"]\",CELL(\"filename\",A1))))","v":"Fourth List"}]
[{"$f":"Model_Name","v":"SP - Comparing Lists.xlsm"}]
["Navigator"]
[null,"Error Checks:",null,null,null,{"$f":"Overall_Error_Check","v":0}]
[]
[null,{"$f":"MAX($B$5:$B5)+1","v":1},{"$f":"A1","v":"Fourth List"}]
[]
[null,null,"Table 4"]
[]
[null,null,null,"Input Data"]
[]
[null,null,null,null,null,null,"Counter","Colour"]
[null,null,null,null,null,null,{"$f":"MAX(Third_Table[Counter])+SUBTOTAL(3,INDEX(Fourth_Table[Colour],1):Fourth_Table[[#This Row],[Colour]])","v":30},"Violet"]
[null,null,null,null,null,null,{"$f":"MAX(Third_Table[Counter])+SUBTOTAL(3,INDEX(Fourth_Table[Colour],1):Fourth_Table[[#This Row],[Colour]])","v":31},"White"]
[null,null,null,null,null,null,{"$f":"MAX(Third_Table[Counter])+SUBTOTAL(3,INDEX(Fourth_Table[Colour],1):Fourth_Table[[#This Row],[Colour]])","v":32},"Pink"]
[null,null,null,null,null,null,{"$f":"MAX(Third_Table[Counter])+SUBTOTAL(3,INDEX(Fourth_Table[Colour],1):Fourth_Table[[#This Row],[Colour]])","v":33},"Magenta"]
[null,null,null,null,null,null,{"$f":"MAX(Third_Table[Counter])+SUBTOTAL(3,INDEX(Fourth_Table[Colour],1):Fourth_Table[[#This Row],[Colour]])","v":34},"Red"]
[null,null,null,null,null,null,{"$f":"MAX(Third_Table[Counter])+SUBTOTAL(3,INDEX(Fourth_Table[Colour],1):Fourth_Table[[#This Row],[Colour]])","v":35},"Green"]
[null,null,null,null,null,null,{"$f":"MAX(Third_Table[Counter])+SUBTOTAL(3,INDEX(Fourth_Table[Colour],1):Fourth_Table[[#This Row],[Colour]])","v":36},"Orange"]
[null,null,null,null,null,null,{"$f":"MAX(Third_Table[Counter])+SUBTOTAL(3,INDEX(Fourth_Table[Colour],1):Fourth_Table[[#This Row],[Colour]])","v":37},"Blue"]
{"$rows_left_out":3}
{"sheet":"Fifth List","index":8,"n_rows":26,"n_cols":8,"rows_kept":26,"cut":false,"hidden":false,"merged":[[2,0,2,4]]}
[{"$f":"IF(ISERROR(RIGHT(CELL(\"filename\",A1),LEN(CELL(\"filename\",A1))-FIND(\"]\",CELL(\"filename\",A1)))),\n\"\",\nRIGHT(CELL(\"filename\",A1),LEN(CELL(\"filename\",A1))-FIND(\"]\",CELL(\"filename\",A1))))","v":"Fifth List"}]
[{"$f":"Model_Name","v":"SP - Comparing Lists.xlsm"}]
["Navigator"]
[null,"Error Checks:",null,null,null,{"$f":"Overall_Error_Check","v":0}]
[]
[null,{"$f":"MAX($B$5:$B5)+1","v":1},{"$f":"A1","v":"Fifth List"}]
[]
[null,null,"Table 5"]
[]
[null,null,null,"Input Data"]
[]
[null,null,null,null,null,null,"Counter","Colour"]
[null,null,null,null,null,null,{"$f":"MAX(Fourth_Table[Counter])+SUBTOTAL(3,INDEX(Fifth_Table[Colour],1):Fifth_Table[[#This Row],[Colour]])","v":40},"Red"]
[null,null,null,null,null,null,{"$f":"MAX(Fourth_Table[Counter])+SUBTOTAL(3,INDEX(Fifth_Table[Colour],1):Fifth_Table[[#This Row],[Colour]])","v":41},"Orange"]
[null,null,null,null,null,null,{"$f":"MAX(Fourth_Table[Counter])+SUBTOTAL(3,INDEX(Fifth_Table[Colour],1):Fifth_Table[[#This Row],[Colour]])","v":42},"Yellow"]
[null,null,null,null,null,null,{"$f":"MAX(Fourth_Table[Counter])+SUBTOTAL(3,INDEX(Fifth_Table[Colour],1):Fifth_Table[[#This Row],[Colour]])","v":43},"Green"]
[null,null,null,null,null,null,{"$f":"MAX(Fourth_Table[Counter])+SUBTOTAL(3,INDEX(Fifth_Table[Colour],1):Fifth_Table[[#This Row],[Colour]])","v":44},"Blue"]
[null,null,null,null,null,null,{"$f":"MAX(Fourth_Table[Counter])+SUBTOTAL(3,INDEX(Fifth_Table[Colour],1):Fifth_Table[[#This Row],[Colour]])","v":45},"Indigo"]
[null,null,null,null,null,null,{"$f":"MAX(Fourth_Table[Counter])+SUBTOTAL(3,INDEX(Fifth_Table[Colour],1):Fifth_Table[[#This Row],[Colour]])","v":46},"Violet"]
[null,null,null,null,null,null,{"$f":"MAX(Fourth_Table[Counter])+SUBTOTAL(3,INDEX(Fifth_Table[Colour],1):Fifth_Table[[#This Row],[Colour]])","v":47},"Black"]
{"$rows_left_out":7}
{"sheet":"Lookup Data","index":9,"n_rows":17,"n_cols":9,"rows_kept":17,"cut":false,"hidden":false,"merged":[[2,0,2,4]]}
[{"$f":"IF(ISERROR(RIGHT(CELL(\"filename\",A1),LEN(CELL(\"filename\",A1))-FIND(\"]\",CELL(\"filename\",A1)))),\n\"\",\nRIGHT(CELL(\"filename\",A1),LEN(CELL(\"filename\",A1))-FIND(\"]\",CELL(\"filename\",A1))))","v":"Lookup Data"}]
[{"$f":"Model_Name","v":"SP - Comparing Lists.xlsm"}]
["Navigator"]
[null,"Error Checks:",null,null,null,{"$f":"Overall_Error_Check","v":0}]
[]
[null,{"$f":"MAX($B$5:$B5)+1","v":1},{"$f":"A1","v":"Lookup Data"}]
[]
[null,null,"Table Search"]
[]
[null,null,null,"Input Data"]
[]
[null,null,null,null,null,"Table","Min","Max","Table Name"]
[null,null,null,null,null,1,{"$f":"MIN(First_Table[Counter])","v":1},{"$f":"MAX(First_Table[Counter])","v":10},{"$f":"'First List'!C8","v":"Table 1"}]
[null,null,null,null,null,2,{"$f":"MIN(Second_Table[Counter])","v":11},{"$f":"MAX(Second_Table[Counter])","v":22},{"$f":"'Second List'!C8","v":"Table 2"}]
[null,null,null,null,null,3,{"$f":"MIN(Third_Table[Counter])","v":23},{"$f":"MAX(Third_Table[Counter])","v":29},{"$f":"'Third List'!C8","v":"Table 3"}]
[null,null,null,null,null,4,{"$f":"MIN(Fourth_Table[Counter])","v":30},{"$f":"MAX(Fourth_Table[Counter])","v":39},{"$f":"'Fourth List'!C8","v":"Table 4"}]
[null,null,null,null,null,5,{"$f":"MIN(Fifth_Table[Counter])","v":40},{"$f":"MAX(Fifth_Table[Counter])","v":53},{"$f":"'Fifth List'!C8","v":"Table 5"}]

{"sheet":"Summary Table","index":10,"n_rows":75,"n_cols":11,"rows_kept":75,"cut":false,"hidden":false,"merged":[[2,0,2,4]]}
[{"$f":"IF(ISERROR(RIGHT(CELL(\"filename\",A1),LEN(CELL(\"filename\",A1))-FIND(\"]\",CELL(\"filename\",A1)))),\n\"\",\nRIGHT(CELL(\"filename\",A1),LEN(CELL(\"filename\",A1))-FIND(\"]\",CELL(\"filename\",A1))))","v":"Summary Table"}]
[{"$f":"Model_Name","v":"SP - Comparing Lists.xlsm"}]
["Navigator"]
[null,"Error Checks:",null,null,null,{"$f":"Overall_Error_Check","v":0}]
[]
[null,{"$f":"MAX($B$5:$B5)+1","v":1},{"$f":"A1","v":"Summary Table"}]
[]
[null,null,"Non-Power Query Approach"]
[]
[null,null,null,"Consolidated Summary"]
[]
[null,null,null,null,null,"Max Counter",null,{"$f":"MAX('Lookup Data'!G13:H17)","v":53},{"$f":"(MAX(Summary_Table[Counter])<>H12)*1","v":0}]
[]
[]
[null,null,null,null,null,null,null,"Counter","Table Number","Colour","Table Name"]
[null,null,null,null,null,null,null,{"$f":"IF(MAX($H$15:$H15)=$H$12,\"\",N(H15)+1)","v":1},{"$f":"IF(Summary_Table[[#This Row],[Counter]]=\"\",\"\",LOOKUP(Summary_Table[[#This Row],[Counter]],Table_Summary[Min],Table_Summary[Table]))","v":1},{"$f":"IF(Summary_Table[[#This Row],[Counter]]=\"\",\"\",\nLOOKUP(Summary_Table[[#This Row],[Counter]],CHOOSE(Summary_Table[[#This Row],[Table Number]],First_Table[Counter],Second_Table[Counter],Third_Table[Counter],Fourth_Table[Counter],Fifth_Table[Counter]),\nCHOOSE(Summary_Table[[#This Row],[Table Number]],First_Table[Colour],Second_Table[Colour],Third_Table[Colour],Fourth_Table[Colour],Fifth_Table[Colour])))","v":"Red"},{"$f":"IF(Summary_Table[[#This Row],[Counter]]=\"\",\"\",INDEX('Lookup Data'!$I$13:$I$17,Summary_Table[[#This Row],[Table Number]]))","v":"Table 1"}]
[null,null,null,null,null,null,null,{"$f":"IF(MAX($H$15:$H16)=$H$12,\"\",N(H16)+1)","v":2},{"$f":"IF(Summary_Table[[#This Row],[Counter]]=\"\",\"\",LOOKUP(Summary_Table[[#This Row],[Counter]],Table_Summary[Min],Table_Summary[Table]))","v":1},{"$f":"IF(Summary_Table[[#This Row],[Counter]]=\"\",\"\",\nLOOKUP(Summary_Table[[#This Row],[Counter]],CHOOSE(Summary_Table[[#This Row],[Table Number]],First_Table[Counter],Second_Table[Counter],Third_Table[Counter],Fourth_Table[Counter],Fifth_Table[Counter]),\nCHOOSE(Summary_Table[[#This Row],[Table Number]],First_Table[Colour],Second_Table[Colour],Third_Table[Colour],Fourth_Table[Colour],Fifth_Table[Colour])))","v":"Orange"},{"$f":"IF(Summary_Table[[#This Row],[Counter]]=\"\",\"\",INDEX('Lookup Data'!$I$13:$I$17,Summary_Table[[#This Row],[Table Number]]))","v":"Table 1"}]
[null,null,null,null,null,null,null,{"$f":"IF(MAX($H$15:$H17)=$H$12,\"\",N(H17)+1)","v":3},{"$f":"IF(Summary_Table[[#This Row],[Counter]]=\"\",\"\",LOOKUP(Summary_Table[[#This Row],[Counter]],Table_Summary[Min],Table_Summary[Table]))","v":1},{"$f":"IF(Summary_Table[[#This Row],[Counter]]=\"\",\"\",\nLOOKUP(Summary_Table[[#This Row],[Counter]],CHOOSE(Summary_Table[[#This Row],[Table Number]],First_Table[Counter],Second_Table[Counter],Third_Table[Counter],Fourth_Table[Counter],Fifth_Table[Counter]),\nCHOOSE(Summary_Table[[#This Row],[Table Number]],First_Table[Colour],Second_Table[Colour],Third_Table[Colour],Fourth_Table[Colour],Fifth_Table[Colour])))","v":"Indigo"},{"$f":"IF(Summary_Table[[#This Row],[Counter]]=\"\",\"\",INDEX('Lookup Data'!$I$13:$I$17,Summary_Table[[#This Row],[Table Number]]))","v":"Table 1"}]
[null,null,null,null,null,null,null,{"$f":"IF(MAX($H$15:$H18)=$H$12,\"\",N(H18)+1)","v":4},{"$f":"IF(Summary_Table[[#This Row],[Counter]]=\"\",\"\",LOOKUP(Summary_Table[[#This Row],[Counter]],Table_Summary[Min],Table_Summary[Table]))","v":1},{"$f":"IF(Summary_Table[[#This Row],[Counter]]=\"\",\"\",\nLOOKUP(Summary_Table[[#This Row],[Counter]],CHOOSE(Summary_Table[[#This Row],[Table Number]],First_Table[Counter],Second_Table[Counter],Third_Table[Counter],Fourth_Table[Counter],Fifth_Table[Counter]),\nCHOOSE(Summary_Table[[#This Row],[Table Number]],First_Table[Colour],Second_Table[Colour],Third_Table[Colour],Fourth_Table[Colour],Fifth_Table[Colour])))","v":"Green"},{"$f":"IF(Summary_Table[[#This Row],[Counter]]=\"\",\"\",INDEX('Lookup Data'!$I$13:$I$17,Summary_Table[[#This Row],[Table Number]]))","v":"Table 1"}]
[null,null,null,null,null,null,null,{"$f":"IF(MAX($H$15:$H19)=$H$12,\"\",N(H19)+1)","v":5},{"$f":"IF(Summary_Table[[#This Row],[Counter]]=\"\",\"\",LOOKUP(Summary_Table[[#This Row],[Counter]],Table_Summary[Min],Table_Summary[Table]))","v":1},{"$f":"IF(Summary_Table[[#This Row],[Counter]]=\"\",\"\",\nLOOKUP(Summary_Table[[#This Row],[Counter]],CHOOSE(Summary_Table[[#This Row],[Table Number]],First_Table[Counter],Second_Table[Counter],Third_Table[Counter],Fourth_Table[Counter],Fifth_Table[Counter]),\nCHOOSE(Summary_Table[[#This Row],[Table Number]],First_Table[Colour],Second_Table[Colour],Third_Table[Colour],Fourth_Table[Colour],Fifth_Table[Colour])))","v":"Pink"},{"$f":"IF(Summary_Table[[#This Row],[Counter]]=\"\",\"\",INDEX('Lookup Data'!$I$13:$I$17,Summary_Table[[#This Row],[Table Number]]))","v":"Table 1"}]
{"$rows_left_out":56}
{"sheet":"PivotTable Result","index":11,"n_rows":43,"n_cols":12,"rows_kept":43,"cut":false,"hidden":false,"merged":[[2,0,2,4]]}
[{"$f":"IF(ISERROR(RIGHT(CELL(\"filename\",A1),LEN(CELL(\"filename\",A1))-FIND(\"]\",CELL(\"filename\",A1)))),\n\"\",\nRIGHT(CELL(\"filename\",A1),LEN(CELL(\"filename\",A1))-FIND(\"]\",CELL(\"filename\",A1))))","v":"PivotTable Result"}]
[{"$f":"Model_Name","v":"SP - Comparing Lists.xlsm"}]
["Navigator"]
[null,"Error Checks:",null,null,null,{"$f":"Overall_Error_Check","v":0}]
[]
[null,{"$f":"MAX($B$5:$B5)+1","v":1},{"$f":"A1","v":"PivotTable Result"}]
[]
[null,null,"Non-Power Query Approach"]
[]
[null,null,null,"Consolidated Summary"]
[]
[]
[]
[]
[]
[]
[]
[]
[]
[]
{"$rows_left_out":24}
{"sheet":"Error Checks","index":12,"n_rows":17,"n_cols":9,"rows_kept":17,"cut":false,"hidden":false,"merged":[[0,8,0,9],[2,0,2,4]]}
[{"$f":"IF(ISERROR(RIGHT(CELL(\"filename\",A1),LEN(CELL(\"filename\",A1))-FIND(\"]\",CELL(\"filename\",A1)))),\n\"\",\nRIGHT(CELL(\"filename\",A1),LEN(CELL(\"filename\",A1))-FIND(\"]\",CELL(\"filename\",A1))))","v":"Error Checks"}]
[{"$f":"Model_Name","v":"SP - Comparing Lists.xlsm"}]
["Navigator"]
[null,"Error Checks:",null,null,null,{"$f":"Overall_Error_Check","v":0}]
[]
[null,{"$f":"MAX($B$5:$B5)+1","v":1},"Error Checks"]
[]
[null,null,"Summary of Errors"]
[]
[null,null,null,"Assumptions"]
[]
[null,null,null,null,"No checks present",null,null,null,{"$f":"HL_Max_Check","v":0}]
[]
[]
[]
[]
[null,null,null,null,{"$f":"C8","v":"Summary of Errors"},null,null,null,{"$f":"MIN(1,SUM(I11:I15))","v":0}]