{"text_format":"1","workbook":"xlsx","n_sheets":14,"sheets":["Cover","Navigator","Style Guide","Model Parameters","General Assumptions","Calculations","Opening Balance Sheet","Income Statement","Balance Sheet","Cash Flow Statement","Timing","Lookup","Template Sheet","Error Checks"],"not_rendered":{"charts":0,"images":1,"macros":1,"external_links":0,"defined_names":333,"comments":0,"pivot_tables":0},"unopened":[],"bounds":{"document_bytes":16777216,"sheet_cells":100000,"rows_first":2000,"rows_last":500,"rows_between":2000,"halvings":0,"cell_chars":16384,"cell_head_chars":4096},"cells_cut":0,"cells_raw":0,"read":"whole","date_system":"1900"}

{"sheet":"Cover","index":0,"n_rows":22,"n_cols":7,"rows_kept":22,"cut":false,"hidden":false,"merged":[[16,2,16,9],[17,2,17,9],[20,6,20,8],[21,6,21,8]]}
[]
[]
["Navigator"]
[]
[null,null,{"$f":"Client_Name","v":"SumProduct Pty Limited"}]
[null,null,{"$f":"Model_Name","v":"Model 16 - Indirect Cash Flow Statement Completed.xlsm"}]
[]
[]
[]
[]
[]
[]
[]
[null,null,"Primary Developer:  Liam Bastick"]
[]
{"$rows_left_out":8}
{"sheet":"Navigator","index":1,"n_rows":21,"n_cols":7,"rows_kept":21,"cut":false,"hidden":false,"merged":[]}
["Navigator"]
[{"$f":"Model_Name","v":"Model 16 - Indirect Cash Flow Statement Completed.xlsm"}]
["Navigator"]
[null,null,null,null,"Error Checks:",null,{"$f":"Overall_Error_Check","v":0}]
[]
[]
[null,1,"Table of Contents"]
[]
[null,null,null,null,null,"Cover"]
[null,null,null,null,null,"Style Guide"]
[null,null,null,null,null,"Model Parameters"]
[null,null,null,null,null,"General Assumptions"]
[null,null,null,null,null,"Calculations"]
[null,null,null,null,null,"Opening Balance Sheet"]
[null,null,null,null,null,"Income Statement"]
{"$rows_left_out":7}
{"sheet":"Style Guide","index":2,"n_rows":74,"n_cols":11,"rows_kept":74,"cut":false,"hidden":false,"merged":[[80,2,80,6],[74,2,74,6],[75,2,75,6],[76,2,76,6],[77,2,77,6],[78,2,78,6],[79,2,79,6],[73,2,73,6],[62,2,62,6],[63,2,63,6],[64,2,64,6],[65,2,65,6],[66,2,66,6],[67,2,67,6],[68,2,68,6],[69,2,69,6],[70,2,70,6],[71,2,71,6],[72,2,72,6],[61,2,61,6],[47,2,47,6],[48,2,48,6],[49,2,49,6],[50,2,50,6],[51,2,51,6],[52,2,52,6],[53,2,53,6],[54,2,54,6],[57,2,57,6],[59,2,59,6],[60,2,60,6],[46,2,46,6],[35,2,35,6],[36,2,36,6],[37,2,37,6],[38,2,38,6],[39,2,39,6],[40,2,40,6],[41,2,41,6],[42,2,42,6],[43,2,43,6],[44,2,44,6],[45,2,45,6],[34,2,34,6],[17,2,17,6],[18,2,18,6],[19,2,19,6],[24,2,24,6],[25,2,25,6],[26,2,26,6],[27,2,27,6],[28,2,28,6],[29,2,29,6],[30,2,30,6],[31,2,31,6],[16,2,16,6],[2,0,2,4],[7,2,7,6],[8,2,8,6],[9,2,9,6],[10,2,10,6],[11,2,11,6],[12,2,12,6],[13,2,13,6],[14,2,14,6],[15,2,15,6]]}
[{"$f":"IF(ISERROR(RIGHT(CELL(\"filename\",A1),LEN(CELL(\"filename\",A1))-FIND(\"]\",CELL(\"filename\",A1)))),\n\"\",\nRIGHT(CELL(\"filename\",A1),LEN(CELL(\"filename\",A1))-FIND(\"]\",CELL(\"filename\",A1))))","v":"Style Guide"}]
[{"$f":"Model_Name","v":"Model 16 - Indirect Cash Flow Statement Completed.xlsm"}]
["Navigator"]
[null,null,null,null,"Error Checks:",null,null,null,{"$f":"Overall_Error_Check","v":0}]
[]
[null,{"$f":"MAX($B$5:$B5)+1","v":1},"Formatting of Headers / Dividers"]
[]
[null,null,"Description",null,null,null,null,null,"Display",null,"Style Name"]
[]
[null,null,"Sheet Title",null,null,null,null,null,{"$f":"C10","v":"Sheet Title"},null,"Sheet Title"]
[null,null,"Model Name",null,null,null,null,null,{"$f":"C11","v":"Model Name"},null,"Model Name"]
[]
[null,null,"Header 1",null,null,null,null,null,{"$f":"C13","v":"Header 1"},null,"Header 1"]
[null,null,"Header 2",null,null,null,null,null,{"$f":"C14","v":"Header 2"},null,"Header 2"]
[null,null,"Header 3",null,null,null,null,null,{"$f":"C15","v":"Header 3"},null,"Header 3"]
{"$rows_left_out":60}
{"sheet":"Model Parameters","index":3,"n_rows":61,"n_cols":9,"rows_kept":61,"cut":false,"hidden":false,"merged":[[0,9,0,10],[2,0,2,4],[11,6,11,13],[12,6,12,13]]}
[{"$f":"IF(ISERROR(RIGHT(CELL(\"filename\",A1),LEN(CELL(\"filename\",A1))-FIND(\"]\",CELL(\"filename\",A1)))),\n\"\",\nRIGHT(CELL(\"filename\",A1),LEN(CELL(\"filename\",A1))-FIND(\"]\",CELL(\"filename\",A1))))","v":"Model Parameters"}]
[{"$f":"Model_Name","v":"Model 16 - Indirect Cash Flow Statement Completed.xlsm"}]
["Navigator"]
[null,null,null,null,"Error Checks:",null,null,null,{"$f":"Overall_Error_Check","v":0}]
[]
[null,{"$f":"MAX($B$5:$B5)+1","v":1},"General"]
[]
[null,null,"Key Inputs"]
[]
[null,null,null,"General"]
[]
[null,null,null,null,"Model Name",null,{"$f":"IF(ISERROR(OR(FIND(\"[\",CELL(\"filename\",A1)),FIND(\"]\",CELL(\"filename\",A1)))),\"\",MID(CELL(\"filename\",A1),FIND(\"[\",CELL(\"filename\",A1))+1,FIND(\"]\",CELL(\"filename\",A1))-FIND(\"[\",CELL(\"filename\",A1))-1))","v":"Model 16 - Indirect Cash Flow Statement Completed.xlsm"}]
[null,null,null,null,"Client Name",null,"SumProduct Pty Limited"]
[]
[]
{"$rows_left_out":47}
{"sheet":"General Assumptions","index":4,"n_rows":138,"n_cols":29,"rows_kept":138,"cut":false,"hidden":false,"merged":[[0,8,0,9],[2,0,2,4]]}
[{"$f":"IF(ISERROR(RIGHT(CELL(\"filename\",A1),LEN(CELL(\"filename\",A1))-FIND(\"]\",CELL(\"filename\",A1)))),\n\"\",\nRIGHT(CELL(\"filename\",A1),LEN(CELL(\"filename\",A1))-FIND(\"]\",CELL(\"filename\",A1))))","v":"General Assumptions"}]
[{"$f":"Model_Name","v":"Model 16 - Indirect Cash Flow Statement Completed.xlsm"}]
["Navigator"]
[null,"Error Checks:",null,null,null,{"$f":"Overall_Error_Check","v":0}]
[null,null,null,null,null,null,null,null,null,{"$f":"_xlfn.ANCHORARRAY(Timing!J5)","v":"2025-06-30"},"2026-06-30","2027-06-30","2028-06-30","2029-06-30"]
[null,null,{"$f":"Timing!C6","v":"Start Date"},null,null,null,null,null,null,{"$f":"_xlfn.ANCHORARRAY(Timing!J6)","v":"2024-07-01"},"2025-07-01","2026-07-01","2027-07-01","2028-07-01"]
[null,null,"End Date",null,null,null,null,null,null,{"$f":"_xlfn.ANCHORARRAY(Timing!J7)","v":"2025-06-30"},"2026-06-30","2027-06-30","2028-06-30","2029-06-30"]
[null,null,"Number of Days",null,null,null,null,null,null,{"$f":"_xlfn.ANCHORARRAY(Timing!J8)","v":365},365,365,366,365]
[null,null,"Counter",null,null,null,null,null,null,{"$f":"_xlfn.ANCHORARRAY(Timing!J9)","v":1},2,3,4,5]
[]
[null,{"$f":"MAX($B$10:$B10)+1","v":1},{"$f":"A1","v":"General Assumptions"}]
[]
[null,null,"Revenue and related"]
[]
[null,null,null,"Sales"]
{"$rows_left_out":124}
{"sheet":"Calculations","index":5,"n_rows":408,"n_cols":31,"rows_kept":408,"cut":false,"hidden":false,"merged":[[0,8,0,9],[2,0,2,4]]}
[{"$f":"IF(ISERROR(RIGHT(CELL(\"filename\",A1),LEN(CELL(\"filename\",A1))-FIND(\"]\",CELL(\"filename\",A1)))),\n\"\",\nRIGHT(CELL(\"filename\",A1),LEN(CELL(\"filename\",A1))-FIND(\"]\",CELL(\"filename\",A1))))","v":"Calculations"}]
[{"$f":"Model_Name","v":"Model 16 - Indirect Cash Flow Statement Completed.xlsm"}]
["Navigator"]
[null,"Error Checks:",null,null,null,{"$f":"Overall_Error_Check","v":0}]
[null,null,null,null,null,null,null,null,null,{"$f":"_xlfn.ANCHORARRAY(Timing!J5)","v":"2025-06-30"},"2026-06-30","2027-06-30","2028-06-30","2029-06-30"]
[null,null,{"$f":"Timing!C6","v":"Start Date"},null,null,null,null,null,null,{"$f":"_xlfn.ANCHORARRAY(Timing!J6)","v":"2024-07-01"},"2025-07-01","2026-07-01","2027-07-01","2028-07-01"]
[null,null,"End Date",null,null,null,null,null,null,{"$f":"_xlfn.ANCHORARRAY(Timing!J7)","v":"2025-06-30"},"2026-06-30","2027-06-30","2028-06-30","2029-06-30"]
[null,null,"Number of Days",null,null,null,null,null,null,{"$f":"_xlfn.ANCHORARRAY(Timing!J8)","v":365},365,365,366,365]
[null,null,"Counter",null,null,null,null,null,null,{"$f":"_xlfn.ANCHORARRAY(Timing!J9)","v":1},2,3,4,5]
[]
[null,{"$f":"MAX($B$10:$B10)+1","v":1},{"$f":"A1","v":"Calculations"}]
[]
[null,null,{"$f":"'General Assumptions'!C13","v":"Revenue and related"}]
[null,null,null,null,null,null,null,null,null,null,null,null,null,null,null,{"$f":"IFERROR(_xlfn.FORMULATEXT(J14),\"\")","v":""}]
[null,null,null,{"$f":"'General Assumptions'!D15","v":"Sales"},null,null,null,null,null,null,null,null,null,null,null,""]
{"$rows_left_out":394}
{"sheet":"Opening Balance Sheet","index":6,"n_rows":58,"n_cols":11,"rows_kept":58,"cut":false,"hidden":false,"merged":[[0,8,0,9],[2,0,2,4]]}
[{"$f":"IF(ISERROR(RIGHT(CELL(\"filename\",A1),LEN(CELL(\"filename\",A1))-FIND(\"]\",CELL(\"filename\",A1)))),\n\"\",\nRIGHT(CELL(\"filename\",A1),LEN(CELL(\"filename\",A1))-FIND(\"]\",CELL(\"filename\",A1))))","v":"Opening Balance Sheet"}]
[{"$f":"Model_Name","v":"Model 16 - Indirect Cash Flow Statement Completed.xlsm"}]
["Navigator"]
[null,"Error Checks:",null,null,null,{"$f":"Overall_Error_Check","v":0}]
[null,null,null,null,null,null,null,null,{"$f":"Model_Start_Date-1","v":"2024-06-30"}]
[null,null,{"$f":"Timing!C6","v":"Start Date"}]
[null,null,"End Date"]
[null,null,"Number of Days"]
[null,null,"Counter"]
[]
[null,{"$f":"MAX($B$10:$B10)+1","v":1},{"$f":"A1","v":"Opening Balance Sheet"}]
[]
[null,null,"Current assets"]
[null,null,null,"Cash",null,null,{"$f":"Currency","v":"US$'000"},null,2500]
[null,null,null,"Accounts receivable",null,null,{"$f":"Currency","v":"US$'000"},null,50]
{"$rows_left_out":44}
{"sheet":"Income Statement","index":7,"n_rows":28,"n_cols":30,"rows_kept":28,"cut":false,"hidden":false,"merged":[]}
[{"$f":"IF(ISERROR(RIGHT(CELL(\"filename\",A1),LEN(CELL(\"filename\",A1))-FIND(\"]\",CELL(\"filename\",A1)))),\n\"\",\nRIGHT(CELL(\"filename\",A1),LEN(CELL(\"filename\",A1))-FIND(\"]\",CELL(\"filename\",A1))))","v":"Income Statement"}]
[{"$f":"Model_Name","v":"Model 16 - Indirect Cash Flow Statement Completed.xlsm"}]
["Navigator"]
[null,"Error Checks:",null,null,null,{"$f":"Overall_Error_Check","v":0}]
[null,null,null,null,null,null,null,null,null,{"$f":"_xlfn.ANCHORARRAY(Timing!J5)","v":"2025-06-30"},"2026-06-30","2027-06-30","2028-06-30","2029-06-30"]
[null,null,"Start Date",null,null,null,null,null,null,{"$f":"_xlfn.ANCHORARRAY(Timing!J6)","v":"2024-07-01"},"2025-07-01","2026-07-01","2027-07-01","2028-07-01"]
[null,null,"End Date",null,null,null,null,null,null,{"$f":"_xlfn.ANCHORARRAY(Timing!J7)","v":"2025-06-30"},"2026-06-30","2027-06-30","2028-06-30","2029-06-30"]
[null,null,"Number of Days",null,null,null,null,null,null,{"$f":"_xlfn.ANCHORARRAY(Timing!J8)","v":365},365,365,366,365]
[null,null,"Counter",null,null,null,null,null,null,{"$f":"_xlfn.ANCHORARRAY(Timing!J9)","v":1},2,3,4,5]
[]
[null,{"$f":"MAX($B$10:$B10)+1","v":1},{"$f":"A1","v":"Income Statement"}]
[]
[null,null,null,"Revenue",null,null,{"$f":"Currency","v":"US$'000"},null,null,{"$f":"_xlfn.ANCHORARRAY(Calculations!J36)","v":1500},3090,4820.4000000000005,6748.56,8941.8420000000006,null,null,null,null,null,null,null,null,null,null,null,null,null,null,null,{"$f":"IFERROR(_xlfn.FORMULATEXT(J13),\"\")","v":"=Calculations!J36#"}]
[null,null,null,"COGS",null,null,{"$f":"Currency","v":"US$'000"},null,null,{"$f":"-_xlfn.ANCHORARRAY(Calculations!J62)+_xlfn.ANCHORARRAY(Calculations!J142)","v":-1247.0944309927361},-2762.6326451185487,-3809.7593941942214,-5291.7670408924478,-7648.4347710261809,null,null,null,null,null,null,null,null,null,null,null,null,null,null,null,"=-Calculations!J62#+Calculations!J142#"]
[null,null,null,"Gross profit",null,null,{"$f":"Currency","v":"US$'000"},null,null,{"$f":"_xlfn.ANCHORARRAY(J13)+_xlfn.ANCHORARRAY(J14)","v":252.90556900726392},327.36735488145132,1010.6406058057792,1456.7929591075526,1293.4072289738197,null,null,null,null,null,null,null,null,null,null,null,null,null,null,null,"=J13#+J14#"]
{"$rows_left_out":14}
{"sheet":"Balance Sheet","index":8,"n_rows":58,"n_cols":30,"rows_kept":58,"cut":false,"hidden":false,"merged":[]}
[{"$f":"IF(ISERROR(RIGHT(CELL(\"filename\",A1),LEN(CELL(\"filename\",A1))-FIND(\"]\",CELL(\"filename\",A1)))),\n\"\",\nRIGHT(CELL(\"filename\",A1),LEN(CELL(\"filename\",A1))-FIND(\"]\",CELL(\"filename\",A1))))","v":"Balance Sheet"}]
[{"$f":"Model_Name","v":"Model 16 - Indirect Cash Flow Statement Completed.xlsm"}]
["Navigator"]
[null,"Error Checks:",null,null,null,{"$f":"Overall_Error_Check","v":0}]
[null,null,null,null,null,null,null,null,null,{"$f":"_xlfn.ANCHORARRAY(Timing!J5)","v":"2025-06-30"},"2026-06-30","2027-06-30","2028-06-30","2029-06-30"]
[null,null,"Start Date",null,null,null,null,null,null,{"$f":"_xlfn.ANCHORARRAY(Timing!J6)","v":"2024-07-01"},"2025-07-01","2026-07-01","2027-07-01","2028-07-01"]
[null,null,"End Date",null,null,null,null,null,null,{"$f":"_xlfn.ANCHORARRAY(Timing!J7)","v":"2025-06-30"},"2026-06-30","2027-06-30","2028-06-30","2029-06-30"]
[null,null,"Number of Days",null,null,null,null,null,null,{"$f":"_xlfn.ANCHORARRAY(Timing!J8)","v":365},365,365,366,365]
[null,null,"Counter",null,null,null,null,null,null,{"$f":"_xlfn.ANCHORARRAY(Timing!J9)","v":1},2,3,4,5]
[]
[null,{"$f":"MAX($B$10:$B10)+1","v":1},{"$f":"A1","v":"Balance Sheet"}]
[]
[null,null,"Current assets"]
[null,null,null,"Cash",null,null,{"$f":"Currency","v":"US$'000"},null,null,{"$f":"_xlfn.SCAN('Opening Balance Sheet'!I14,_xlfn.ANCHORARRAY('Cash Flow Statement'!J36),\n_xlfn.LAMBDA(_xlpm.accumulator,_xlpm.cash,_xlpm.accumulator+_xlpm.cash))","v":1719.5616438356162},19.948630136985912,1880.507534246575,3789.4859238239114,4170.3378736765417,null,null,null,null,null,null,null,null,null,null,null,null,null,null,null,{"$f":"IFERROR(_xlfn.FORMULATEXT(J14),\"\")","v":"=SCAN('Opening Balance Sheet'!I14,'Cash Flow Statement'!J36#,\nLAMBDA(accumulator,cash,accumulator+cash))"}]
[null,null,null,"Accounts receivable",null,null,{"$f":"Currency","v":"US$'000"},null,null,{"$f":"_xlfn.ANCHORARRAY(Calculations!J38)","v":246.57534246575344},507.94520547945206,792.39452054794538,1106.3213114754099,1469.8918356164384,null,null,null,null,null,null,null,null,null,null,null,null,null,null,null,"=Calculations!J38#"]
{"$rows_left_out":44}
{"sheet":"Cash Flow Statement","index":9,"n_rows":59,"n_cols":30,"rows_kept":59,"cut":false,"hidden":false,"merged":[]}
[{"$f":"IF(ISERROR(RIGHT(CELL(\"filename\",A1),LEN(CELL(\"filename\",A1))-FIND(\"]\",CELL(\"filename\",A1)))),\n\"\",\nRIGHT(CELL(\"filename\",A1),LEN(CELL(\"filename\",A1))-FIND(\"]\",CELL(\"filename\",A1))))","v":"Cash Flow Statement"}]
[{"$f":"Model_Name","v":"Model 16 - Indirect Cash Flow Statement Completed.xlsm"}]
["Navigator"]
[null,"Error Checks:",null,null,null,null,{"$f":"Overall_Error_Check","v":0}]
[null,null,null,null,null,null,null,null,null,{"$f":"_xlfn.ANCHORARRAY(Timing!J5)","v":"2025-06-30"},"2026-06-30","2027-06-30","2028-06-30","2029-06-30"]
[null,null,"Start Date",null,null,null,null,null,null,{"$f":"_xlfn.ANCHORARRAY(Timing!J6)","v":"2024-07-01"},"2025-07-01","2026-07-01","2027-07-01","2028-07-01"]
[null,null,"End Date",null,null,null,null,null,null,{"$f":"_xlfn.ANCHORARRAY(Timing!J7)","v":"2025-06-30"},"2026-06-30","2027-06-30","2028-06-30","2029-06-30"]
[null,null,"Number of Days",null,null,null,null,null,null,{"$f":"_xlfn.ANCHORARRAY(Timing!J8)","v":365},365,365,366,365]
[null,null,"Counter",null,null,null,null,null,null,{"$f":"_xlfn.ANCHORARRAY(Timing!J9)","v":1},2,3,4,5]
[]
[null,{"$f":"MAX($B$10:$B10)+1","v":1},{"$f":"A1","v":"Cash Flow Statement"}]
[]
[null,null,"Direct Cash Flow Statement"]
[]
[null,null,null,"Operating cash flow",null,null,null,null,null,null,null,null,null,null,null,{"$f":"IFERROR(_xlfn.FORMULATEXT(J15),\"\")","v":""}]
{"$rows_left_out":45}
{"sheet":"Timing","index":10,"n_rows":23,"n_cols":14,"rows_kept":23,"cut":false,"hidden":false,"merged":[[0,8,0,9],[2,0,2,4]]}
[{"$f":"IF(ISERROR(RIGHT(CELL(\"filename\",A1),LEN(CELL(\"filename\",A1))-FIND(\"]\",CELL(\"filename\",A1)))),\n\"\",\nRIGHT(CELL(\"filename\",A1),LEN(CELL(\"filename\",A1))-FIND(\"]\",CELL(\"filename\",A1))))","v":"Timing"}]
[{"$f":"Model_Name","v":"Model 16 - Indirect Cash Flow Statement Completed.xlsm"}]
["Navigator"]
[null,"Error Checks:",null,null,null,{"$f":"Overall_Error_Check","v":0}]
[null,null,null,null,null,null,null,null,null,{"$f":"_xlfn.ANCHORARRAY(J$7)","v":"2025-06-30"},"2026-06-30","2027-06-30","2028-06-30","2029-06-30"]
[null,null,"Start Date",null,null,null,null,null,null,{"$f":"IF(_xlfn.ANCHORARRAY(J$9)=1,Model_Start_Date,OFFSET(_xlfn.ANCHORARRAY(J7),,-1)+1)","v":"2024-07-01"},"2025-07-01","2026-07-01","2027-07-01","2028-07-01"]
[null,null,"End Date",null,null,null,null,null,null,{"$f":"EOMONTH(Model_Start_Date,\nMOD(Periodicity+Reporting_Month_Factor\n-MONTH(Model_Start_Date),Periodicity)+Periodicity*(_xlfn.ANCHORARRAY(J$9)-1))","v":"2025-06-30"},"2026-06-30","2027-06-30","2028-06-30","2029-06-30"]
[null,null,"Number of Days",null,null,null,null,null,null,{"$f":"_xlfn.ANCHORARRAY(J7)-_xlfn.ANCHORARRAY(J6)+1","v":365},365,365,366,365]
[null,null,"Counter",null,null,null,null,null,null,{"$f":"_xlfn.SEQUENCE(1,Number_of_Periods)","v":1},2,3,4,5]
[]
[null,{"$f":"MAX($B$10:$B10)+1","v":1},"Timing Assumptions"]
[]
[null,null,"Data (do not change once modelling has commenced)"]
[]
[null,null,null,"Number of Periods",null,null,null,5,null,null,"Number_of_Periods"]
{"$rows_left_out":9}
{"sheet":"Lookup","index":11,"n_rows":15,"n_cols":7,"rows_kept":15,"cut":false,"hidden":false,"merged":[[2,0,2,4]]}
[{"$f":"IF(ISERROR(RIGHT(CELL(\"filename\",A1),LEN(CELL(\"filename\",A1))-FIND(\"]\",CELL(\"filename\",A1)))),\n\"\",\nRIGHT(CELL(\"filename\",A1),LEN(CELL(\"filename\",A1))-FIND(\"]\",CELL(\"filename\",A1))))","v":"Lookup"}]
[{"$f":"Model_Name","v":"Model 16 - Indirect Cash Flow Statement Completed.xlsm"}]
["Navigator"]
[null,"Error Checks:",null,null,null,{"$f":"Overall_Error_Check","v":0}]
[]
[null,{"$f":"MAX($B$5:$B5)+1","v":1},{"$f":"A1","v":"Lookup"}]
[]
[null,null,"Year Lookups"]
[]
[null,null,null,"LU_Future_Years"]
[null,null,null,{"$f":"IF(_xlfn.SEQUENCE(Number_of_Periods)=1,\n\"Actuals Throughout\",TRANSPOSE(_xlfn.ANCHORARRAY(Timing!J7)))","v":"Actuals Throughout"},null,"LU_Future_Years",{"$f":"_xlfn.FORMULATEXT(D11)","v":"=IF(SEQUENCE(Number_of_Periods)=1,\n\"Actuals Throughout\",TRANSPOSE(Timing!J7#))"}]
[null,null,null,"2026-06-30"]
[null,null,null,"2027-06-30"]
[null,null,null,"2028-06-30"]
[null,null,null,"2029-06-30"]
{"$rows_left_out":1}
{"sheet":"Template Sheet","index":12,"n_rows":10,"n_cols":9,"rows_kept":10,"cut":false,"hidden":false,"merged":[[2,0,2,4]]}
[{"$f":"IF(ISERROR(RIGHT(CELL(\"filename\",A1),LEN(CELL(\"filename\",A1))-FIND(\"]\",CELL(\"filename\",A1)))),\n\"\",\nRIGHT(CELL(\"filename\",A1),LEN(CELL(\"filename\",A1))-FIND(\"]\",CELL(\"filename\",A1))))","v":"Template Sheet"}]
[{"$f":"Model_Name","v":"Model 16 - Indirect Cash Flow Statement Completed.xlsm"}]
["Navigator"]
[null,null,null,null,"Error Checks:",null,null,null,{"$f":"Overall_Error_Check","v":0}]
[]
[null,{"$f":"MAX($B$5:$B5)+1","v":1},"First Section"]
[]
[null,null,"Heading"]
[]
[null,null,null,"Sub Heading"]

{"sheet":"Error Checks","index":13,"n_rows":25,"n_cols":9,"rows_kept":25,"cut":false,"hidden":false,"merged":[[0,8,0,9],[2,0,2,4]]}
[{"$f":"IF(ISERROR(RIGHT(CELL(\"filename\",A1),LEN(CELL(\"filename\",A1))-FIND(\"]\",CELL(\"filename\",A1)))),\n\"\",\nRIGHT(CELL(\"filename\",A1),LEN(CELL(\"filename\",A1))-FIND(\"]\",CELL(\"filename\",A1))))","v":"Error Checks"}]
[{"$f":"Model_Name","v":"Model 16 - Indirect Cash Flow Statement Completed.xlsm"}]
["Navigator"]
[null,"Error Checks:",null,null,null,{"$f":"Overall_Error_Check","v":0}]
[]
[null,{"$f":"MAX($B$5:$B5)+1","v":1},"Error Checks"]
[]
[null,null,"Summary of Errors"]
[]
[null,null,null,"Assumptions"]
[]
[null,null,null,null,"Balance Sheet has no errors",null,null,null,{"$f":"HL_BS_Errors","v":0}]
[null,null,null,null,"Balance Sheet balances",null,null,null,{"$f":"HL_BS_Balance","v":0}]
[null,null,null,null,"Insolvency check for Balance Sheet",null,null,null,{"$f":"HL_BS_Insolvency","v":0}]
[null,null,null,null,"Opening Balance Sheet has no errors",null,null,null,{"$f":"HL_Op_BS_Errors","v":0}]
{"$rows_left_out":10}