{"text_format":"1","workbook":"xlsx","n_sheets":14,"sheets":["Cover","Navigator","Style Guide","Model Parameters","General Assumptions","Calculations","Opening Balance Sheet","Income Statement","Balance Sheet","Cash Flow Statement","Error Checks","Timing","Lookup","Change Log"],"not_rendered":{"charts":0,"images":1,"macros":1,"external_links":0,"defined_names":48,"comments":0,"pivot_tables":0},"unopened":[],"bounds":{"document_bytes":16777216,"sheet_cells":100000,"rows_first":2000,"rows_last":500,"rows_between":2000,"halvings":0,"cell_chars":16384,"cell_head_chars":4096},"cells_cut":0,"cells_raw":0,"read":"whole","date_system":"1900"}

{"sheet":"Cover","index":0,"n_rows":22,"n_cols":7,"rows_kept":22,"cut":false,"hidden":false,"merged":[[16,2,16,9],[17,2,17,9],[20,6,20,8],[21,6,21,8]]}
[]
[]
["Navigator"]
[]
[null,null,{"$f":"Client_Name","v":"Example"}]
[null,null,{"$f":"Model_Name","v":"Chapter 10.10 - Taxation.xlsm"}]
[]
[]
[]
[]
[]
[]
[]
[null,null,"Primary Developer:  Liam Bastick"]
[]
{"$rows_left_out":8}
{"sheet":"Navigator","index":1,"n_rows":21,"n_cols":7,"rows_kept":21,"cut":false,"hidden":false,"merged":[[2,0,2,2]]}
[{"$f":"IFERROR(RIGHT(CELL(\"filename\",A1),LEN(CELL(\"filename\",A1))-FIND(\"]\",CELL(\"filename\",A1))),\"\")","v":"Navigator"}]
[{"$f":"Model_Name","v":"Chapter 10.10 - Taxation.xlsm"}]
["Navigator"]
["Error Checks:",null,null,null,null,null,{"$f":"Overall_Error_Check","v":0}]
[]
[]
[null,1,"Table of Contents"]
[]
[null,null,null,null,null,"Cover"]
[null,null,null,null,null,"Style Guide"]
[null,null,null,null,null,"Model Parameters"]
[null,null,null,null,null,"General Assumptions"]
[null,null,null,null,null,"Calculations"]
[null,null,null,null,null,"Opening Balance Sheet"]
[null,null,null,null,null,"Income Statement"]
{"$rows_left_out":7}
{"sheet":"Style Guide","index":2,"n_rows":74,"n_cols":11,"rows_kept":74,"cut":false,"hidden":false,"merged":[[80,2,80,6],[74,2,74,6],[75,2,75,6],[76,2,76,6],[77,2,77,6],[78,2,78,6],[79,2,79,6],[73,2,73,6],[62,2,62,6],[63,2,63,6],[64,2,64,6],[65,2,65,6],[66,2,66,6],[67,2,67,6],[68,2,68,6],[69,2,69,6],[70,2,70,6],[71,2,71,6],[72,2,72,6],[61,2,61,6],[47,2,47,6],[48,2,48,6],[49,2,49,6],[50,2,50,6],[51,2,51,6],[52,2,52,6],[53,2,53,6],[54,2,54,6],[57,2,57,6],[59,2,59,6],[60,2,60,6],[46,2,46,6],[35,2,35,6],[36,2,36,6],[37,2,37,6],[38,2,38,6],[39,2,39,6],[40,2,40,6],[41,2,41,6],[42,2,42,6],[43,2,43,6],[44,2,44,6],[45,2,45,6],[34,2,34,6],[17,2,17,6],[18,2,18,6],[19,2,19,6],[24,2,24,6],[25,2,25,6],[26,2,26,6],[27,2,27,6],[28,2,28,6],[29,2,29,6],[30,2,30,6],[31,2,31,6],[16,2,16,6],[7,2,7,6],[8,2,8,6],[9,2,9,6],[10,2,10,6],[11,2,11,6],[12,2,12,6],[13,2,13,6],[14,2,14,6],[15,2,15,6]]}
[{"$f":"IFERROR(RIGHT(CELL(\"filename\",A1),LEN(CELL(\"filename\",A1))-FIND(\"]\",CELL(\"filename\",A1))),\"\")","v":"Style Guide"}]
[{"$f":"Model_Name","v":"Chapter 10.10 - Taxation.xlsm"}]
["Navigator"]
["Error Checks:",null,null,null,null,null,null,null,{"$f":"Overall_Error_Check","v":0}]
[]
[null,{"$f":"MAX($B$5:$B5)+1","v":1},"Formatting of Headers / Dividers"]
[]
[null,null,"Description",null,null,null,null,null,"Display",null,"Style Name"]
[]
[null,null,"Sheet Title",null,null,null,null,null,{"$f":"C10","v":"Sheet Title"},null,"Sheet Title"]
[null,null,"Model Name",null,null,null,null,null,{"$f":"C11","v":"Model Name"},null,"Model Name"]
[]
[null,null,"Header 1",null,null,null,null,null,{"$f":"C13","v":"Header 1"},null,"Header 1"]
[null,null,"Header 2",null,null,null,null,null,{"$f":"C14","v":"Header 2"},null,"Header 2"]
[null,null,"Header 3",null,null,null,null,null,{"$f":"C15","v":"Header 3"},null,"Header 3"]
{"$rows_left_out":60}
{"sheet":"Model Parameters","index":3,"n_rows":58,"n_cols":9,"rows_kept":58,"cut":false,"hidden":false,"merged":[[0,9,0,10],[11,6,11,13],[12,6,12,13]]}
[{"$f":"IFERROR(RIGHT(CELL(\"filename\",A1),LEN(CELL(\"filename\",A1))-FIND(\"]\",CELL(\"filename\",A1))),\"\")","v":"Model Parameters"}]
[{"$f":"Model_Name","v":"Chapter 10.10 - Taxation.xlsm"}]
["Navigator"]
[{"$f":"Timing!A4","v":"Error Checks:"},null,null,null,null,null,null,null,{"$f":"Overall_Error_Check","v":0}]
[]
[null,{"$f":"MAX($B$5:$B5)+1","v":1},"General"]
[]
[null,null,"Key Inputs"]
[]
[null,null,null,"General"]
[]
[null,null,null,null,"Model Name",null,{"$f":"IFERROR(MID(CELL(\"filename\",A1),FIND(\"[\",CELL(\"filename\",A1))+1,FIND(\"]\",CELL(\"filename\",A1))-FIND(\"[\",CELL(\"filename\",A1))-1),””)","v":"Chapter 10.10 - Taxation.xlsm"}]
[null,null,null,null,"Client Name",null,"Example"]
[]
[]
{"$rows_left_out":44}
{"sheet":"General Assumptions","index":4,"n_rows":127,"n_cols":14,"rows_kept":127,"cut":false,"hidden":false,"merged":[]}
[{"$f":"IFERROR(RIGHT(CELL(\"filename\",A1),LEN(CELL(\"filename\",A1))-FIND(\"]\",CELL(\"filename\",A1))),\"\")","v":"General Assumptions"}]
[{"$f":"Model_Name","v":"Chapter 10.10 - Taxation.xlsm"}]
["Navigator"]
[{"$f":"Timing!A4","v":"Error Checks:"},null,null,null,null,null,{"$f":"Overall_Error_Check","v":0}]
[null,null,null,null,null,null,null,null,null,{"$f":"Timing!J5","v":"2021-06-30"},{"$f":"Timing!K5","v":"2022-06-30"},{"$f":"Timing!L5","v":"2023-06-30"},{"$f":"Timing!M5","v":"2024-06-30"},{"$f":"Timing!N5","v":"2025-06-30"}]
[null,null,{"$f":"Timing!C6","v":"Start Date"},null,null,null,null,null,null,{"$f":"Timing!J6","v":"2020-07-01"},{"$f":"Timing!K6","v":"2021-07-01"},{"$f":"Timing!L6","v":"2022-07-01"},{"$f":"Timing!M6","v":"2023-07-01"},{"$f":"Timing!N6","v":"2024-07-01"}]
[null,null,{"$f":"Timing!C7","v":"End Date"},null,null,null,null,null,null,{"$f":"Timing!J7","v":"2021-06-30"},{"$f":"Timing!K7","v":"2022-06-30"},{"$f":"Timing!L7","v":"2023-06-30"},{"$f":"Timing!M7","v":"2024-06-30"},{"$f":"Timing!N7","v":"2025-06-30"}]
[null,null,{"$f":"Timing!C8","v":"Number of Days"},null,null,null,null,null,null,{"$f":"Timing!J8","v":365},{"$f":"Timing!K8","v":365},{"$f":"Timing!L8","v":365},{"$f":"Timing!M8","v":366},{"$f":"Timing!N8","v":365}]
[null,null,{"$f":"Timing!C9","v":"Counter"},null,null,null,null,null,null,{"$f":"Timing!J9","v":1},{"$f":"Timing!K9","v":2},{"$f":"Timing!L9","v":3},{"$f":"Timing!M9","v":4},{"$f":"Timing!N9","v":5}]
[]
[null,{"$f":"MAX($B$10:$B10)+1","v":1},{"$f":"A1","v":"General Assumptions"}]
[]
[null,null,"Revenue and Related"]
[]
[null,null,null,"Revenue"]
{"$rows_left_out":113}
{"sheet":"Calculations","index":5,"n_rows":283,"n_cols":16,"rows_kept":283,"cut":false,"hidden":false,"merged":[]}
[{"$f":"IFERROR(RIGHT(CELL(\"filename\",A1),LEN(CELL(\"filename\",A1))-FIND(\"]\",CELL(\"filename\",A1))),\"\")","v":"Calculations"}]
[{"$f":"Model_Name","v":"Chapter 10.10 - Taxation.xlsm"}]
["Navigator"]
[{"$f":"Timing!A4","v":"Error Checks:"},null,null,null,null,null,{"$f":"Overall_Error_Check","v":0}]
[null,null,null,null,null,null,null,null,null,{"$f":"Timing!J5","v":"2021-06-30"},{"$f":"Timing!K5","v":"2022-06-30"},{"$f":"Timing!L5","v":"2023-06-30"},{"$f":"Timing!M5","v":"2024-06-30"},{"$f":"Timing!N5","v":"2025-06-30"}]
[null,null,{"$f":"Timing!C6","v":"Start Date"},null,null,null,null,null,null,{"$f":"Timing!J6","v":"2020-07-01"},{"$f":"Timing!K6","v":"2021-07-01"},{"$f":"Timing!L6","v":"2022-07-01"},{"$f":"Timing!M6","v":"2023-07-01"},{"$f":"Timing!N6","v":"2024-07-01"}]
[null,null,{"$f":"Timing!C7","v":"End Date"},null,null,null,null,null,null,{"$f":"Timing!J7","v":"2021-06-30"},{"$f":"Timing!K7","v":"2022-06-30"},{"$f":"Timing!L7","v":"2023-06-30"},{"$f":"Timing!M7","v":"2024-06-30"},{"$f":"Timing!N7","v":"2025-06-30"}]
[null,null,{"$f":"Timing!C8","v":"Number of Days"},null,null,null,null,null,null,{"$f":"Timing!J8","v":365},{"$f":"Timing!K8","v":365},{"$f":"Timing!L8","v":365},{"$f":"Timing!M8","v":366},{"$f":"Timing!N8","v":365}]
[null,null,{"$f":"Timing!C9","v":"Counter"},null,null,null,null,null,null,{"$f":"Timing!J9","v":1},{"$f":"Timing!K9","v":2},{"$f":"Timing!L9","v":3},{"$f":"Timing!M9","v":4},{"$f":"Timing!N9","v":5}]
[]
[null,{"$f":"MAX($B$10:$B10)+1","v":1},{"$f":"A1","v":"Calculations"}]
[]
[null,null,"Revenue and Related "]
[]
[null,null,null,"Revenue"]
{"$rows_left_out":269}
{"sheet":"Opening Balance Sheet","index":6,"n_rows":57,"n_cols":11,"rows_kept":57,"cut":false,"hidden":false,"merged":[[0,7,0,8]]}
[{"$f":"IFERROR(RIGHT(CELL(\"filename\",A1),LEN(CELL(\"filename\",A1))-FIND(\"]\",CELL(\"filename\",A1))),\"\")","v":"Opening Balance Sheet"}]
[{"$f":"Model_Name","v":"Chapter 10.10 - Taxation.xlsm"}]
["Navigator"]
["Error Checks:",null,null,null,null,null,{"$f":"Overall_Error_Check","v":0},null,{"$f":"Model_Start_Date-1","v":"2020-06-30"}]
[]
[]
[]
[]
[]
[]
[null,{"$f":"MAX($B5:$B$5)+1","v":1},{"$f":"A1","v":"Opening Balance Sheet"}]
[]
[null,null,"Current Assets"]
[null,null,null,"Cash ",null,null,{"$f":"Currency","v":"US$'000"},null,null,null,250]
[null,null,null,"Accounts Receivable",null,null,{"$f":"Currency","v":"US$'000"},null,null,null,50]
{"$rows_left_out":43}
{"sheet":"Income Statement","index":7,"n_rows":27,"n_cols":14,"rows_kept":27,"cut":false,"hidden":false,"merged":[]}
[{"$f":"IFERROR(RIGHT(CELL(\"filename\",A1),LEN(CELL(\"filename\",A1))-FIND(\"]\",CELL(\"filename\",A1))),\"\")","v":"Income Statement"}]
[{"$f":"Model_Name","v":"Chapter 10.10 - Taxation.xlsm"}]
["Navigator"]
["Error Checks:",null,null,null,null,null,{"$f":"Overall_Error_Check","v":0}]
[null,null,null,null,null,null,null,null,null,{"$f":"Timing!J5","v":"2021-06-30"},{"$f":"Timing!K5","v":"2022-06-30"},{"$f":"Timing!L5","v":"2023-06-30"},{"$f":"Timing!M5","v":"2024-06-30"},{"$f":"Timing!N5","v":"2025-06-30"}]
[null,null,{"$f":"Timing!C6","v":"Start Date"},null,null,null,null,null,null,{"$f":"Timing!J6","v":"2020-07-01"},{"$f":"Timing!K6","v":"2021-07-01"},{"$f":"Timing!L6","v":"2022-07-01"},{"$f":"Timing!M6","v":"2023-07-01"},{"$f":"Timing!N6","v":"2024-07-01"}]
[null,null,{"$f":"Timing!C7","v":"End Date"},null,null,null,null,null,null,{"$f":"Timing!J7","v":"2021-06-30"},{"$f":"Timing!K7","v":"2022-06-30"},{"$f":"Timing!L7","v":"2023-06-30"},{"$f":"Timing!M7","v":"2024-06-30"},{"$f":"Timing!N7","v":"2025-06-30"}]
[null,null,{"$f":"Timing!C8","v":"Number of Days"},null,null,null,null,null,null,{"$f":"Timing!J8","v":365},{"$f":"Timing!K8","v":365},{"$f":"Timing!L8","v":365},{"$f":"Timing!M8","v":366},{"$f":"Timing!N8","v":365}]
[null,null,{"$f":"Timing!C9","v":"Counter"},null,null,null,null,null,null,{"$f":"Timing!J9","v":1},{"$f":"Timing!K9","v":2},{"$f":"Timing!L9","v":3},{"$f":"Timing!M9","v":4},{"$f":"Timing!N9","v":5}]
[]
[null,{"$f":"MAX($B$7:$B10)+1","v":1},{"$f":"A1","v":"Income Statement"}]
[]
[null,null,null,"Revenue",null,null,{"$f":"Currency","v":"US$'000"},null,null,{"$f":"Calculations!J32","v":400},{"$f":"Calculations!K32","v":448.00000000000006},{"$f":"Calculations!L32","v":492.80000000000013},{"$f":"Calculations!M32","v":532.22400000000016},{"$f":"Calculations!N32","v":558.83520000000021}]
[null,null,null,"COGS",null,null,{"$f":"Currency","v":"US$'000"},null,null,{"$f":"-Calculations!J58","v":-120},{"$f":"-Calculations!K58","v":-134.40000000000003},{"$f":"-Calculations!L58","v":-147.84000000000003},{"$f":"-Calculations!M58","v":-159.66720000000009},{"$f":"-Calculations!N58","v":-167.6505600000001}]
[null,null,null,"Gross Profit",null,null,{"$f":"Currency","v":"US$'000"},null,null,{"$f":"SUM(J13:J14)","v":280},{"$f":"SUM(K13:K14)","v":313.60000000000002},344.96000000000009,372.55680000000007,391.18464000000012]
{"$rows_left_out":13}
{"sheet":"Balance Sheet","index":8,"n_rows":57,"n_cols":14,"rows_kept":57,"cut":false,"hidden":false,"merged":[]}
[{"$f":"IFERROR(RIGHT(CELL(\"filename\",A1),LEN(CELL(\"filename\",A1))-FIND(\"]\",CELL(\"filename\",A1))),\"\")","v":"Balance Sheet"}]
[{"$f":"Model_Name","v":"Chapter 10.10 - Taxation.xlsm"}]
["Navigator"]
["Error Checks:",null,null,null,null,null,{"$f":"Overall_Error_Check","v":0}]
[null,null,null,null,null,null,null,null,null,{"$f":"Timing!J5","v":"2021-06-30"},{"$f":"Timing!K5","v":"2022-06-30"},{"$f":"Timing!L5","v":"2023-06-30"},{"$f":"Timing!M5","v":"2024-06-30"},{"$f":"Timing!N5","v":"2025-06-30"}]
[null,null,{"$f":"Timing!C6","v":"Start Date"},null,null,null,null,null,null,{"$f":"Timing!J6","v":"2020-07-01"},{"$f":"Timing!K6","v":"2021-07-01"},{"$f":"Timing!L6","v":"2022-07-01"},{"$f":"Timing!M6","v":"2023-07-01"},{"$f":"Timing!N6","v":"2024-07-01"}]
[null,null,{"$f":"Timing!C7","v":"End Date"},null,null,null,null,null,null,{"$f":"Timing!J7","v":"2021-06-30"},{"$f":"Timing!K7","v":"2022-06-30"},{"$f":"Timing!L7","v":"2023-06-30"},{"$f":"Timing!M7","v":"2024-06-30"},{"$f":"Timing!N7","v":"2025-06-30"}]
[null,null,{"$f":"Timing!C8","v":"Number of Days"},null,null,null,null,null,null,{"$f":"Timing!J8","v":365},{"$f":"Timing!K8","v":365},{"$f":"Timing!L8","v":365},{"$f":"Timing!M8","v":366},{"$f":"Timing!N8","v":365}]
[null,null,{"$f":"Timing!C9","v":"Counter"},null,null,null,null,null,null,{"$f":"Timing!J9","v":1},{"$f":"Timing!K9","v":2},{"$f":"Timing!L9","v":3},{"$f":"Timing!M9","v":4},{"$f":"Timing!N9","v":5}]
[]
[null,{"$f":"MAX($B$9:$B10)+1","v":1},{"$f":"A1","v":"Balance Sheet"}]
[]
[null,null,{"$f":"'Opening Balance Sheet'!C13","v":"Current Assets"}]
[null,null,null,{"$f":"'Opening Balance Sheet'!D14","v":"Cash "},null,null,{"$f":"Currency","v":"US$'000"},null,null,{"$f":"IF(J$9=1,'Opening Balance Sheet'!$I$14,I14)+'Cash Flow Statement'!J37","v":53.835616438356169},{"$f":"IF(K$9=1,'Opening Balance Sheet'!$I$14,J14)+'Cash Flow Statement'!K37","v":90.28497687110368},{"$f":"IF(L$9=1,'Opening Balance Sheet'!$I$14,K14)+'Cash Flow Statement'!L37","v":194.55981091398831},{"$f":"IF(M$9=1,'Opening Balance Sheet'!$I$14,L14)+'Cash Flow Statement'!M37","v":332.01064488952977},{"$f":"IF(N$9=1,'Opening Balance Sheet'!$I$14,M14)+'Cash Flow Statement'!N37","v":482.66563102231294}]
[null,null,null,{"$f":"'Opening Balance Sheet'!D15","v":"Accounts Receivable"},null,null,{"$f":"Currency","v":"US$'000"},null,null,{"$f":"Calculations!J34","v":65.753424657534239},{"$f":"Calculations!K34","v":73.643835616438366},{"$f":"Calculations!L34","v":81.008219178082214},{"$f":"Calculations!M34","v":87.249836065573788},{"$f":"Calculations!N34","v":91.863320547945236}]
{"$rows_left_out":43}
{"sheet":"Cash Flow Statement","index":9,"n_rows":58,"n_cols":14,"rows_kept":58,"cut":false,"hidden":false,"merged":[]}
[{"$f":"IFERROR(RIGHT(CELL(\"filename\",A1),LEN(CELL(\"filename\",A1))-FIND(\"]\",CELL(\"filename\",A1))),\"\")","v":"Cash Flow Statement"}]
[{"$f":"Model_Name","v":"Chapter 10.10 - Taxation.xlsm"}]
["Navigator"]
["Error Checks:",null,null,null,null,null,{"$f":"Overall_Error_Check","v":0}]
[null,null,null,null,null,null,null,null,null,{"$f":"Timing!J5","v":"2021-06-30"},{"$f":"Timing!K5","v":"2022-06-30"},{"$f":"Timing!L5","v":"2023-06-30"},{"$f":"Timing!M5","v":"2024-06-30"},{"$f":"Timing!N5","v":"2025-06-30"}]
[null,null,{"$f":"Timing!C6","v":"Start Date"},null,null,null,null,null,null,{"$f":"Timing!J6","v":"2020-07-01"},{"$f":"Timing!K6","v":"2021-07-01"},{"$f":"Timing!L6","v":"2022-07-01"},{"$f":"Timing!M6","v":"2023-07-01"},{"$f":"Timing!N6","v":"2024-07-01"}]
[null,null,{"$f":"Timing!C7","v":"End Date"},null,null,null,null,null,null,{"$f":"Timing!J7","v":"2021-06-30"},{"$f":"Timing!K7","v":"2022-06-30"},{"$f":"Timing!L7","v":"2023-06-30"},{"$f":"Timing!M7","v":"2024-06-30"},{"$f":"Timing!N7","v":"2025-06-30"}]
[null,null,{"$f":"Timing!C8","v":"Number of Days"},null,null,null,null,null,null,{"$f":"Timing!J8","v":365},{"$f":"Timing!K8","v":365},{"$f":"Timing!L8","v":365},{"$f":"Timing!M8","v":366},{"$f":"Timing!N8","v":365}]
[null,null,{"$f":"Timing!C9","v":"Counter"},null,null,null,null,null,null,{"$f":"Timing!J9","v":1},{"$f":"Timing!K9","v":2},{"$f":"Timing!L9","v":3},{"$f":"Timing!M9","v":4},{"$f":"Timing!N9","v":5}]
[]
[null,{"$f":"MAX($B$9:$B10)+1","v":1},{"$f":"A1","v":"Cash Flow Statement"}]
[]
[null,null,{"$f":"\"Direct \"&C11","v":"Direct Cash Flow Statement"}]
[]
[null,null,null,"Operating Cash Flow"]
{"$rows_left_out":44}
{"sheet":"Error Checks","index":10,"n_rows":21,"n_cols":9,"rows_kept":21,"cut":false,"hidden":false,"merged":[[0,8,0,9]]}
[{"$f":"IFERROR(RIGHT(CELL(\"filename\",A1),LEN(CELL(\"filename\",A1))-FIND(\"]\",CELL(\"filename\",A1))),\"\")","v":"Error Checks"}]
[{"$f":"Model_Name","v":"Chapter 10.10 - Taxation.xlsm"}]
["Navigator"]
["Error Checks:",null,null,null,null,{"$f":"Overall_Error_Check","v":0}]
[]
[null,{"$f":"MAX($B$5:$B5)+1","v":1},"Error Checks"]
[]
[null,null,"Summary of Errors"]
[]
[null,null,null,"Assumptions"]
[]
[null,null,null,null,"Opening Balance Sheet - no errors",null,null,null,{"$f":"'Opening Balance Sheet'!I55","v":0}]
[null,null,null,null,"Opening Balance Sheet - balances",null,null,null,{"$f":"'Opening Balance Sheet'!I56","v":0}]
[null,null,null,null,"Opening Balance Sheet - solvent",null,null,null,{"$f":"'Opening Balance Sheet'!I57","v":0}]
[null,null,null,null,"Balance Sheet - no errors",null,null,null,{"$f":"'Balance Sheet'!I55","v":0}]
{"$rows_left_out":7}
{"sheet":"Timing","index":11,"n_rows":23,"n_cols":14,"rows_kept":23,"cut":false,"hidden":false,"merged":[]}
[{"$f":"IFERROR(RIGHT(CELL(\"filename\",A1),LEN(CELL(\"filename\",A1))-FIND(\"]\",CELL(\"filename\",A1))),\"\")","v":"Timing"}]
[{"$f":"Model_Name","v":"Chapter 10.10 - Taxation.xlsm"}]
["Navigator"]
["Error Checks:",null,null,null,null,{"$f":"Overall_Error_Check","v":0}]
[null,null,null,null,null,null,null,null,null,{"$f":"J$7","v":"2021-06-30"},{"$f":"K$7","v":"2022-06-30"},{"$f":"L$7","v":"2023-06-30"},{"$f":"M$7","v":"2024-06-30"},{"$f":"N$7","v":"2025-06-30"}]
[null,null,"Start Date",null,null,null,null,null,null,{"$f":"IF(J$9=1,Model_Start_Date,I$7+1)","v":"2020-07-01"},{"$f":"IF(K$9=1,Model_Start_Date,J$7+1)","v":"2021-07-01"},{"$f":"IF(L$9=1,Model_Start_Date,K$7+1)","v":"2022-07-01"},{"$f":"IF(M$9=1,Model_Start_Date,L$7+1)","v":"2023-07-01"},{"$f":"IF(N$9=1,Model_Start_Date,M$7+1)","v":"2024-07-01"}]
[null,null,"End Date",null,null,null,null,null,null,{"$f":"EOMONTH(J$6,MOD(Periodicity+Reporting_Month_Factor-MONTH(J$6),Periodicity))","v":"2021-06-30"},{"$f":"EOMONTH(K$6,MOD(Periodicity+Reporting_Month_Factor-MONTH(K$6),Periodicity))","v":"2022-06-30"},{"$f":"EOMONTH(L$6,MOD(Periodicity+Reporting_Month_Factor-MONTH(L$6),Periodicity))","v":"2023-06-30"},{"$f":"EOMONTH(M$6,MOD(Periodicity+Reporting_Month_Factor-MONTH(M$6),Periodicity))","v":"2024-06-30"},{"$f":"EOMONTH(N$6,MOD(Periodicity+Reporting_Month_Factor-MONTH(N$6),Periodicity))","v":"2025-06-30"}]
[null,null,"Number of Days",null,null,null,null,null,null,{"$f":"J7-J6+1","v":365},{"$f":"K7-K6+1","v":365},365,366,365]
[null,null,"Counter",null,null,null,null,null,null,{"$f":"N(I$9)+1","v":1},{"$f":"N(J$9)+1","v":2},3,4,5]
[]
[null,{"$f":"MAX($B$10:$B10)+1","v":1},"Timing Assumptions"]
[]
[null,null,"Data (do not change once modelling has commenced)"]
[]
[null,null,null,"Model Start Date",null,null,null,"2020-07-01"]
{"$rows_left_out":9}
{"sheet":"Lookup","index":12,"n_rows":15,"n_cols":8,"rows_kept":15,"cut":false,"hidden":false,"merged":[]}
[{"$f":"IFERROR(RIGHT(CELL(\"filename\",A1),LEN(CELL(\"filename\",A1))-FIND(\"]\",CELL(\"filename\",A1))),\"\")","v":"Lookup"}]
[{"$f":"Model_Name","v":"Chapter 10.10 - Taxation.xlsm"}]
["Navigator"]
["Error Checks:",null,null,null,null,null,{"$f":"Overall_Error_Check","v":0}]
[]
[null,{"$f":"MAX($B$5:$B5)+1","v":1},{"$f":"A1","v":"Lookup"}]
[]
[null,null,"Year Lookups"]
[]
[null,null,null,{"$f":"F11","v":"LU_Future_Years"}]
[null,null,null,{"$f":"OFFSET(Timing!$J$7,,ROWS($A$9:$A9))","v":"2022-06-30"},null,"LU_Future_Years",null,{"$f":"_xlfn.FORMULATEXT(D11)","v":"=OFFSET(Timing!$J$7,,ROWS($A$9:$A9))"}]
[null,null,null,{"$f":"OFFSET(Timing!$J$7,,ROWS($A$9:$A10))","v":"2023-06-30"},null,null,null,{"$f":"_xlfn.FORMULATEXT(D12)","v":"=OFFSET(Timing!$J$7,,ROWS($A$9:$A10))"}]
[null,null,null,{"$f":"OFFSET(Timing!$J$7,,ROWS($A$9:$A11))","v":"2024-06-30"},null,null,null,"=OFFSET(Timing!$J$7,,ROWS($A$9:$A11))"]
[null,null,null,{"$f":"OFFSET(Timing!$J$7,,ROWS($A$9:$A12))","v":"2025-06-30"},null,null,null,"=OFFSET(Timing!$J$7,,ROWS($A$9:$A12))"]
[null,null,null,"Actuals Throughout"]
{"$rows_left_out":1}
{"sheet":"Change Log","index":13,"n_rows":13,"n_cols":11,"rows_kept":13,"cut":false,"hidden":false,"merged":[]}
[{"$f":"IFERROR(RIGHT(CELL(\"filename\",A1),LEN(CELL(\"filename\",A1))-FIND(\"]\",CELL(\"filename\",A1))),\"\")","v":"Change Log"}]
[{"$f":"Model_Name","v":"Chapter 10.10 - Taxation.xlsm"}]
["Navigator"]
["Error Checks:",null,null,null,null,{"$f":"Overall_Error_Check","v":0}]
[]
[null,{"$f":"MAX($B$5:$B5)+1","v":1},{"$f":"A1","v":"Change Log"}]
[]
[null,null,"Summary"]
[]
[null,null,null,null,null,"Date","Model Version ","Details of change","Worksheet Reference","Row, column, cell reference","Author"]
[null,null,null,null,null,"2013-05-21","Untitled attachment 00059.xlsm","I changed it","Change Log","F11","LB"]
[null,null,null,null,null,"2013-05-21","Untitled attachment 00059.xlsm","So did I.","Timing","A4","LB"]
[null,null,null,null,null,"2013-05-21","Untitled attachment 00059.xlsm","And me.","Navigator","B9","Dave"]