{"text_format":"1","workbook":"xlsx","n_sheets":8,"sheets":["Cover","Navigator","Style Guide","Model Parameters","Resulting List","Data","Error Checks","Sheet1"],"not_rendered":{"charts":0,"images":1,"macros":1,"external_links":0,"defined_names":25,"comments":0,"pivot_tables":0},"unopened":[],"bounds":{"document_bytes":16777216,"sheet_cells":100000,"rows_first":2000,"rows_last":500,"rows_between":2000,"halvings":0,"cell_chars":16384,"cell_head_chars":4096},"cells_cut":0,"cells_raw":0,"read":"whole","date_system":"1900"}

{"sheet":"Cover","index":0,"n_rows":22,"n_cols":7,"rows_kept":22,"cut":false,"hidden":false,"merged":[[16,2,16,9],[17,2,17,9],[20,6,20,8],[21,6,21,8]]}
[]
[]
["Navigator"]
[]
[null,null,{"$f":"Client_Name","v":"SumProduct Pty Limited"}]
[null,null,{"$f":"Model_Name","v":"SP Dynamic Data Validation.xlsm"}]
[]
[]
[]
[]
[]
[]
[]
[null,null,"Primary Developer:  Liam Bastick"]
[]
[null,null,"General Cover Notes:"]
[null,null,"Simple template to agree layouts, formats and styles."]
[]
[]
[]
[null,null,"Any queries, please e-mail:",null,null,null,"liam.bastick@sumproduct.com"]
[null,null,"Website:",null,null,null,"www.sumproduct.com"]

{"sheet":"Navigator","index":1,"n_rows":14,"n_cols":7,"rows_kept":14,"cut":false,"hidden":false,"merged":[]}
["Navigator"]
[{"$f":"Model_Name","v":"SP Dynamic Data Validation.xlsm"}]
["Navigator"]
[null,null,null,null,"Error Checks:",null,{"$f":"Overall_Error_Check","v":0}]
[]
[]
[null,1,"Table of Contents"]
[]
[null,null,null,null,null,"Cover"]
[null,null,null,null,null,"Style Guide"]
[null,null,null,null,null,"Model Parameters"]
[null,null,null,null,null,"Resulting List"]
[null,null,null,null,null,"Data"]
[null,null,null,null,null,"Error Checks"]

{"sheet":"Style Guide","index":2,"n_rows":74,"n_cols":11,"rows_kept":74,"cut":false,"hidden":false,"merged":[[16,2,16,6],[2,0,2,4],[7,2,7,6],[8,2,8,6],[9,2,9,6],[10,2,10,6],[11,2,11,6],[12,2,12,6],[13,2,13,6],[14,2,14,6],[15,2,15,6],[34,2,34,6],[17,2,17,6],[18,2,18,6],[19,2,19,6],[24,2,24,6],[25,2,25,6],[26,2,26,6],[27,2,27,6],[28,2,28,6],[29,2,29,6],[30,2,30,6],[31,2,31,6],[46,2,46,6],[35,2,35,6],[36,2,36,6],[37,2,37,6],[38,2,38,6],[39,2,39,6],[40,2,40,6],[41,2,41,6],[42,2,42,6],[43,2,43,6],[44,2,44,6],[45,2,45,6],[61,2,61,6],[47,2,47,6],[48,2,48,6],[49,2,49,6],[50,2,50,6],[51,2,51,6],[52,2,52,6],[53,2,53,6],[54,2,54,6],[57,2,57,6],[59,2,59,6],[60,2,60,6],[73,2,73,6],[62,2,62,6],[63,2,63,6],[64,2,64,6],[65,2,65,6],[66,2,66,6],[67,2,67,6],[68,2,68,6],[69,2,69,6],[70,2,70,6],[71,2,71,6],[72,2,72,6],[80,2,80,6],[74,2,74,6],[75,2,75,6],[76,2,76,6],[77,2,77,6],[78,2,78,6],[79,2,79,6]]}
[{"$f":"IF(ISERROR(RIGHT(CELL(\"filename\",A1),LEN(CELL(\"filename\",A1))-FIND(\"]\",CELL(\"filename\",A1)))),\n\"\",\nRIGHT(CELL(\"filename\",A1),LEN(CELL(\"filename\",A1))-FIND(\"]\",CELL(\"filename\",A1))))","v":"Style Guide"}]
[{"$f":"Model_Name","v":"SP Dynamic Data Validation.xlsm"}]
["Navigator"]
[null,null,null,null,"Error Checks:",null,null,null,{"$f":"Overall_Error_Check","v":0}]
[]
[null,{"$f":"MAX($B$5:$B5)+1","v":1},"Formatting of Headers / Dividers"]
[]
[null,null,"Description",null,null,null,null,null,"Display",null,"Style Name"]
[]
[null,null,"Sheet Title",null,null,null,null,null,{"$f":"C10","v":"Sheet Title"},null,"Sheet Title"]
[null,null,"Model Name",null,null,null,null,null,{"$f":"C11","v":"Model Name"},null,"Model Name"]
[]
[null,null,"Header 1",null,null,null,null,null,{"$f":"C13","v":"Header 1"},null,"Header 1"]
[null,null,"Header 2",null,null,null,null,null,{"$f":"C14","v":"Header 2"},null,"Header 2"]
[null,null,"Header 3",null,null,null,null,null,{"$f":"C15","v":"Header 3"},null,"Header 3"]
[null,null,"Header 4",null,null,null,null,null,{"$f":"C16","v":"Header 4"},null,"Header 4"]
[]
[null,null,"Notes",null,null,null,null,null,{"$f":"C18","v":"Notes"},null,"Notes"]
[]
[null,null,"Table Heading",null,null,null,null,null,{"$f":"C20","v":"Table Heading"},null,"Table Heading"]
[]
[]
[null,{"$f":"MAX($B$5:$B22)+1","v":2},"Individual Cell Styles"]
[]
[null,null,"Description",null,null,null,null,null,"Display",null,"Style Name"]
[]
[null,null,"Assumption",null,null,null,null,null,"Assumption",null,{"$f":"C27","v":"Assumption"}]
[]
[null,null,"Constraint",null,null,null,null,null,{"$f":"C29","v":"Constraint"},null,{"$f":"C29","v":"Constraint"}]
[]
[null,null,"Empty",null,null,null,null,null,null,null,{"$f":"C31","v":"Empty"}]
[]
[null,null,"Error Check",null,null,null,null,null,0,null,{"$f":"C33","v":"Error Check"}]
[]
[null,null,"Hyperlink",null,null,null,null,null,"Hyperlink",null,{"$f":"C35","v":"Hyperlink"}]
[]
[null,null,"Internal Reference",null,null,null,null,null,{"$f":"'Error Checks'!E12","v":"Example"},null,{"$f":"C37","v":"Internal Reference"}]
[]
[null,null,"Line Calculation",null,null,null,null,null,77,null,"Line Calc"]
[]
[null,null,"Line Total",null,null,null,null,null,{"$f":"I39","v":77},null,{"$f":"C41","v":"Line Total"}]
[]
[null,null,"Parameter",null,null,null,null,null,365,null,{"$f":"C43","v":"Parameter"}]
[]
[null,null,"Range Name Description",null,null,null,null,null,"Not_Named",null,{"$f":"C45","v":"Range Name Description"}]
[]
[null,null,"Row Reference",null,null,null,null,null,{"$f":"ROW(C47)","v":47},null,"Row Ref"]
[]
[null,null,"Row Summary",null,null,null,null,null,{"$f":"I41","v":77},null,{"$f":"C49","v":"Row Summary"}]
[]
[null,null,"Units",null,null,null,null,null,"A$",null,{"$f":"C51","v":"Units"}]
[]
[null,null,"WIP",null,null,null,null,null,null,null,{"$f":"C53","v":"WIP"}]
[]
[]
[null,{"$f":"MAX($B$5:$B55)+1","v":3},"Numerical Styles"]
[]
[null,null,"Description",null,null,null,null,null,"Display",null,"Style Name"]
[]
[null,null,"Comma",null,null,null,null,null,123456.789,null,{"$f":"C60","v":"Comma"}]
[]
[null,null,"Comma [0]",null,null,null,null,null,-123456.789,null,"Comma [0]"]
[]
[null,null,"Currency",null,null,null,null,null,123456.789,null,"Currency"]
[]
[null,null,"Currency [0]",null,null,null,null,null,123456.789,null,"Currency [0]"]
[]
[null,null,"Date",null,null,null,null,null,{"$f":"TODAY()","v":"2020-07-28"},null,{"$f":"C68","v":"Date"}]
[]
[null,null,"Date Heading",null,null,null,null,null,{"$f":"TODAY()","v":"2020-07-28"},null,{"$f":"C70","v":"Date Heading"}]
[]
[null,null,"Numbers 0",null,null,null,null,null,-123456.789,null,{"$f":"C72","v":"Numbers 0"}]
[]
[null,null,"Percent",null,null,null,null,null,0.5,null,{"$f":"C74","v":"Percent"}]

{"sheet":"Model Parameters","index":3,"n_rows":31,"n_cols":9,"rows_kept":31,"cut":false,"hidden":false,"merged":[[0,9,0,10],[2,0,2,4],[10,6,10,13],[11,6,11,13]]}
[{"$f":"IF(ISERROR(RIGHT(CELL(\"filename\",A1),LEN(CELL(\"filename\",A1))-FIND(\"]\",CELL(\"filename\",A1)))),\n\"\",\nRIGHT(CELL(\"filename\",A1),LEN(CELL(\"filename\",A1))-FIND(\"]\",CELL(\"filename\",A1))))","v":"Model Parameters"}]
[{"$f":"Model_Name","v":"SP Dynamic Data Validation.xlsm"}]
["Navigator"]
[null,null,null,null,"Error Checks:",null,null,null,{"$f":"Overall_Error_Check","v":0}]
[]
[null,{"$f":"MAX($B$5:$B5)+1","v":1},"General"]
[]
[null,null,"Key Inputs"]
[]
[null,null,null,null,"General"]
[null,null,null,null,"Model Name",null,{"$f":"IF(ISERROR(OR(FIND(\"[\",CELL(\"filename\",A1)),FIND(\"]\",CELL(\"filename\",A1)))),\"\",MID(CELL(\"filename\",A1),FIND(\"[\",CELL(\"filename\",A1))+1,FIND(\"]\",CELL(\"filename\",A1))-FIND(\"[\",CELL(\"filename\",A1))-1))","v":"SP Dynamic Data Validation.xlsm"}]
[null,null,null,null,"Client Name",null,"SumProduct Pty Limited"]
[]
[]
[null,{"$f":"MAX($B$5:$B14)+1","v":2},"General Range Names"]
[]
[null,null,"Technical Assumptions"]
[]
[null,null,null,null,"Days in Year",null,365]
[null,null,null,null,"Months in Month",null,1]
[null,null,null,null,"Months in Quarter",null,3]
[null,null,null,null,"Months in Half Yr",null,6]
[null,null,null,null,"Months in Year",null,12]
[null,null,null,null,"Quarters in Year",null,4]
[]
[null,null,null,null,"Rounding Accuracy",null,5]
[]
[null,null,null,null,"Very Large Number",null,9.9999999999999997E+98]
[null,null,null,null,"Very Small Number",null,1E-8]
[]
[null,null,null,null,"Thousand",null,1000]

{"sheet":"Resulting List","index":4,"n_rows":222,"n_cols":11,"rows_kept":222,"cut":false,"hidden":false,"merged":[[2,0,2,4]]}
[{"$f":"IF(ISERROR(RIGHT(CELL(\"filename\",A1),LEN(CELL(\"filename\",A1))-FIND(\"]\",CELL(\"filename\",A1)))),\n\"\",\nRIGHT(CELL(\"filename\",A1),LEN(CELL(\"filename\",A1))-FIND(\"]\",CELL(\"filename\",A1))))","v":"Resulting List"}]
[{"$f":"Model_Name","v":"SP Dynamic Data Validation.xlsm"}]
["Navigator"]
[null,null,null,null,"Error Checks:",null,null,null,{"$f":"Overall_Error_Check","v":0}]
[]
[null,{"$f":"MAX($B$5:$B5)+1","v":1},"Example"]
[]
[null,null,{"$f":"A1","v":"Resulting List"}]
[]
[null,null,null,"Workings"]
[]
[null,null,null,null,"We don't recommend you put these on an output page in general."]
[]
[null,null,null,null,null,"Cell in row above first list",null,null,{"$f":"Data!I12","v":"Lists"},null,{"$f":"IFERROR(_xlfn.FORMULATEXT(I14),\"\")","v":"=Data!I12"}]
[null,null,null,null,null,"Formula",null,null,{"$f":"IFERROR(_xlfn.FORMULATEXT(I14),\"\")","v":"=Data!I12"},null,{"$f":"IFERROR(_xlfn.FORMULATEXT(I15),\"\")","v":"=IFERROR(FORMULATEXT(I14),\"\")"}]
[null,null,null,null,null,"Sheet name and column",null,null,{"$f":"MID(I15,2,LEN(I15)-LEN(I17)-1)","v":"Data!I"},null,"=MID(I15,2,LEN(I15)-LEN(I17)-1)"]
[null,null,null,null,null,"Row number",null,null,{"$f":"ROW(Data!I12)","v":12},null,"=ROW(Data!I12)"]
[]
[]
[null,null,null,"Outputs"]
[]
[null,null,null,null,"Helper","Customers"]
[null,null,null,null,{"$f":"$I$16&($I$17+ROWS($E$22:$E22))&\"#\"","v":"Data!I13#"}]
[null,null,null,null,{"$f":"$I$16&($I$17+ROWS($E$22:$E23))&\"#\"","v":"Data!I14#"}]
[null,null,null,null,{"$f":"$I$16&($I$17+ROWS($E$22:$E24))&\"#\"","v":"Data!I15#"}]
[null,null,null,null,{"$f":"$I$16&($I$17+ROWS($E$22:$E25))&\"#\"","v":"Data!I16#"}]
[null,null,null,null,{"$f":"$I$16&($I$17+ROWS($E$22:$E26))&\"#\"","v":"Data!I17#"}]
[null,null,null,null,{"$f":"$I$16&($I$17+ROWS($E$22:$E27))&\"#\"","v":"Data!I18#"}]
[null,null,null,null,{"$f":"$I$16&($I$17+ROWS($E$22:$E28))&\"#\"","v":"Data!I19#"}]
[null,null,null,null,{"$f":"$I$16&($I$17+ROWS($E$22:$E29))&\"#\"","v":"Data!I20#"}]
[null,null,null,null,{"$f":"$I$16&($I$17+ROWS($E$22:$E30))&\"#\"","v":"Data!I21#"}]
[null,null,null,null,{"$f":"$I$16&($I$17+ROWS($E$22:$E31))&\"#\"","v":"Data!I22#"}]
[null,null,null,null,{"$f":"$I$16&($I$17+ROWS($E$22:$E32))&\"#\"","v":"Data!I23#"}]
[null,null,null,null,{"$f":"$I$16&($I$17+ROWS($E$22:$E33))&\"#\"","v":"Data!I24#"}]
[null,null,null,null,{"$f":"$I$16&($I$17+ROWS($E$22:$E34))&\"#\"","v":"Data!I25#"}]
[null,null,null,null,{"$f":"$I$16&($I$17+ROWS($E$22:$E35))&\"#\"","v":"Data!I26#"}]
[null,null,null,null,{"$f":"$I$16&($I$17+ROWS($E$22:$E36))&\"#\"","v":"Data!I27#"}]
[null,null,null,null,{"$f":"$I$16&($I$17+ROWS($E$22:$E37))&\"#\"","v":"Data!I28#"}]
[null,null,null,null,{"$f":"$I$16&($I$17+ROWS($E$22:$E38))&\"#\"","v":"Data!I29#"}]
[null,null,null,null,{"$f":"$I$16&($I$17+ROWS($E$22:$E39))&\"#\"","v":"Data!I30#"}]
[null,null,null,null,{"$f":"$I$16&($I$17+ROWS($E$22:$E40))&\"#\"","v":"Data!I31#"}]
[null,null,null,null,{"$f":"$I$16&($I$17+ROWS($E$22:$E41))&\"#\"","v":"Data!I32#"}]
[null,null,null,null,{"$f":"$I$16&($I$17+ROWS($E$22:$E42))&\"#\"","v":"Data!I33#"}]
[null,null,null,null,{"$f":"$I$16&($I$17+ROWS($E$22:$E43))&\"#\"","v":"Data!I34#"}]
[null,null,null,null,{"$f":"$I$16&($I$17+ROWS($E$22:$E44))&\"#\"","v":"Data!I35#"}]
[null,null,null,null,{"$f":"$I$16&($I$17+ROWS($E$22:$E45))&\"#\"","v":"Data!I36#"}]
[null,null,null,null,{"$f":"$I$16&($I$17+ROWS($E$22:$E46))&\"#\"","v":"Data!I37#"}]
[null,null,null,null,{"$f":"$I$16&($I$17+ROWS($E$22:$E47))&\"#\"","v":"Data!I38#"}]
[null,null,null,null,{"$f":"$I$16&($I$17+ROWS($E$22:$E48))&\"#\"","v":"Data!I39#"}]
[null,null,null,null,{"$f":"$I$16&($I$17+ROWS($E$22:$E49))&\"#\"","v":"Data!I40#"}]
[null,null,null,null,{"$f":"$I$16&($I$17+ROWS($E$22:$E50))&\"#\"","v":"Data!I41#"}]
[null,null,null,null,{"$f":"$I$16&($I$17+ROWS($E$22:$E51))&\"#\"","v":"Data!I42#"}]
[null,null,null,null,{"$f":"$I$16&($I$17+ROWS($E$22:$E52))&\"#\"","v":"Data!I43#"}]
[null,null,null,null,{"$f":"$I$16&($I$17+ROWS($E$22:$E53))&\"#\"","v":"Data!I44#"}]
[null,null,null,null,{"$f":"$I$16&($I$17+ROWS($E$22:$E54))&\"#\"","v":"Data!I45#"}]
[null,null,null,null,{"$f":"$I$16&($I$17+ROWS($E$22:$E55))&\"#\"","v":"Data!I46#"}]
[null,null,null,null,{"$f":"$I$16&($I$17+ROWS($E$22:$E56))&\"#\"","v":"Data!I47#"}]
[null,null,null,null,{"$f":"$I$16&($I$17+ROWS($E$22:$E57))&\"#\"","v":"Data!I48#"}]
[null,null,null,null,{"$f":"$I$16&($I$17+ROWS($E$22:$E58))&\"#\"","v":"Data!I49#"}]
[null,null,null,null,{"$f":"$I$16&($I$17+ROWS($E$22:$E59))&\"#\"","v":"Data!I50#"}]
[null,null,null,null,{"$f":"$I$16&($I$17+ROWS($E$22:$E60))&\"#\"","v":"Data!I51#"}]
[null,null,null,null,{"$f":"$I$16&($I$17+ROWS($E$22:$E61))&\"#\"","v":"Data!I52#"}]
[null,null,null,null,{"$f":"$I$16&($I$17+ROWS($E$22:$E62))&\"#\"","v":"Data!I53#"}]
[null,null,null,null,{"$f":"$I$16&($I$17+ROWS($E$22:$E63))&\"#\"","v":"Data!I54#"}]
[null,null,null,null,{"$f":"$I$16&($I$17+ROWS($E$22:$E64))&\"#\"","v":"Data!I55#"}]
[null,null,null,null,{"$f":"$I$16&($I$17+ROWS($E$22:$E65))&\"#\"","v":"Data!I56#"}]
[null,null,null,null,{"$f":"$I$16&($I$17+ROWS($E$22:$E66))&\"#\"","v":"Data!I57#"}]
[null,null,null,null,{"$f":"$I$16&($I$17+ROWS($E$22:$E67))&\"#\"","v":"Data!I58#"}]
[null,null,null,null,{"$f":"$I$16&($I$17+ROWS($E$22:$E68))&\"#\"","v":"Data!I59#"}]
[null,null,null,null,{"$f":"$I$16&($I$17+ROWS($E$22:$E69))&\"#\"","v":"Data!I60#"}]
[null,null,null,null,{"$f":"$I$16&($I$17+ROWS($E$22:$E70))&\"#\"","v":"Data!I61#"}]
[null,null,null,null,{"$f":"$I$16&($I$17+ROWS($E$22:$E71))&\"#\"","v":"Data!I62#"}]
[null,null,null,null,{"$f":"$I$16&($I$17+ROWS($E$22:$E72))&\"#\"","v":"Data!I63#"}]
[null,null,null,null,{"$f":"$I$16&($I$17+ROWS($E$22:$E73))&\"#\"","v":"Data!I64#"}]
[null,null,null,null,{"$f":"$I$16&($I$17+ROWS($E$22:$E74))&\"#\"","v":"Data!I65#"}]
[null,null,null,null,{"$f":"$I$16&($I$17+ROWS($E$22:$E75))&\"#\"","v":"Data!I66#"}]
[null,null,null,null,{"$f":"$I$16&($I$17+ROWS($E$22:$E76))&\"#\"","v":"Data!I67#"}]
[null,null,null,null,{"$f":"$I$16&($I$17+ROWS($E$22:$E77))&\"#\"","v":"Data!I68#"}]
[null,null,null,null,{"$f":"$I$16&($I$17+ROWS($E$22:$E78))&\"#\"","v":"Data!I69#"}]
[null,null,null,null,{"$f":"$I$16&($I$17+ROWS($E$22:$E79))&\"#\"","v":"Data!I70#"}]
[null,null,null,null,{"$f":"$I$16&($I$17+ROWS($E$22:$E80))&\"#\"","v":"Data!I71#"}]
[null,null,null,null,{"$f":"$I$16&($I$17+ROWS($E$22:$E81))&\"#\"","v":"Data!I72#"}]
[null,null,null,null,{"$f":"$I$16&($I$17+ROWS($E$22:$E82))&\"#\"","v":"Data!I73#"}]
[null,null,null,null,{"$f":"$I$16&($I$17+ROWS($E$22:$E83))&\"#\"","v":"Data!I74#"}]
[null,null,null,null,{"$f":"$I$16&($I$17+ROWS($E$22:$E84))&\"#\"","v":"Data!I75#"}]
[null,null,null,null,{"$f":"$I$16&($I$17+ROWS($E$22:$E85))&\"#\"","v":"Data!I76#"}]
[null,null,null,null,{"$f":"$I$16&($I$17+ROWS($E$22:$E86))&\"#\"","v":"Data!I77#"}]
[null,null,null,null,{"$f":"$I$16&($I$17+ROWS($E$22:$E87))&\"#\"","v":"Data!I78#"}]
[null,null,null,null,{"$f":"$I$16&($I$17+ROWS($E$22:$E88))&\"#\"","v":"Data!I79#"}]
[null,null,null,null,{"$f":"$I$16&($I$17+ROWS($E$22:$E89))&\"#\"","v":"Data!I80#"}]
[null,null,null,null,{"$f":"$I$16&($I$17+ROWS($E$22:$E90))&\"#\"","v":"Data!I81#"}]
[null,null,null,null,{"$f":"$I$16&($I$17+ROWS($E$22:$E91))&\"#\"","v":"Data!I82#"}]
[null,null,null,null,{"$f":"$I$16&($I$17+ROWS($E$22:$E92))&\"#\"","v":"Data!I83#"}]
[null,null,null,null,{"$f":"$I$16&($I$17+ROWS($E$22:$E93))&\"#\"","v":"Data!I84#"}]
[null,null,null,null,{"$f":"$I$16&($I$17+ROWS($E$22:$E94))&\"#\"","v":"Data!I85#"}]
[null,null,null,null,{"$f":"$I$16&($I$17+ROWS($E$22:$E95))&\"#\"","v":"Data!I86#"}]
[null,null,null,null,{"$f":"$I$16&($I$17+ROWS($E$22:$E96))&\"#\"","v":"Data!I87#"}]
[null,null,null,null,{"$f":"$I$16&($I$17+ROWS($E$22:$E97))&\"#\"","v":"Data!I88#"}]
[null,null,null,null,{"$f":"$I$16&($I$17+ROWS($E$22:$E98))&\"#\"","v":"Data!I89#"}]
[null,null,null,null,{"$f":"$I$16&($I$17+ROWS($E$22:$E99))&\"#\"","v":"Data!I90#"}]
[null,null,null,null,{"$f":"$I$16&($I$17+ROWS($E$22:$E100))&\"#\"","v":"Data!I91#"}]
[null,null,null,null,{"$f":"$I$16&($I$17+ROWS($E$22:$E101))&\"#\"","v":"Data!I92#"}]
[null,null,null,null,{"$f":"$I$16&($I$17+ROWS($E$22:$E102))&\"#\"","v":"Data!I93#"}]
[null,null,null,null,{"$f":"$I$16&($I$17+ROWS($E$22:$E103))&\"#\"","v":"Data!I94#"}]
[null,null,null,null,{"$f":"$I$16&($I$17+ROWS($E$22:$E104))&\"#\"","v":"Data!I95#"}]
[null,null,null,null,{"$f":"$I$16&($I$17+ROWS($E$22:$E105))&\"#\"","v":"Data!I96#"}]
[null,null,null,null,{"$f":"$I$16&($I$17+ROWS($E$22:$E106))&\"#\"","v":"Data!I97#"}]
[null,null,null,null,{"$f":"$I$16&($I$17+ROWS($E$22:$E107))&\"#\"","v":"Data!I98#"}]
[null,null,null,null,{"$f":"$I$16&($I$17+ROWS($E$22:$E108))&\"#\"","v":"Data!I99#"}]
[null,null,null,null,{"$f":"$I$16&($I$17+ROWS($E$22:$E109))&\"#\"","v":"Data!I100#"}]
[null,null,null,null,{"$f":"$I$16&($I$17+ROWS($E$22:$E110))&\"#\"","v":"Data!I101#"}]
[null,null,null,null,{"$f":"$I$16&($I$17+ROWS($E$22:$E111))&\"#\"","v":"Data!I102#"}]
[null,null,null,null,{"$f":"$I$16&($I$17+ROWS($E$22:$E112))&\"#\"","v":"Data!I103#"}]
[null,null,null,null,{"$f":"$I$16&($I$17+ROWS($E$22:$E113))&\"#\"","v":"Data!I104#"}]
[null,null,null,null,{"$f":"$I$16&($I$17+ROWS($E$22:$E114))&\"#\"","v":"Data!I105#"}]
[null,null,null,null,{"$f":"$I$16&($I$17+ROWS($E$22:$E115))&\"#\"","v":"Data!I106#"}]
[null,null,null,null,{"$f":"$I$16&($I$17+ROWS($E$22:$E116))&\"#\"","v":"Data!I107#"}]
[null,null,null,null,{"$f":"$I$16&($I$17+ROWS($E$22:$E117))&\"#\"","v":"Data!I108#"}]
[null,null,null,null,{"$f":"$I$16&($I$17+ROWS($E$22:$E118))&\"#\"","v":"Data!I109#"}]
[null,null,null,null,{"$f":"$I$16&($I$17+ROWS($E$22:$E119))&\"#\"","v":"Data!I110#"}]
[null,null,null,null,{"$f":"$I$16&($I$17+ROWS($E$22:$E120))&\"#\"","v":"Data!I111#"}]
[null,null,null,null,{"$f":"$I$16&($I$17+ROWS($E$22:$E121))&\"#\"","v":"Data!I112#"}]
[null,null,null,null,{"$f":"$I$16&($I$17+ROWS($E$22:$E122))&\"#\"","v":"Data!I113#"}]
[null,null,null,null,{"$f":"$I$16&($I$17+ROWS($E$22:$E123))&\"#\"","v":"Data!I114#"}]
[null,null,null,null,{"$f":"$I$16&($I$17+ROWS($E$22:$E124))&\"#\"","v":"Data!I115#"}]
[null,null,null,null,{"$f":"$I$16&($I$17+ROWS($E$22:$E125))&\"#\"","v":"Data!I116#"}]
[null,null,null,null,{"$f":"$I$16&($I$17+ROWS($E$22:$E126))&\"#\"","v":"Data!I117#"}]
[null,null,null,null,{"$f":"$I$16&($I$17+ROWS($E$22:$E127))&\"#\"","v":"Data!I118#"}]
[null,null,null,null,{"$f":"$I$16&($I$17+ROWS($E$22:$E128))&\"#\"","v":"Data!I119#"}]
[null,null,null,null,{"$f":"$I$16&($I$17+ROWS($E$22:$E129))&\"#\"","v":"Data!I120#"}]
[null,null,null,null,{"$f":"$I$16&($I$17+ROWS($E$22:$E130))&\"#\"","v":"Data!I121#"}]
[null,null,null,null,{"$f":"$I$16&($I$17+ROWS($E$22:$E131))&\"#\"","v":"Data!I122#"}]
[null,null,null,null,{"$f":"$I$16&($I$17+ROWS($E$22:$E132))&\"#\"","v":"Data!I123#"}]
[null,null,null,null,{"$f":"$I$16&($I$17+ROWS($E$22:$E133))&\"#\"","v":"Data!I124#"}]
[null,null,null,null,{"$f":"$I$16&($I$17+ROWS($E$22:$E134))&\"#\"","v":"Data!I125#"}]
[null,null,null,null,{"$f":"$I$16&($I$17+ROWS($E$22:$E135))&\"#\"","v":"Data!I126#"}]
[null,null,null,null,{"$f":"$I$16&($I$17+ROWS($E$22:$E136))&\"#\"","v":"Data!I127#"}]
[null,null,null,null,{"$f":"$I$16&($I$17+ROWS($E$22:$E137))&\"#\"","v":"Data!I128#"}]
[null,null,null,null,{"$f":"$I$16&($I$17+ROWS($E$22:$E138))&\"#\"","v":"Data!I129#"}]
[null,null,null,null,{"$f":"$I$16&($I$17+ROWS($E$22:$E139))&\"#\"","v":"Data!I130#"}]
[null,null,null,null,{"$f":"$I$16&($I$17+ROWS($E$22:$E140))&\"#\"","v":"Data!I131#"}]
[null,null,null,null,{"$f":"$I$16&($I$17+ROWS($E$22:$E141))&\"#\"","v":"Data!I132#"}]
[null,null,null,null,{"$f":"$I$16&($I$17+ROWS($E$22:$E142))&\"#\"","v":"Data!I133#"}]
[null,null,null,null,{"$f":"$I$16&($I$17+ROWS($E$22:$E143))&\"#\"","v":"Data!I134#"}]
[null,null,null,null,{"$f":"$I$16&($I$17+ROWS($E$22:$E144))&\"#\"","v":"Data!I135#"}]
[null,null,null,null,{"$f":"$I$16&($I$17+ROWS($E$22:$E145))&\"#\"","v":"Data!I136#"}]
[null,null,null,null,{"$f":"$I$16&($I$17+ROWS($E$22:$E146))&\"#\"","v":"Data!I137#"}]
[null,null,null,null,{"$f":"$I$16&($I$17+ROWS($E$22:$E147))&\"#\"","v":"Data!I138#"}]
[null,null,null,null,{"$f":"$I$16&($I$17+ROWS($E$22:$E148))&\"#\"","v":"Data!I139#"}]
[null,null,null,null,{"$f":"$I$16&($I$17+ROWS($E$22:$E149))&\"#\"","v":"Data!I140#"}]
[null,null,null,null,{"$f":"$I$16&($I$17+ROWS($E$22:$E150))&\"#\"","v":"Data!I141#"}]
[null,null,null,null,{"$f":"$I$16&($I$17+ROWS($E$22:$E151))&\"#\"","v":"Data!I142#"}]
[null,null,null,null,{"$f":"$I$16&($I$17+ROWS($E$22:$E152))&\"#\"","v":"Data!I143#"}]
[null,null,null,null,{"$f":"$I$16&($I$17+ROWS($E$22:$E153))&\"#\"","v":"Data!I144#"}]
[null,null,null,null,{"$f":"$I$16&($I$17+ROWS($E$22:$E154))&\"#\"","v":"Data!I145#"}]
[null,null,null,null,{"$f":"$I$16&($I$17+ROWS($E$22:$E155))&\"#\"","v":"Data!I146#"}]
[null,null,null,null,{"$f":"$I$16&($I$17+ROWS($E$22:$E156))&\"#\"","v":"Data!I147#"}]
[null,null,null,null,{"$f":"$I$16&($I$17+ROWS($E$22:$E157))&\"#\"","v":"Data!I148#"}]
[null,null,null,null,{"$f":"$I$16&($I$17+ROWS($E$22:$E158))&\"#\"","v":"Data!I149#"}]
[null,null,null,null,{"$f":"$I$16&($I$17+ROWS($E$22:$E159))&\"#\"","v":"Data!I150#"}]
[null,null,null,null,{"$f":"$I$16&($I$17+ROWS($E$22:$E160))&\"#\"","v":"Data!I151#"}]
[null,null,null,null,{"$f":"$I$16&($I$17+ROWS($E$22:$E161))&\"#\"","v":"Data!I152#"}]
[null,null,null,null,{"$f":"$I$16&($I$17+ROWS($E$22:$E162))&\"#\"","v":"Data!I153#"}]
[null,null,null,null,{"$f":"$I$16&($I$17+ROWS($E$22:$E163))&\"#\"","v":"Data!I154#"}]
[null,null,null,null,{"$f":"$I$16&($I$17+ROWS($E$22:$E164))&\"#\"","v":"Data!I155#"}]
[null,null,null,null,{"$f":"$I$16&($I$17+ROWS($E$22:$E165))&\"#\"","v":"Data!I156#"}]
[null,null,null,null,{"$f":"$I$16&($I$17+ROWS($E$22:$E166))&\"#\"","v":"Data!I157#"}]
[null,null,null,null,{"$f":"$I$16&($I$17+ROWS($E$22:$E167))&\"#\"","v":"Data!I158#"}]
[null,null,null,null,{"$f":"$I$16&($I$17+ROWS($E$22:$E168))&\"#\"","v":"Data!I159#"}]
[null,null,null,null,{"$f":"$I$16&($I$17+ROWS($E$22:$E169))&\"#\"","v":"Data!I160#"}]
[null,null,null,null,{"$f":"$I$16&($I$17+ROWS($E$22:$E170))&\"#\"","v":"Data!I161#"}]
[null,null,null,null,{"$f":"$I$16&($I$17+ROWS($E$22:$E171))&\"#\"","v":"Data!I162#"}]
[null,null,null,null,{"$f":"$I$16&($I$17+ROWS($E$22:$E172))&\"#\"","v":"Data!I163#"}]
[null,null,null,null,{"$f":"$I$16&($I$17+ROWS($E$22:$E173))&\"#\"","v":"Data!I164#"}]
[null,null,null,null,{"$f":"$I$16&($I$17+ROWS($E$22:$E174))&\"#\"","v":"Data!I165#"}]
[null,null,null,null,{"$f":"$I$16&($I$17+ROWS($E$22:$E175))&\"#\"","v":"Data!I166#"}]
[null,null,null,null,{"$f":"$I$16&($I$17+ROWS($E$22:$E176))&\"#\"","v":"Data!I167#"}]
[null,null,null,null,{"$f":"$I$16&($I$17+ROWS($E$22:$E177))&\"#\"","v":"Data!I168#"}]
[null,null,null,null,{"$f":"$I$16&($I$17+ROWS($E$22:$E178))&\"#\"","v":"Data!I169#"}]
[null,null,null,null,{"$f":"$I$16&($I$17+ROWS($E$22:$E179))&\"#\"","v":"Data!I170#"}]
[null,null,null,null,{"$f":"$I$16&($I$17+ROWS($E$22:$E180))&\"#\"","v":"Data!I171#"}]
[null,null,null,null,{"$f":"$I$16&($I$17+ROWS($E$22:$E181))&\"#\"","v":"Data!I172#"}]
[null,null,null,null,{"$f":"$I$16&($I$17+ROWS($E$22:$E182))&\"#\"","v":"Data!I173#"}]
[null,null,null,null,{"$f":"$I$16&($I$17+ROWS($E$22:$E183))&\"#\"","v":"Data!I174#"}]
[null,null,null,null,{"$f":"$I$16&($I$17+ROWS($E$22:$E184))&\"#\"","v":"Data!I175#"}]
[null,null,null,null,{"$f":"$I$16&($I$17+ROWS($E$22:$E185))&\"#\"","v":"Data!I176#"}]
[null,null,null,null,{"$f":"$I$16&($I$17+ROWS($E$22:$E186))&\"#\"","v":"Data!I177#"}]
[null,null,null,null,{"$f":"$I$16&($I$17+ROWS($E$22:$E187))&\"#\"","v":"Data!I178#"}]
[null,null,null,null,{"$f":"$I$16&($I$17+ROWS($E$22:$E188))&\"#\"","v":"Data!I179#"}]
[null,null,null,null,{"$f":"$I$16&($I$17+ROWS($E$22:$E189))&\"#\"","v":"Data!I180#"}]
[null,null,null,null,{"$f":"$I$16&($I$17+ROWS($E$22:$E190))&\"#\"","v":"Data!I181#"}]
[null,null,null,null,{"$f":"$I$16&($I$17+ROWS($E$22:$E191))&\"#\"","v":"Data!I182#"}]
[null,null,null,null,{"$f":"$I$16&($I$17+ROWS($E$22:$E192))&\"#\"","v":"Data!I183#"}]
[null,null,null,null,{"$f":"$I$16&($I$17+ROWS($E$22:$E193))&\"#\"","v":"Data!I184#"}]
[null,null,null,null,{"$f":"$I$16&($I$17+ROWS($E$22:$E194))&\"#\"","v":"Data!I185#"}]
[null,null,null,null,{"$f":"$I$16&($I$17+ROWS($E$22:$E195))&\"#\"","v":"Data!I186#"}]
[null,null,null,null,{"$f":"$I$16&($I$17+ROWS($E$22:$E196))&\"#\"","v":"Data!I187#"}]
[null,null,null,null,{"$f":"$I$16&($I$17+ROWS($E$22:$E197))&\"#\"","v":"Data!I188#"}]
[null,null,null,null,{"$f":"$I$16&($I$17+ROWS($E$22:$E198))&\"#\"","v":"Data!I189#"}]
[null,null,null,null,{"$f":"$I$16&($I$17+ROWS($E$22:$E199))&\"#\"","v":"Data!I190#"}]
[null,null,null,null,{"$f":"$I$16&($I$17+ROWS($E$22:$E200))&\"#\"","v":"Data!I191#"}]
[null,null,null,null,{"$f":"$I$16&($I$17+ROWS($E$22:$E201))&\"#\"","v":"Data!I192#"}]
[null,null,null,null,{"$f":"$I$16&($I$17+ROWS($E$22:$E202))&\"#\"","v":"Data!I193#"}]
[null,null,null,null,{"$f":"$I$16&($I$17+ROWS($E$22:$E203))&\"#\"","v":"Data!I194#"}]
[null,null,null,null,{"$f":"$I$16&($I$17+ROWS($E$22:$E204))&\"#\"","v":"Data!I195#"}]
[null,null,null,null,{"$f":"$I$16&($I$17+ROWS($E$22:$E205))&\"#\"","v":"Data!I196#"}]
[null,null,null,null,{"$f":"$I$16&($I$17+ROWS($E$22:$E206))&\"#\"","v":"Data!I197#"}]
[null,null,null,null,{"$f":"$I$16&($I$17+ROWS($E$22:$E207))&\"#\"","v":"Data!I198#"}]
[null,null,null,null,{"$f":"$I$16&($I$17+ROWS($E$22:$E208))&\"#\"","v":"Data!I199#"}]
[null,null,null,null,{"$f":"$I$16&($I$17+ROWS($E$22:$E209))&\"#\"","v":"Data!I200#"}]
[null,null,null,null,{"$f":"$I$16&($I$17+ROWS($E$22:$E210))&\"#\"","v":"Data!I201#"}]
[null,null,null,null,{"$f":"$I$16&($I$17+ROWS($E$22:$E211))&\"#\"","v":"Data!I202#"}]
[null,null,null,null,{"$f":"$I$16&($I$17+ROWS($E$22:$E212))&\"#\"","v":"Data!I203#"}]
[null,null,null,null,{"$f":"$I$16&($I$17+ROWS($E$22:$E213))&\"#\"","v":"Data!I204#"}]
[null,null,null,null,{"$f":"$I$16&($I$17+ROWS($E$22:$E214))&\"#\"","v":"Data!I205#"}]
[null,null,null,null,{"$f":"$I$16&($I$17+ROWS($E$22:$E215))&\"#\"","v":"Data!I206#"}]
[null,null,null,null,{"$f":"$I$16&($I$17+ROWS($E$22:$E216))&\"#\"","v":"Data!I207#"}]
[null,null,null,null,{"$f":"$I$16&($I$17+ROWS($E$22:$E217))&\"#\"","v":"Data!I208#"}]
[null,null,null,null,{"$f":"$I$16&($I$17+ROWS($E$22:$E218))&\"#\"","v":"Data!I209#"}]
[null,null,null,null,{"$f":"$I$16&($I$17+ROWS($E$22:$E219))&\"#\"","v":"Data!I210#"}]
[null,null,null,null,{"$f":"$I$16&($I$17+ROWS($E$22:$E220))&\"#\"","v":"Data!I211#"}]
[null,null,null,null,{"$f":"$I$16&($I$17+ROWS($E$22:$E221))&\"#\"","v":"Data!I212#"}]

{"sheet":"Data","index":5,"n_rows":212,"n_cols":209,"rows_kept":212,"cut":false,"hidden":false,"merged":[[2,0,2,4]]}
[{"$f":"IF(ISERROR(RIGHT(CELL(\"filename\",A1),LEN(CELL(\"filename\",A1))-FIND(\"]\",CELL(\"filename\",A1)))),\n\"\",\nRIGHT(CELL(\"filename\",A1),LEN(CELL(\"filename\",A1))-FIND(\"]\",CELL(\"filename\",A1))))","v":"Data"}]
[{"$f":"Model_Name","v":"SP Dynamic Data Validation.xlsm"}]
["Navigator"]
[null,null,null,null,"Error Checks:",null,null,null,{"$f":"Overall_Error_Check","v":0}]
[]
[null,{"$f":"MAX($B$5:$B5)+1","v":1},"Data for Data Validation List"]
[]
[null,null,"Assumptions"]
[]
[null,null,null,"Fictitious Data"]
[]
[null,null,null,null,null,"Names","Search Criteria",null,"Lists",null,null,null,null,null,null,null,null,null,null,null,null,null,null,null,null,null,null,null,null,null,null,null,null,null,null,null,null,null,null,null,null,null,null,null,null,null,null,null,null,null,null,null,null,null,null,null,null,null,null,null,null,null,null,null,null,null,null,null,null,null,null,null,null,null,null,null,null,null,null,null,null,null,null,null,null,null,null,null,null,null,null,null,null,null,null,null,null,null,null,null,null,null,null,null,null,null,null,null,null,null,null,null,null,null,null,null,null,null,null,null,null,null,null,null,null,null,null,null,null,null,null,null,null,null,null,null,null,null,null,null,null,null,null,null,null,null,null,null,null,null,null,null,null,null,null,null,null,null,null,null,null,null,null,null,null,null,null,null,null,null,null,null,null,null,null,null,null,null,null,null,null,null,null,null,null,null,null,null,null,null,null,null,null,null,null,null,null,null,null,null,null,null,null,null,null,null,null,null," "]
[null,null,null,null,null,"Claudio Lam",{"$f":"IF('Resulting List'!F23=\"\",\"\",'Resulting List'!F23)","v":""},null,{"$f":"TRANSPOSE(_xlfn._xlws.SORT(_xlfn.UNIQUE(_xlfn._xlws.FILTER(Customers[Names],ISNUMBER(SEARCH(Customers[[#This Row],[Search Criteria]],Customers[Names])),\"No data.\"))))","v":"Adriana Todd"},"Albert Ramirez","Alex Rubio","Amanda Beck","Amparo Orozco","Amy Todd","Angelina Roberson","April Fox","Arden Ayala","Arnoldo Pennington","Aubrey Giles","Bette Rivers","Brianna Alexander","Brianna Mora","Britt Vazquez","Broderick Gillespie","Brooke Roman","Calvin Buck","Carmela Mullins","Carol Stevenson","Carolina Russell","Carolyn Roberts","Chelsea Gilbert","Cheryl Williamson","Christa Frederick","Christian Armstrong","Christopher Stuart","Chung Krueger","Clare Whitney","Clarissa Archer","Claudio Lam","Cordell Mills","Craig Shepherd","Damien Kramer","Dane Burke","Danielle Stout","Darrel Liu","Darrin Mcneil","Darron Aguilar","Della Huber","Delores Krause","Dena Rosario","Dominick Johnston","Dona Herring","Dorothy Winters","Douglas Wiley","Doyle David","Earlene Hester","Earline Shepherd","Edwin Sparks","Eli Galvan","Elinor Kaufman","Elroy Porter","Elvin Flynn","Emmitt Porter","Erik Parsons","Ethel Forbes","Felicia Ware","Fidel Haynes","Francisco Valenzuela","Frank Hunt","Gabriela Moore","Gabrielle Patrick","Gale Fitzpatrick","Gayle Curtis","Genevieve Lucero","Gerry Oneal","Grady Ellis","Grover Escobar","Hans Patel","Horacio Black","Humberto Compton","Hunter Short","Ilene Mcguire","Imelda Lloyd","Ira Macdonald","Issac Allen","Jacques Velazquez","Janis Mullins","Janna Cowan","Javier Garner","Jayson Abbott","Jeannie Tapia","Jefferson Lee","Jeramy Keith","Jermaine Bradshaw","Jewel Lee","Jimmie Yang","Jodie Wood","John Cline","Josefina Dickerson","Josie Pineda","Judith Griffin","Julius Soto","Kelli Romero","Kerri Joseph","Kim Mccall","Lakeisha Velazquez","Latonya Logan","Lee Schmidt","Lela Atkins","Leland Robertson","Leonardo House","Leroy Mcintyre","Lesley Blevins","Lilia Berg","Lilly Stone","Lincoln Bond","Lindsay Hurst","Lionel Fuller","Lorene Hunter","Louis Kidd","Lucius Warren","Lucy Mejia","Lupe Ingram","Lynette Fuller","Lynnette Wright","Madge Copeland","Madge Tanner","Mae Sawyer","Malcolm Newman","Mamie Wong","Mandy Swanson","Marcella Everett","Marco Bright","Marcos Schaefer","Marcus Hays","Marina Walsh","Marion Savage","Marylou Bass","Marylou Mccarthy","Mathew Howard","Maurice Jacobson","Mauricio Bautista","Max Smith","Melanie Bridges","Melissa Brandt","Merlin Wu","Michel Simpson","Mickey Kennedy","Mike Sloan","Milton Walsh","Mohamed Allison","Mohammad Christensen","Nadia Macdonald","Naomi Snyder","Ned Lowe","Nettie Leonard","Olive Perkins","Ophelia Morrow","Oren Montes","Orlando Henderson","Owen Buchanan","Paul Norman","Rafael Barrett","Raymond Cochran","Reed Hooper","Reinaldo Houston","Renato Simmons","Rene Calhoun","Reva Hardin","Robert French","Robin Bender","Rodolfo Scott","Roland Blake","Roland Sullivan","Rolf Barnett","Ross Marquez","Ruthie Daugherty","Sandra Potts","Scott Stephenson","Scotty Gonzales","Sean Wiggins","Shana Gallagher","Sharron Montes","Sheryl Lindsey","Socorro Hayden","Solomon Andrade","Stacey Whitehead","Stevie Hale","Stuart Oliver","Stuart Riddle","Tammy Merritt","Theo Wiley","Theresa Murillo","Timothy Roberts","Tony Torres","Tracy Logan","Troy Hoover","Twila Rubio","Velma Everett","Vincent Mccormick","Vincenzo Stafford","Vito Clark","Waldo Spencer","Werner Lowe","Werner Shepard","Wesley Ford","Wm Cantu","Zelma Pierce"]
[null,null,null,null,null,"Josefina Dickerson",{"$f":"IF('Resulting List'!F24=\"\",\"\",'Resulting List'!F24)","v":""},null,{"$f":"TRANSPOSE(_xlfn._xlws.SORT(_xlfn.UNIQUE(_xlfn._xlws.FILTER(Customers[Names],ISNUMBER(SEARCH(Customers[[#This Row],[Search Criteria]],Customers[Names])),\"No data.\"))))","v":"Adriana Todd"},"Albert Ramirez","Alex Rubio","Amanda Beck","Amparo Orozco","Amy Todd","Angelina Roberson","April Fox","Arden Ayala","Arnoldo Pennington","Aubrey Giles","Bette Rivers","Brianna Alexander","Brianna Mora","Britt Vazquez","Broderick Gillespie","Brooke Roman","Calvin Buck","Carmela Mullins","Carol Stevenson","Carolina Russell","Carolyn Roberts","Chelsea Gilbert","Cheryl Williamson","Christa Frederick","Christian Armstrong","Christopher Stuart","Chung Krueger","Clare Whitney","Clarissa Archer","Claudio Lam","Cordell Mills","Craig Shepherd","Damien Kramer","Dane Burke","Danielle Stout","Darrel Liu","Darrin Mcneil","Darron Aguilar","Della Huber","Delores Krause","Dena Rosario","Dominick Johnston","Dona Herring","Dorothy Winters","Douglas Wiley","Doyle David","Earlene Hester","Earline Shepherd","Edwin Sparks","Eli Galvan","Elinor Kaufman","Elroy Porter","Elvin Flynn","Emmitt Porter","Erik Parsons","Ethel Forbes","Felicia Ware","Fidel Haynes","Francisco Valenzuela","Frank Hunt","Gabriela Moore","Gabrielle Patrick","Gale Fitzpatrick","Gayle Curtis","Genevieve Lucero","Gerry Oneal","Grady Ellis","Grover Escobar","Hans Patel","Horacio Black","Humberto Compton","Hunter Short","Ilene Mcguire","Imelda Lloyd","Ira Macdonald","Issac Allen","Jacques Velazquez","Janis Mullins","Janna Cowan","Javier Garner","Jayson Abbott","Jeannie Tapia","Jefferson Lee","Jeramy Keith","Jermaine Bradshaw","Jewel Lee","Jimmie Yang","Jodie Wood","John Cline","Josefina Dickerson","Josie Pineda","Judith Griffin","Julius Soto","Kelli Romero","Kerri Joseph","Kim Mccall","Lakeisha Velazquez","Latonya Logan","Lee Schmidt","Lela Atkins","Leland Robertson","Leonardo House","Leroy Mcintyre","Lesley Blevins","Lilia Berg","Lilly Stone","Lincoln Bond","Lindsay Hurst","Lionel Fuller","Lorene Hunter","Louis Kidd","Lucius Warren","Lucy Mejia","Lupe Ingram","Lynette Fuller","Lynnette Wright","Madge Copeland","Madge Tanner","Mae Sawyer","Malcolm Newman","Mamie Wong","Mandy Swanson","Marcella Everett","Marco Bright","Marcos Schaefer","Marcus Hays","Marina Walsh","Marion Savage","Marylou Bass","Marylou Mccarthy","Mathew Howard","Maurice Jacobson","Mauricio Bautista","Max Smith","Melanie Bridges","Melissa Brandt","Merlin Wu","Michel Simpson","Mickey Kennedy","Mike Sloan","Milton Walsh","Mohamed Allison","Mohammad Christensen","Nadia Macdonald","Naomi Snyder","Ned Lowe","Nettie Leonard","Olive Perkins","Ophelia Morrow","Oren Montes","Orlando Henderson","Owen Buchanan","Paul Norman","Rafael Barrett","Raymond Cochran","Reed Hooper","Reinaldo Houston","Renato Simmons","Rene Calhoun","Reva Hardin","Robert French","Robin Bender","Rodolfo Scott","Roland Blake","Roland Sullivan","Rolf Barnett","Ross Marquez","Ruthie Daugherty","Sandra Potts","Scott Stephenson","Scotty Gonzales","Sean Wiggins","Shana Gallagher","Sharron Montes","Sheryl Lindsey","Socorro Hayden","Solomon Andrade","Stacey Whitehead","Stevie Hale","Stuart Oliver","Stuart Riddle","Tammy Merritt","Theo Wiley","Theresa Murillo","Timothy Roberts","Tony Torres","Tracy Logan","Troy Hoover","Twila Rubio","Velma Everett","Vincent Mccormick","Vincenzo Stafford","Vito Clark","Waldo Spencer","Werner Lowe","Werner Shepard","Wesley Ford","Wm Cantu","Zelma Pierce"]
[null,null,null,null,null,"Britt Vazquez",{"$f":"IF('Resulting List'!F25=\"\",\"\",'Resulting List'!F25)","v":""},null,{"$f":"TRANSPOSE(_xlfn._xlws.SORT(_xlfn.UNIQUE(_xlfn._xlws.FILTER(Customers[Names],ISNUMBER(SEARCH(Customers[[#This Row],[Search Criteria]],Customers[Names])),\"No data.\"))))","v":"Adriana Todd"},"Albert Ramirez","Alex Rubio","Amanda Beck","Amparo Orozco","Amy Todd","Angelina Roberson","April Fox","Arden Ayala","Arnoldo Pennington","Aubrey Giles","Bette Rivers","Brianna Alexander","Brianna Mora","Britt Vazquez","Broderick Gillespie","Brooke Roman","Calvin Buck","Carmela Mullins","Carol Stevenson","Carolina Russell","Carolyn Roberts","Chelsea Gilbert","Cheryl Williamson","Christa Frederick","Christian Armstrong","Christopher Stuart","Chung Krueger","Clare Whitney","Clarissa Archer","Claudio Lam","Cordell Mills","Craig Shepherd","Damien Kramer","Dane Burke","Danielle Stout","Darrel Liu","Darrin Mcneil","Darron Aguilar","Della Huber","Delores Krause","Dena Rosario","Dominick Johnston","Dona Herring","Dorothy Winters","Douglas Wiley","Doyle David","Earlene Hester","Earline Shepherd","Edwin Sparks","Eli Galvan","Elinor Kaufman","Elroy Porter","Elvin Flynn","Emmitt Porter","Erik Parsons","Ethel Forbes","Felicia Ware","Fidel Haynes","Francisco Valenzuela","Frank Hunt","Gabriela Moore","Gabrielle Patrick","Gale Fitzpatrick","Gayle Curtis","Genevieve Lucero","Gerry Oneal","Grady Ellis","Grover Escobar","Hans Patel","Horacio Black","Humberto Compton","Hunter Short","Ilene Mcguire","Imelda Lloyd","Ira Macdonald","Issac Allen","Jacques Velazquez","Janis Mullins","Janna Cowan","Javier Garner","Jayson Abbott","Jeannie Tapia","Jefferson Lee","Jeramy Keith","Jermaine Bradshaw","Jewel Lee","Jimmie Yang","Jodie Wood","John Cline","Josefina Dickerson","Josie Pineda","Judith Griffin","Julius Soto","Kelli Romero","Kerri Joseph","Kim Mccall","Lakeisha Velazquez","Latonya Logan","Lee Schmidt","Lela Atkins","Leland Robertson","Leonardo House","Leroy Mcintyre","Lesley Blevins","Lilia Berg","Lilly Stone","Lincoln Bond","Lindsay Hurst","Lionel Fuller","Lorene Hunter","Louis Kidd","Lucius Warren","Lucy Mejia","Lupe Ingram","Lynette Fuller","Lynnette Wright","Madge Copeland","Madge Tanner","Mae Sawyer","Malcolm Newman","Mamie Wong","Mandy Swanson","Marcella Everett","Marco Bright","Marcos Schaefer","Marcus Hays","Marina Walsh","Marion Savage","Marylou Bass","Marylou Mccarthy","Mathew Howard","Maurice Jacobson","Mauricio Bautista","Max Smith","Melanie Bridges","Melissa Brandt","Merlin Wu","Michel Simpson","Mickey Kennedy","Mike Sloan","Milton Walsh","Mohamed Allison","Mohammad Christensen","Nadia Macdonald","Naomi Snyder","Ned Lowe","Nettie Leonard","Olive Perkins","Ophelia Morrow","Oren Montes","Orlando Henderson","Owen Buchanan","Paul Norman","Rafael Barrett","Raymond Cochran","Reed Hooper","Reinaldo Houston","Renato Simmons","Rene Calhoun","Reva Hardin","Robert French","Robin Bender","Rodolfo Scott","Roland Blake","Roland Sullivan","Rolf Barnett","Ross Marquez","Ruthie Daugherty","Sandra Potts","Scott Stephenson","Scotty Gonzales","Sean Wiggins","Shana Gallagher","Sharron Montes","Sheryl Lindsey","Socorro Hayden","Solomon Andrade","Stacey Whitehead","Stevie Hale","Stuart Oliver","Stuart Riddle","Tammy Merritt","Theo Wiley","Theresa Murillo","Timothy Roberts","Tony Torres","Tracy Logan","Troy Hoover","Twila Rubio","Velma Everett","Vincent Mccormick","Vincenzo Stafford","Vito Clark","Waldo Spencer","Werner Lowe","Werner Shepard","Wesley Ford","Wm Cantu","Zelma Pierce"]
[null,null,null,null,null,"Hans Patel",{"$f":"IF('Resulting List'!F26=\"\",\"\",'Resulting List'!F26)","v":""},null,{"$f":"TRANSPOSE(_xlfn._xlws.SORT(_xlfn.UNIQUE(_xlfn._xlws.FILTER(Customers[Names],ISNUMBER(SEARCH(Customers[[#This Row],[Search Criteria]],Customers[Names])),\"No data.\"))))","v":"Adriana Todd"},"Albert Ramirez","Alex Rubio","Amanda Beck","Amparo Orozco","Amy Todd","Angelina Roberson","April Fox","Arden Ayala","Arnoldo Pennington","Aubrey Giles","Bette Rivers","Brianna Alexander","Brianna Mora","Britt Vazquez","Broderick Gillespie","Brooke Roman","Calvin Buck","Carmela Mullins","Carol Stevenson","Carolina Russell","Carolyn Roberts","Chelsea Gilbert","Cheryl Williamson","Christa Frederick","Christian Armstrong","Christopher Stuart","Chung Krueger","Clare Whitney","Clarissa Archer","Claudio Lam","Cordell Mills","Craig Shepherd","Damien Kramer","Dane Burke","Danielle Stout","Darrel Liu","Darrin Mcneil","Darron Aguilar","Della Huber","Delores Krause","Dena Rosario","Dominick Johnston","Dona Herring","Dorothy Winters","Douglas Wiley","Doyle David","Earlene Hester","Earline Shepherd","Edwin Sparks","Eli Galvan","Elinor Kaufman","Elroy Porter","Elvin Flynn","Emmitt Porter","Erik Parsons","Ethel Forbes","Felicia Ware","Fidel Haynes","Francisco Valenzuela","Frank Hunt","Gabriela Moore","Gabrielle Patrick","Gale Fitzpatrick","Gayle Curtis","Genevieve Lucero","Gerry Oneal","Grady Ellis","Grover Escobar","Hans Patel","Horacio Black","Humberto Compton","Hunter Short","Ilene Mcguire","Imelda Lloyd","Ira Macdonald","Issac Allen","Jacques Velazquez","Janis Mullins","Janna Cowan","Javier Garner","Jayson Abbott","Jeannie Tapia","Jefferson Lee","Jeramy Keith","Jermaine Bradshaw","Jewel Lee","Jimmie Yang","Jodie Wood","John Cline","Josefina Dickerson","Josie Pineda","Judith Griffin","Julius Soto","Kelli Romero","Kerri Joseph","Kim Mccall","Lakeisha Velazquez","Latonya Logan","Lee Schmidt","Lela Atkins","Leland Robertson","Leonardo House","Leroy Mcintyre","Lesley Blevins","Lilia Berg","Lilly Stone","Lincoln Bond","Lindsay Hurst","Lionel Fuller","Lorene Hunter","Louis Kidd","Lucius Warren","Lucy Mejia","Lupe Ingram","Lynette Fuller","Lynnette Wright","Madge Copeland","Madge Tanner","Mae Sawyer","Malcolm Newman","Mamie Wong","Mandy Swanson","Marcella Everett","Marco Bright","Marcos Schaefer","Marcus Hays","Marina Walsh","Marion Savage","Marylou Bass","Marylou Mccarthy","Mathew Howard","Maurice Jacobson","Mauricio Bautista","Max Smith","Melanie Bridges","Melissa Brandt","Merlin Wu","Michel Simpson","Mickey Kennedy","Mike Sloan","Milton Walsh","Mohamed Allison","Mohammad Christensen","Nadia Macdonald","Naomi Snyder","Ned Lowe","Nettie Leonard","Olive Perkins","Ophelia Morrow","Oren Montes","Orlando Henderson","Owen Buchanan","Paul Norman","Rafael Barrett","Raymond Cochran","Reed Hooper","Reinaldo Houston","Renato Simmons","Rene Calhoun","Reva Hardin","Robert French","Robin Bender","Rodolfo Scott","Roland Blake","Roland Sullivan","Rolf Barnett","Ross Marquez","Ruthie Daugherty","Sandra Potts","Scott Stephenson","Scotty Gonzales","Sean Wiggins","Shana Gallagher","Sharron Montes","Sheryl Lindsey","Socorro Hayden","Solomon Andrade","Stacey Whitehead","Stevie Hale","Stuart Oliver","Stuart Riddle","Tammy Merritt","Theo Wiley","Theresa Murillo","Timothy Roberts","Tony Torres","Tracy Logan","Troy Hoover","Twila Rubio","Velma Everett","Vincent Mccormick","Vincenzo Stafford","Vito Clark","Waldo Spencer","Werner Lowe","Werner Shepard","Wesley Ford","Wm Cantu","Zelma Pierce"]
[null,null,null,null,null,"Francisco Valenzuela",{"$f":"IF('Resulting List'!F27=\"\",\"\",'Resulting List'!F27)","v":""},null,{"$f":"TRANSPOSE(_xlfn._xlws.SORT(_xlfn.UNIQUE(_xlfn._xlws.FILTER(Customers[Names],ISNUMBER(SEARCH(Customers[[#This Row],[Search Criteria]],Customers[Names])),\"No data.\"))))","v":"Adriana Todd"},"Albert Ramirez","Alex Rubio","Amanda Beck","Amparo Orozco","Amy Todd","Angelina Roberson","April Fox","Arden Ayala","Arnoldo Pennington","Aubrey Giles","Bette Rivers","Brianna Alexander","Brianna Mora","Britt Vazquez","Broderick Gillespie","Brooke Roman","Calvin Buck","Carmela Mullins","Carol Stevenson","Carolina Russell","Carolyn Roberts","Chelsea Gilbert","Cheryl Williamson","Christa Frederick","Christian Armstrong","Christopher Stuart","Chung Krueger","Clare Whitney","Clarissa Archer","Claudio Lam","Cordell Mills","Craig Shepherd","Damien Kramer","Dane Burke","Danielle Stout","Darrel Liu","Darrin Mcneil","Darron Aguilar","Della Huber","Delores Krause","Dena Rosario","Dominick Johnston","Dona Herring","Dorothy Winters","Douglas Wiley","Doyle David","Earlene Hester","Earline Shepherd","Edwin Sparks","Eli Galvan","Elinor Kaufman","Elroy Porter","Elvin Flynn","Emmitt Porter","Erik Parsons","Ethel Forbes","Felicia Ware","Fidel Haynes","Francisco Valenzuela","Frank Hunt","Gabriela Moore","Gabrielle Patrick","Gale Fitzpatrick","Gayle Curtis","Genevieve Lucero","Gerry Oneal","Grady Ellis","Grover Escobar","Hans Patel","Horacio Black","Humberto Compton","Hunter Short","Ilene Mcguire","Imelda Lloyd","Ira Macdonald","Issac Allen","Jacques Velazquez","Janis Mullins","Janna Cowan","Javier Garner","Jayson Abbott","Jeannie Tapia","Jefferson Lee","Jeramy Keith","Jermaine Bradshaw","Jewel Lee","Jimmie Yang","Jodie Wood","John Cline","Josefina Dickerson","Josie Pineda","Judith Griffin","Julius Soto","Kelli Romero","Kerri Joseph","Kim Mccall","Lakeisha Velazquez","Latonya Logan","Lee Schmidt","Lela Atkins","Leland Robertson","Leonardo House","Leroy Mcintyre","Lesley Blevins","Lilia Berg","Lilly Stone","Lincoln Bond","Lindsay Hurst","Lionel Fuller","Lorene Hunter","Louis Kidd","Lucius Warren","Lucy Mejia","Lupe Ingram","Lynette Fuller","Lynnette Wright","Madge Copeland","Madge Tanner","Mae Sawyer","Malcolm Newman","Mamie Wong","Mandy Swanson","Marcella Everett","Marco Bright","Marcos Schaefer","Marcus Hays","Marina Walsh","Marion Savage","Marylou Bass","Marylou Mccarthy","Mathew Howard","Maurice Jacobson","Mauricio Bautista","Max Smith","Melanie Bridges","Melissa Brandt","Merlin Wu","Michel Simpson","Mickey Kennedy","Mike Sloan","Milton Walsh","Mohamed Allison","Mohammad Christensen","Nadia Macdonald","Naomi Snyder","Ned Lowe","Nettie Leonard","Olive Perkins","Ophelia Morrow","Oren Montes","Orlando Henderson","Owen Buchanan","Paul Norman","Rafael Barrett","Raymond Cochran","Reed Hooper","Reinaldo Houston","Renato Simmons","Rene Calhoun","Reva Hardin","Robert French","Robin Bender","Rodolfo Scott","Roland Blake","Roland Sullivan","Rolf Barnett","Ross Marquez","Ruthie Daugherty","Sandra Potts","Scott Stephenson","Scotty Gonzales","Sean Wiggins","Shana Gallagher","Sharron Montes","Sheryl Lindsey","Socorro Hayden","Solomon Andrade","Stacey Whitehead","Stevie Hale","Stuart Oliver","Stuart Riddle","Tammy Merritt","Theo Wiley","Theresa Murillo","Timothy Roberts","Tony Torres","Tracy Logan","Troy Hoover","Twila Rubio","Velma Everett","Vincent Mccormick","Vincenzo Stafford","Vito Clark","Waldo Spencer","Werner Lowe","Werner Shepard","Wesley Ford","Wm Cantu","Zelma Pierce"]
[null,null,null,null,null,"Marylou Mccarthy",{"$f":"IF('Resulting List'!F28=\"\",\"\",'Resulting List'!F28)","v":""},null,{"$f":"TRANSPOSE(_xlfn._xlws.SORT(_xlfn.UNIQUE(_xlfn._xlws.FILTER(Customers[Names],ISNUMBER(SEARCH(Customers[[#This Row],[Search Criteria]],Customers[Names])),\"No data.\"))))","v":"Adriana Todd"},"Albert Ramirez","Alex Rubio","Amanda Beck","Amparo Orozco","Amy Todd","Angelina Roberson","April Fox","Arden Ayala","Arnoldo Pennington","Aubrey Giles","Bette Rivers","Brianna Alexander","Brianna Mora","Britt Vazquez","Broderick Gillespie","Brooke Roman","Calvin Buck","Carmela Mullins","Carol Stevenson","Carolina Russell","Carolyn Roberts","Chelsea Gilbert","Cheryl Williamson","Christa Frederick","Christian Armstrong","Christopher Stuart","Chung Krueger","Clare Whitney","Clarissa Archer","Claudio Lam","Cordell Mills","Craig Shepherd","Damien Kramer","Dane Burke","Danielle Stout","Darrel Liu","Darrin Mcneil","Darron Aguilar","Della Huber","Delores Krause","Dena Rosario","Dominick Johnston","Dona Herring","Dorothy Winters","Douglas Wiley","Doyle David","Earlene Hester","Earline Shepherd","Edwin Sparks","Eli Galvan","Elinor Kaufman","Elroy Porter","Elvin Flynn","Emmitt Porter","Erik Parsons","Ethel Forbes","Felicia Ware","Fidel Haynes","Francisco Valenzuela","Frank Hunt","Gabriela Moore","Gabrielle Patrick","Gale Fitzpatrick","Gayle Curtis","Genevieve Lucero","Gerry Oneal","Grady Ellis","Grover Escobar","Hans Patel","Horacio Black","Humberto Compton","Hunter Short","Ilene Mcguire","Imelda Lloyd","Ira Macdonald","Issac Allen","Jacques Velazquez","Janis Mullins","Janna Cowan","Javier Garner","Jayson Abbott","Jeannie Tapia","Jefferson Lee","Jeramy Keith","Jermaine Bradshaw","Jewel Lee","Jimmie Yang","Jodie Wood","John Cline","Josefina Dickerson","Josie Pineda","Judith Griffin","Julius Soto","Kelli Romero","Kerri Joseph","Kim Mccall","Lakeisha Velazquez","Latonya Logan","Lee Schmidt","Lela Atkins","Leland Robertson","Leonardo House","Leroy Mcintyre","Lesley Blevins","Lilia Berg","Lilly Stone","Lincoln Bond","Lindsay Hurst","Lionel Fuller","Lorene Hunter","Louis Kidd","Lucius Warren","Lucy Mejia","Lupe Ingram","Lynette Fuller","Lynnette Wright","Madge Copeland","Madge Tanner","Mae Sawyer","Malcolm Newman","Mamie Wong","Mandy Swanson","Marcella Everett","Marco Bright","Marcos Schaefer","Marcus Hays","Marina Walsh","Marion Savage","Marylou Bass","Marylou Mccarthy","Mathew Howard","Maurice Jacobson","Mauricio Bautista","Max Smith","Melanie Bridges","Melissa Brandt","Merlin Wu","Michel Simpson","Mickey Kennedy","Mike Sloan","Milton Walsh","Mohamed Allison","Mohammad Christensen","Nadia Macdonald","Naomi Snyder","Ned Lowe","Nettie Leonard","Olive Perkins","Ophelia Morrow","Oren Montes","Orlando Henderson","Owen Buchanan","Paul Norman","Rafael Barrett","Raymond Cochran","Reed Hooper","Reinaldo Houston","Renato Simmons","Rene Calhoun","Reva Hardin","Robert French","Robin Bender","Rodolfo Scott","Roland Blake","Roland Sullivan","Rolf Barnett","Ross Marquez","Ruthie Daugherty","Sandra Potts","Scott Stephenson","Scotty Gonzales","Sean Wiggins","Shana Gallagher","Sharron Montes","Sheryl Lindsey","Socorro Hayden","Solomon Andrade","Stacey Whitehead","Stevie Hale","Stuart Oliver","Stuart Riddle","Tammy Merritt","Theo Wiley","Theresa Murillo","Timothy Roberts","Tony Torres","Tracy Logan","Troy Hoover","Twila Rubio","Velma Everett","Vincent Mccormick","Vincenzo Stafford","Vito Clark","Waldo Spencer","Werner Lowe","Werner Shepard","Wesley Ford","Wm Cantu","Zelma Pierce"]
[null,null,null,null,null,"Imelda Lloyd",{"$f":"IF('Resulting List'!F29=\"\",\"\",'Resulting List'!F29)","v":""},null,{"$f":"TRANSPOSE(_xlfn._xlws.SORT(_xlfn.UNIQUE(_xlfn._xlws.FILTER(Customers[Names],ISNUMBER(SEARCH(Customers[[#This Row],[Search Criteria]],Customers[Names])),\"No data.\"))))","v":"Adriana Todd"},"Albert Ramirez","Alex Rubio","Amanda Beck","Amparo Orozco","Amy Todd","Angelina Roberson","April Fox","Arden Ayala","Arnoldo Pennington","Aubrey Giles","Bette Rivers","Brianna Alexander","Brianna Mora","Britt Vazquez","Broderick Gillespie","Brooke Roman","Calvin Buck","Carmela Mullins","Carol Stevenson","Carolina Russell","Carolyn Roberts","Chelsea Gilbert","Cheryl Williamson","Christa Frederick","Christian Armstrong","Christopher Stuart","Chung Krueger","Clare Whitney","Clarissa Archer","Claudio Lam","Cordell Mills","Craig Shepherd","Damien Kramer","Dane Burke","Danielle Stout","Darrel Liu","Darrin Mcneil","Darron Aguilar","Della Huber","Delores Krause","Dena Rosario","Dominick Johnston","Dona Herring","Dorothy Winters","Douglas Wiley","Doyle David","Earlene Hester","Earline Shepherd","Edwin Sparks","Eli Galvan","Elinor Kaufman","Elroy Porter","Elvin Flynn","Emmitt Porter","Erik Parsons","Ethel Forbes","Felicia Ware","Fidel Haynes","Francisco Valenzuela","Frank Hunt","Gabriela Moore","Gabrielle Patrick","Gale Fitzpatrick","Gayle Curtis","Genevieve Lucero","Gerry Oneal","Grady Ellis","Grover Escobar","Hans Patel","Horacio Black","Humberto Compton","Hunter Short","Ilene Mcguire","Imelda Lloyd","Ira Macdonald","Issac Allen","Jacques Velazquez","Janis Mullins","Janna Cowan","Javier Garner","Jayson Abbott","Jeannie Tapia","Jefferson Lee","Jeramy Keith","Jermaine Bradshaw","Jewel Lee","Jimmie Yang","Jodie Wood","John Cline","Josefina Dickerson","Josie Pineda","Judith Griffin","Julius Soto","Kelli Romero","Kerri Joseph","Kim Mccall","Lakeisha Velazquez","Latonya Logan","Lee Schmidt","Lela Atkins","Leland Robertson","Leonardo House","Leroy Mcintyre","Lesley Blevins","Lilia Berg","Lilly Stone","Lincoln Bond","Lindsay Hurst","Lionel Fuller","Lorene Hunter","Louis Kidd","Lucius Warren","Lucy Mejia","Lupe Ingram","Lynette Fuller","Lynnette Wright","Madge Copeland","Madge Tanner","Mae Sawyer","Malcolm Newman","Mamie Wong","Mandy Swanson","Marcella Everett","Marco Bright","Marcos Schaefer","Marcus Hays","Marina Walsh","Marion Savage","Marylou Bass","Marylou Mccarthy","Mathew Howard","Maurice Jacobson","Mauricio Bautista","Max Smith","Melanie Bridges","Melissa Brandt","Merlin Wu","Michel Simpson","Mickey Kennedy","Mike Sloan","Milton Walsh","Mohamed Allison","Mohammad Christensen","Nadia Macdonald","Naomi Snyder","Ned Lowe","Nettie Leonard","Olive Perkins","Ophelia Morrow","Oren Montes","Orlando Henderson","Owen Buchanan","Paul Norman","Rafael Barrett","Raymond Cochran","Reed Hooper","Reinaldo Houston","Renato Simmons","Rene Calhoun","Reva Hardin","Robert French","Robin Bender","Rodolfo Scott","Roland Blake","Roland Sullivan","Rolf Barnett","Ross Marquez","Ruthie Daugherty","Sandra Potts","Scott Stephenson","Scotty Gonzales","Sean Wiggins","Shana Gallagher","Sharron Montes","Sheryl Lindsey","Socorro Hayden","Solomon Andrade","Stacey Whitehead","Stevie Hale","Stuart Oliver","Stuart Riddle","Tammy Merritt","Theo Wiley","Theresa Murillo","Timothy Roberts","Tony Torres","Tracy Logan","Troy Hoover","Twila Rubio","Velma Everett","Vincent Mccormick","Vincenzo Stafford","Vito Clark","Waldo Spencer","Werner Lowe","Werner Shepard","Wesley Ford","Wm Cantu","Zelma Pierce"]
[null,null,null,null,null,"Carol Stevenson",{"$f":"IF('Resulting List'!F30=\"\",\"\",'Resulting List'!F30)","v":""},null,{"$f":"TRANSPOSE(_xlfn._xlws.SORT(_xlfn.UNIQUE(_xlfn._xlws.FILTER(Customers[Names],ISNUMBER(SEARCH(Customers[[#This Row],[Search Criteria]],Customers[Names])),\"No data.\"))))","v":"Adriana Todd"},"Albert Ramirez","Alex Rubio","Amanda Beck","Amparo Orozco","Amy Todd","Angelina Roberson","April Fox","Arden Ayala","Arnoldo Pennington","Aubrey Giles","Bette Rivers","Brianna Alexander","Brianna Mora","Britt Vazquez","Broderick Gillespie","Brooke Roman","Calvin Buck","Carmela Mullins","Carol Stevenson","Carolina Russell","Carolyn Roberts","Chelsea Gilbert","Cheryl Williamson","Christa Frederick","Christian Armstrong","Christopher Stuart","Chung Krueger","Clare Whitney","Clarissa Archer","Claudio Lam","Cordell Mills","Craig Shepherd","Damien Kramer","Dane Burke","Danielle Stout","Darrel Liu","Darrin Mcneil","Darron Aguilar","Della Huber","Delores Krause","Dena Rosario","Dominick Johnston","Dona Herring","Dorothy Winters","Douglas Wiley","Doyle David","Earlene Hester","Earline Shepherd","Edwin Sparks","Eli Galvan","Elinor Kaufman","Elroy Porter","Elvin Flynn","Emmitt Porter","Erik Parsons","Ethel Forbes","Felicia Ware","Fidel Haynes","Francisco Valenzuela","Frank Hunt","Gabriela Moore","Gabrielle Patrick","Gale Fitzpatrick","Gayle Curtis","Genevieve Lucero","Gerry Oneal","Grady Ellis","Grover Escobar","Hans Patel","Horacio Black","Humberto Compton","Hunter Short","Ilene Mcguire","Imelda Lloyd","Ira Macdonald","Issac Allen","Jacques Velazquez","Janis Mullins","Janna Cowan","Javier Garner","Jayson Abbott","Jeannie Tapia","Jefferson Lee","Jeramy Keith","Jermaine Bradshaw","Jewel Lee","Jimmie Yang","Jodie Wood","John Cline","Josefina Dickerson","Josie Pineda","Judith Griffin","Julius Soto","Kelli Romero","Kerri Joseph","Kim Mccall","Lakeisha Velazquez","Latonya Logan","Lee Schmidt","Lela Atkins","Leland Robertson","Leonardo House","Leroy Mcintyre","Lesley Blevins","Lilia Berg","Lilly Stone","Lincoln Bond","Lindsay Hurst","Lionel Fuller","Lorene Hunter","Louis Kidd","Lucius Warren","Lucy Mejia","Lupe Ingram","Lynette Fuller","Lynnette Wright","Madge Copeland","Madge Tanner","Mae Sawyer","Malcolm Newman","Mamie Wong","Mandy Swanson","Marcella Everett","Marco Bright","Marcos Schaefer","Marcus Hays","Marina Walsh","Marion Savage","Marylou Bass","Marylou Mccarthy","Mathew Howard","Maurice Jacobson","Mauricio Bautista","Max Smith","Melanie Bridges","Melissa Brandt","Merlin Wu","Michel Simpson","Mickey Kennedy","Mike Sloan","Milton Walsh","Mohamed Allison","Mohammad Christensen","Nadia Macdonald","Naomi Snyder","Ned Lowe","Nettie Leonard","Olive Perkins","Ophelia Morrow","Oren Montes","Orlando Henderson","Owen Buchanan","Paul Norman","Rafael Barrett","Raymond Cochran","Reed Hooper","Reinaldo Houston","Renato Simmons","Rene Calhoun","Reva Hardin","Robert French","Robin Bender","Rodolfo Scott","Roland Blake","Roland Sullivan","Rolf Barnett","Ross Marquez","Ruthie Daugherty","Sandra Potts","Scott Stephenson","Scotty Gonzales","Sean Wiggins","Shana Gallagher","Sharron Montes","Sheryl Lindsey","Socorro Hayden","Solomon Andrade","Stacey Whitehead","Stevie Hale","Stuart Oliver","Stuart Riddle","Tammy Merritt","Theo Wiley","Theresa Murillo","Timothy Roberts","Tony Torres","Tracy Logan","Troy Hoover","Twila Rubio","Velma Everett","Vincent Mccormick","Vincenzo Stafford","Vito Clark","Waldo Spencer","Werner Lowe","Werner Shepard","Wesley Ford","Wm Cantu","Zelma Pierce"]
[null,null,null,null,null,"Stuart Riddle",{"$f":"IF('Resulting List'!F31=\"\",\"\",'Resulting List'!F31)","v":""},null,{"$f":"TRANSPOSE(_xlfn._xlws.SORT(_xlfn.UNIQUE(_xlfn._xlws.FILTER(Customers[Names],ISNUMBER(SEARCH(Customers[[#This Row],[Search Criteria]],Customers[Names])),\"No data.\"))))","v":"Adriana Todd"},"Albert Ramirez","Alex Rubio","Amanda Beck","Amparo Orozco","Amy Todd","Angelina Roberson","April Fox","Arden Ayala","Arnoldo Pennington","Aubrey Giles","Bette Rivers","Brianna Alexander","Brianna Mora","Britt Vazquez","Broderick Gillespie","Brooke Roman","Calvin Buck","Carmela Mullins","Carol Stevenson","Carolina Russell","Carolyn Roberts","Chelsea Gilbert","Cheryl Williamson","Christa Frederick","Christian Armstrong","Christopher Stuart","Chung Krueger","Clare Whitney","Clarissa Archer","Claudio Lam","Cordell Mills","Craig Shepherd","Damien Kramer","Dane Burke","Danielle Stout","Darrel Liu","Darrin Mcneil","Darron Aguilar","Della Huber","Delores Krause","Dena Rosario","Dominick Johnston","Dona Herring","Dorothy Winters","Douglas Wiley","Doyle David","Earlene Hester","Earline Shepherd","Edwin Sparks","Eli Galvan","Elinor Kaufman","Elroy Porter","Elvin Flynn","Emmitt Porter","Erik Parsons","Ethel Forbes","Felicia Ware","Fidel Haynes","Francisco Valenzuela","Frank Hunt","Gabriela Moore","Gabrielle Patrick","Gale Fitzpatrick","Gayle Curtis","Genevieve Lucero","Gerry Oneal","Grady Ellis","Grover Escobar","Hans Patel","Horacio Black","Humberto Compton","Hunter Short","Ilene Mcguire","Imelda Lloyd","Ira Macdonald","Issac Allen","Jacques Velazquez","Janis Mullins","Janna Cowan","Javier Garner","Jayson Abbott","Jeannie Tapia","Jefferson Lee","Jeramy Keith","Jermaine Bradshaw","Jewel Lee","Jimmie Yang","Jodie Wood","John Cline","Josefina Dickerson","Josie Pineda","Judith Griffin","Julius Soto","Kelli Romero","Kerri Joseph","Kim Mccall","Lakeisha Velazquez","Latonya Logan","Lee Schmidt","Lela Atkins","Leland Robertson","Leonardo House","Leroy Mcintyre","Lesley Blevins","Lilia Berg","Lilly Stone","Lincoln Bond","Lindsay Hurst","Lionel Fuller","Lorene Hunter","Louis Kidd","Lucius Warren","Lucy Mejia","Lupe Ingram","Lynette Fuller","Lynnette Wright","Madge Copeland","Madge Tanner","Mae Sawyer","Malcolm Newman","Mamie Wong","Mandy Swanson","Marcella Everett","Marco Bright","Marcos Schaefer","Marcus Hays","Marina Walsh","Marion Savage","Marylou Bass","Marylou Mccarthy","Mathew Howard","Maurice Jacobson","Mauricio Bautista","Max Smith","Melanie Bridges","Melissa Brandt","Merlin Wu","Michel Simpson","Mickey Kennedy","Mike Sloan","Milton Walsh","Mohamed Allison","Mohammad Christensen","Nadia Macdonald","Naomi Snyder","Ned Lowe","Nettie Leonard","Olive Perkins","Ophelia Morrow","Oren Montes","Orlando Henderson","Owen Buchanan","Paul Norman","Rafael Barrett","Raymond Cochran","Reed Hooper","Reinaldo Houston","Renato Simmons","Rene Calhoun","Reva Hardin","Robert French","Robin Bender","Rodolfo Scott","Roland Blake","Roland Sullivan","Rolf Barnett","Ross Marquez","Ruthie Daugherty","Sandra Potts","Scott Stephenson","Scotty Gonzales","Sean Wiggins","Shana Gallagher","Sharron Montes","Sheryl Lindsey","Socorro Hayden","Solomon Andrade","Stacey Whitehead","Stevie Hale","Stuart Oliver","Stuart Riddle","Tammy Merritt","Theo Wiley","Theresa Murillo","Timothy Roberts","Tony Torres","Tracy Logan","Troy Hoover","Twila Rubio","Velma Everett","Vincent Mccormick","Vincenzo Stafford","Vito Clark","Waldo Spencer","Werner Lowe","Werner Shepard","Wesley Ford","Wm Cantu","Zelma Pierce"]
[null,null,null,null,null,"Ned Lowe",{"$f":"IF('Resulting List'!F32=\"\",\"\",'Resulting List'!F32)","v":""},null,{"$f":"TRANSPOSE(_xlfn._xlws.SORT(_xlfn.UNIQUE(_xlfn._xlws.FILTER(Customers[Names],ISNUMBER(SEARCH(Customers[[#This Row],[Search Criteria]],Customers[Names])),\"No data.\"))))","v":"Adriana Todd"},"Albert Ramirez","Alex Rubio","Amanda Beck","Amparo Orozco","Amy Todd","Angelina Roberson","April Fox","Arden Ayala","Arnoldo Pennington","Aubrey Giles","Bette Rivers","Brianna Alexander","Brianna Mora","Britt Vazquez","Broderick Gillespie","Brooke Roman","Calvin Buck","Carmela Mullins","Carol Stevenson","Carolina Russell","Carolyn Roberts","Chelsea Gilbert","Cheryl Williamson","Christa Frederick","Christian Armstrong","Christopher Stuart","Chung Krueger","Clare Whitney","Clarissa Archer","Claudio Lam","Cordell Mills","Craig Shepherd","Damien Kramer","Dane Burke","Danielle Stout","Darrel Liu","Darrin Mcneil","Darron Aguilar","Della Huber","Delores Krause","Dena Rosario","Dominick Johnston","Dona Herring","Dorothy Winters","Douglas Wiley","Doyle David","Earlene Hester","Earline Shepherd","Edwin Sparks","Eli Galvan","Elinor Kaufman","Elroy Porter","Elvin Flynn","Emmitt Porter","Erik Parsons","Ethel Forbes","Felicia Ware","Fidel Haynes","Francisco Valenzuela","Frank Hunt","Gabriela Moore","Gabrielle Patrick","Gale Fitzpatrick","Gayle Curtis","Genevieve Lucero","Gerry Oneal","Grady Ellis","Grover Escobar","Hans Patel","Horacio Black","Humberto Compton","Hunter Short","Ilene Mcguire","Imelda Lloyd","Ira Macdonald","Issac Allen","Jacques Velazquez","Janis Mullins","Janna Cowan","Javier Garner","Jayson Abbott","Jeannie Tapia","Jefferson Lee","Jeramy Keith","Jermaine Bradshaw","Jewel Lee","Jimmie Yang","Jodie Wood","John Cline","Josefina Dickerson","Josie Pineda","Judith Griffin","Julius Soto","Kelli Romero","Kerri Joseph","Kim Mccall","Lakeisha Velazquez","Latonya Logan","Lee Schmidt","Lela Atkins","Leland Robertson","Leonardo House","Leroy Mcintyre","Lesley Blevins","Lilia Berg","Lilly Stone","Lincoln Bond","Lindsay Hurst","Lionel Fuller","Lorene Hunter","Louis Kidd","Lucius Warren","Lucy Mejia","Lupe Ingram","Lynette Fuller","Lynnette Wright","Madge Copeland","Madge Tanner","Mae Sawyer","Malcolm Newman","Mamie Wong","Mandy Swanson","Marcella Everett","Marco Bright","Marcos Schaefer","Marcus Hays","Marina Walsh","Marion Savage","Marylou Bass","Marylou Mccarthy","Mathew Howard","Maurice Jacobson","Mauricio Bautista","Max Smith","Melanie Bridges","Melissa Brandt","Merlin Wu","Michel Simpson","Mickey Kennedy","Mike Sloan","Milton Walsh","Mohamed Allison","Mohammad Christensen","Nadia Macdonald","Naomi Snyder","Ned Lowe","Nettie Leonard","Olive Perkins","Ophelia Morrow","Oren Montes","Orlando Henderson","Owen Buchanan","Paul Norman","Rafael Barrett","Raymond Cochran","Reed Hooper","Reinaldo Houston","Renato Simmons","Rene Calhoun","Reva Hardin","Robert French","Robin Bender","Rodolfo Scott","Roland Blake","Roland Sullivan","Rolf Barnett","Ross Marquez","Ruthie Daugherty","Sandra Potts","Scott Stephenson","Scotty Gonzales","Sean Wiggins","Shana Gallagher","Sharron Montes","Sheryl Lindsey","Socorro Hayden","Solomon Andrade","Stacey Whitehead","Stevie Hale","Stuart Oliver","Stuart Riddle","Tammy Merritt","Theo Wiley","Theresa Murillo","Timothy Roberts","Tony Torres","Tracy Logan","Troy Hoover","Twila Rubio","Velma Everett","Vincent Mccormick","Vincenzo Stafford","Vito Clark","Waldo Spencer","Werner Lowe","Werner Shepard","Wesley Ford","Wm Cantu","Zelma Pierce"]
[null,null,null,null,null,"Kim Mccall",{"$f":"IF('Resulting List'!F33=\"\",\"\",'Resulting List'!F33)","v":""},null,{"$f":"TRANSPOSE(_xlfn._xlws.SORT(_xlfn.UNIQUE(_xlfn._xlws.FILTER(Customers[Names],ISNUMBER(SEARCH(Customers[[#This Row],[Search Criteria]],Customers[Names])),\"No data.\"))))","v":"Adriana Todd"},"Albert Ramirez","Alex Rubio","Amanda Beck","Amparo Orozco","Amy Todd","Angelina Roberson","April Fox","Arden Ayala","Arnoldo Pennington","Aubrey Giles","Bette Rivers","Brianna Alexander","Brianna Mora","Britt Vazquez","Broderick Gillespie","Brooke Roman","Calvin Buck","Carmela Mullins","Carol Stevenson","Carolina Russell","Carolyn Roberts","Chelsea Gilbert","Cheryl Williamson","Christa Frederick","Christian Armstrong","Christopher Stuart","Chung Krueger","Clare Whitney","Clarissa Archer","Claudio Lam","Cordell Mills","Craig Shepherd","Damien Kramer","Dane Burke","Danielle Stout","Darrel Liu","Darrin Mcneil","Darron Aguilar","Della Huber","Delores Krause","Dena Rosario","Dominick Johnston","Dona Herring","Dorothy Winters","Douglas Wiley","Doyle David","Earlene Hester","Earline Shepherd","Edwin Sparks","Eli Galvan","Elinor Kaufman","Elroy Porter","Elvin Flynn","Emmitt Porter","Erik Parsons","Ethel Forbes","Felicia Ware","Fidel Haynes","Francisco Valenzuela","Frank Hunt","Gabriela Moore","Gabrielle Patrick","Gale Fitzpatrick","Gayle Curtis","Genevieve Lucero","Gerry Oneal","Grady Ellis","Grover Escobar","Hans Patel","Horacio Black","Humberto Compton","Hunter Short","Ilene Mcguire","Imelda Lloyd","Ira Macdonald","Issac Allen","Jacques Velazquez","Janis Mullins","Janna Cowan","Javier Garner","Jayson Abbott","Jeannie Tapia","Jefferson Lee","Jeramy Keith","Jermaine Bradshaw","Jewel Lee","Jimmie Yang","Jodie Wood","John Cline","Josefina Dickerson","Josie Pineda","Judith Griffin","Julius Soto","Kelli Romero","Kerri Joseph","Kim Mccall","Lakeisha Velazquez","Latonya Logan","Lee Schmidt","Lela Atkins","Leland Robertson","Leonardo House","Leroy Mcintyre","Lesley Blevins","Lilia Berg","Lilly Stone","Lincoln Bond","Lindsay Hurst","Lionel Fuller","Lorene Hunter","Louis Kidd","Lucius Warren","Lucy Mejia","Lupe Ingram","Lynette Fuller","Lynnette Wright","Madge Copeland","Madge Tanner","Mae Sawyer","Malcolm Newman","Mamie Wong","Mandy Swanson","Marcella Everett","Marco Bright","Marcos Schaefer","Marcus Hays","Marina Walsh","Marion Savage","Marylou Bass","Marylou Mccarthy","Mathew Howard","Maurice Jacobson","Mauricio Bautista","Max Smith","Melanie Bridges","Melissa Brandt","Merlin Wu","Michel Simpson","Mickey Kennedy","Mike Sloan","Milton Walsh","Mohamed Allison","Mohammad Christensen","Nadia Macdonald","Naomi Snyder","Ned Lowe","Nettie Leonard","Olive Perkins","Ophelia Morrow","Oren Montes","Orlando Henderson","Owen Buchanan","Paul Norman","Rafael Barrett","Raymond Cochran","Reed Hooper","Reinaldo Houston","Renato Simmons","Rene Calhoun","Reva Hardin","Robert French","Robin Bender","Rodolfo Scott","Roland Blake","Roland Sullivan","Rolf Barnett","Ross Marquez","Ruthie Daugherty","Sandra Potts","Scott Stephenson","Scotty Gonzales","Sean Wiggins","Shana Gallagher","Sharron Montes","Sheryl Lindsey","Socorro Hayden","Solomon Andrade","Stacey Whitehead","Stevie Hale","Stuart Oliver","Stuart Riddle","Tammy Merritt","Theo Wiley","Theresa Murillo","Timothy Roberts","Tony Torres","Tracy Logan","Troy Hoover","Twila Rubio","Velma Everett","Vincent Mccormick","Vincenzo Stafford","Vito Clark","Waldo Spencer","Werner Lowe","Werner Shepard","Wesley Ford","Wm Cantu","Zelma Pierce"]
[null,null,null,null,null,"Mamie Wong",{"$f":"IF('Resulting List'!F34=\"\",\"\",'Resulting List'!F34)","v":""},null,{"$f":"TRANSPOSE(_xlfn._xlws.SORT(_xlfn.UNIQUE(_xlfn._xlws.FILTER(Customers[Names],ISNUMBER(SEARCH(Customers[[#This Row],[Search Criteria]],Customers[Names])),\"No data.\"))))","v":"Adriana Todd"},"Albert Ramirez","Alex Rubio","Amanda Beck","Amparo Orozco","Amy Todd","Angelina Roberson","April Fox","Arden Ayala","Arnoldo Pennington","Aubrey Giles","Bette Rivers","Brianna Alexander","Brianna Mora","Britt Vazquez","Broderick Gillespie","Brooke Roman","Calvin Buck","Carmela Mullins","Carol Stevenson","Carolina Russell","Carolyn Roberts","Chelsea Gilbert","Cheryl Williamson","Christa Frederick","Christian Armstrong","Christopher Stuart","Chung Krueger","Clare Whitney","Clarissa Archer","Claudio Lam","Cordell Mills","Craig Shepherd","Damien Kramer","Dane Burke","Danielle Stout","Darrel Liu","Darrin Mcneil","Darron Aguilar","Della Huber","Delores Krause","Dena Rosario","Dominick Johnston","Dona Herring","Dorothy Winters","Douglas Wiley","Doyle David","Earlene Hester","Earline Shepherd","Edwin Sparks","Eli Galvan","Elinor Kaufman","Elroy Porter","Elvin Flynn","Emmitt Porter","Erik Parsons","Ethel Forbes","Felicia Ware","Fidel Haynes","Francisco Valenzuela","Frank Hunt","Gabriela Moore","Gabrielle Patrick","Gale Fitzpatrick","Gayle Curtis","Genevieve Lucero","Gerry Oneal","Grady Ellis","Grover Escobar","Hans Patel","Horacio Black","Humberto Compton","Hunter Short","Ilene Mcguire","Imelda Lloyd","Ira Macdonald","Issac Allen","Jacques Velazquez","Janis Mullins","Janna Cowan","Javier Garner","Jayson Abbott","Jeannie Tapia","Jefferson Lee","Jeramy Keith","Jermaine Bradshaw","Jewel Lee","Jimmie Yang","Jodie Wood","John Cline","Josefina Dickerson","Josie Pineda","Judith Griffin","Julius Soto","Kelli Romero","Kerri Joseph","Kim Mccall","Lakeisha Velazquez","Latonya Logan","Lee Schmidt","Lela Atkins","Leland Robertson","Leonardo House","Leroy Mcintyre","Lesley Blevins","Lilia Berg","Lilly Stone","Lincoln Bond","Lindsay Hurst","Lionel Fuller","Lorene Hunter","Louis Kidd","Lucius Warren","Lucy Mejia","Lupe Ingram","Lynette Fuller","Lynnette Wright","Madge Copeland","Madge Tanner","Mae Sawyer","Malcolm Newman","Mamie Wong","Mandy Swanson","Marcella Everett","Marco Bright","Marcos Schaefer","Marcus Hays","Marina Walsh","Marion Savage","Marylou Bass","Marylou Mccarthy","Mathew Howard","Maurice Jacobson","Mauricio Bautista","Max Smith","Melanie Bridges","Melissa Brandt","Merlin Wu","Michel Simpson","Mickey Kennedy","Mike Sloan","Milton Walsh","Mohamed Allison","Mohammad Christensen","Nadia Macdonald","Naomi Snyder","Ned Lowe","Nettie Leonard","Olive Perkins","Ophelia Morrow","Oren Montes","Orlando Henderson","Owen Buchanan","Paul Norman","Rafael Barrett","Raymond Cochran","Reed Hooper","Reinaldo Houston","Renato Simmons","Rene Calhoun","Reva Hardin","Robert French","Robin Bender","Rodolfo Scott","Roland Blake","Roland Sullivan","Rolf Barnett","Ross Marquez","Ruthie Daugherty","Sandra Potts","Scott Stephenson","Scotty Gonzales","Sean Wiggins","Shana Gallagher","Sharron Montes","Sheryl Lindsey","Socorro Hayden","Solomon Andrade","Stacey Whitehead","Stevie Hale","Stuart Oliver","Stuart Riddle","Tammy Merritt","Theo Wiley","Theresa Murillo","Timothy Roberts","Tony Torres","Tracy Logan","Troy Hoover","Twila Rubio","Velma Everett","Vincent Mccormick","Vincenzo Stafford","Vito Clark","Waldo Spencer","Werner Lowe","Werner Shepard","Wesley Ford","Wm Cantu","Zelma Pierce"]
[null,null,null,null,null,"Eli Galvan",{"$f":"IF('Resulting List'!F35=\"\",\"\",'Resulting List'!F35)","v":""},null,{"$f":"TRANSPOSE(_xlfn._xlws.SORT(_xlfn.UNIQUE(_xlfn._xlws.FILTER(Customers[Names],ISNUMBER(SEARCH(Customers[[#This Row],[Search Criteria]],Customers[Names])),\"No data.\"))))","v":"Adriana Todd"},"Albert Ramirez","Alex Rubio","Amanda Beck","Amparo Orozco","Amy Todd","Angelina Roberson","April Fox","Arden Ayala","Arnoldo Pennington","Aubrey Giles","Bette Rivers","Brianna Alexander","Brianna Mora","Britt Vazquez","Broderick Gillespie","Brooke Roman","Calvin Buck","Carmela Mullins","Carol Stevenson","Carolina Russell","Carolyn Roberts","Chelsea Gilbert","Cheryl Williamson","Christa Frederick","Christian Armstrong","Christopher Stuart","Chung Krueger","Clare Whitney","Clarissa Archer","Claudio Lam","Cordell Mills","Craig Shepherd","Damien Kramer","Dane Burke","Danielle Stout","Darrel Liu","Darrin Mcneil","Darron Aguilar","Della Huber","Delores Krause","Dena Rosario","Dominick Johnston","Dona Herring","Dorothy Winters","Douglas Wiley","Doyle David","Earlene Hester","Earline Shepherd","Edwin Sparks","Eli Galvan","Elinor Kaufman","Elroy Porter","Elvin Flynn","Emmitt Porter","Erik Parsons","Ethel Forbes","Felicia Ware","Fidel Haynes","Francisco Valenzuela","Frank Hunt","Gabriela Moore","Gabrielle Patrick","Gale Fitzpatrick","Gayle Curtis","Genevieve Lucero","Gerry Oneal","Grady Ellis","Grover Escobar","Hans Patel","Horacio Black","Humberto Compton","Hunter Short","Ilene Mcguire","Imelda Lloyd","Ira Macdonald","Issac Allen","Jacques Velazquez","Janis Mullins","Janna Cowan","Javier Garner","Jayson Abbott","Jeannie Tapia","Jefferson Lee","Jeramy Keith","Jermaine Bradshaw","Jewel Lee","Jimmie Yang","Jodie Wood","John Cline","Josefina Dickerson","Josie Pineda","Judith Griffin","Julius Soto","Kelli Romero","Kerri Joseph","Kim Mccall","Lakeisha Velazquez","Latonya Logan","Lee Schmidt","Lela Atkins","Leland Robertson","Leonardo House","Leroy Mcintyre","Lesley Blevins","Lilia Berg","Lilly Stone","Lincoln Bond","Lindsay Hurst","Lionel Fuller","Lorene Hunter","Louis Kidd","Lucius Warren","Lucy Mejia","Lupe Ingram","Lynette Fuller","Lynnette Wright","Madge Copeland","Madge Tanner","Mae Sawyer","Malcolm Newman","Mamie Wong","Mandy Swanson","Marcella Everett","Marco Bright","Marcos Schaefer","Marcus Hays","Marina Walsh","Marion Savage","Marylou Bass","Marylou Mccarthy","Mathew Howard","Maurice Jacobson","Mauricio Bautista","Max Smith","Melanie Bridges","Melissa Brandt","Merlin Wu","Michel Simpson","Mickey Kennedy","Mike Sloan","Milton Walsh","Mohamed Allison","Mohammad Christensen","Nadia Macdonald","Naomi Snyder","Ned Lowe","Nettie Leonard","Olive Perkins","Ophelia Morrow","Oren Montes","Orlando Henderson","Owen Buchanan","Paul Norman","Rafael Barrett","Raymond Cochran","Reed Hooper","Reinaldo Houston","Renato Simmons","Rene Calhoun","Reva Hardin","Robert French","Robin Bender","Rodolfo Scott","Roland Blake","Roland Sullivan","Rolf Barnett","Ross Marquez","Ruthie Daugherty","Sandra Potts","Scott Stephenson","Scotty Gonzales","Sean Wiggins","Shana Gallagher","Sharron Montes","Sheryl Lindsey","Socorro Hayden","Solomon Andrade","Stacey Whitehead","Stevie Hale","Stuart Oliver","Stuart Riddle","Tammy Merritt","Theo Wiley","Theresa Murillo","Timothy Roberts","Tony Torres","Tracy Logan","Troy Hoover","Twila Rubio","Velma Everett","Vincent Mccormick","Vincenzo Stafford","Vito Clark","Waldo Spencer","Werner Lowe","Werner Shepard","Wesley Ford","Wm Cantu","Zelma Pierce"]
[null,null,null,null,null,"Josie Pineda",{"$f":"IF('Resulting List'!F36=\"\",\"\",'Resulting List'!F36)","v":""},null,{"$f":"TRANSPOSE(_xlfn._xlws.SORT(_xlfn.UNIQUE(_xlfn._xlws.FILTER(Customers[Names],ISNUMBER(SEARCH(Customers[[#This Row],[Search Criteria]],Customers[Names])),\"No data.\"))))","v":"Adriana Todd"},"Albert Ramirez","Alex Rubio","Amanda Beck","Amparo Orozco","Amy Todd","Angelina Roberson","April Fox","Arden Ayala","Arnoldo Pennington","Aubrey Giles","Bette Rivers","Brianna Alexander","Brianna Mora","Britt Vazquez","Broderick Gillespie","Brooke Roman","Calvin Buck","Carmela Mullins","Carol Stevenson","Carolina Russell","Carolyn Roberts","Chelsea Gilbert","Cheryl Williamson","Christa Frederick","Christian Armstrong","Christopher Stuart","Chung Krueger","Clare Whitney","Clarissa Archer","Claudio Lam","Cordell Mills","Craig Shepherd","Damien Kramer","Dane Burke","Danielle Stout","Darrel Liu","Darrin Mcneil","Darron Aguilar","Della Huber","Delores Krause","Dena Rosario","Dominick Johnston","Dona Herring","Dorothy Winters","Douglas Wiley","Doyle David","Earlene Hester","Earline Shepherd","Edwin Sparks","Eli Galvan","Elinor Kaufman","Elroy Porter","Elvin Flynn","Emmitt Porter","Erik Parsons","Ethel Forbes","Felicia Ware","Fidel Haynes","Francisco Valenzuela","Frank Hunt","Gabriela Moore","Gabrielle Patrick","Gale Fitzpatrick","Gayle Curtis","Genevieve Lucero","Gerry Oneal","Grady Ellis","Grover Escobar","Hans Patel","Horacio Black","Humberto Compton","Hunter Short","Ilene Mcguire","Imelda Lloyd","Ira Macdonald","Issac Allen","Jacques Velazquez","Janis Mullins","Janna Cowan","Javier Garner","Jayson Abbott","Jeannie Tapia","Jefferson Lee","Jeramy Keith","Jermaine Bradshaw","Jewel Lee","Jimmie Yang","Jodie Wood","John Cline","Josefina Dickerson","Josie Pineda","Judith Griffin","Julius Soto","Kelli Romero","Kerri Joseph","Kim Mccall","Lakeisha Velazquez","Latonya Logan","Lee Schmidt","Lela Atkins","Leland Robertson","Leonardo House","Leroy Mcintyre","Lesley Blevins","Lilia Berg","Lilly Stone","Lincoln Bond","Lindsay Hurst","Lionel Fuller","Lorene Hunter","Louis Kidd","Lucius Warren","Lucy Mejia","Lupe Ingram","Lynette Fuller","Lynnette Wright","Madge Copeland","Madge Tanner","Mae Sawyer","Malcolm Newman","Mamie Wong","Mandy Swanson","Marcella Everett","Marco Bright","Marcos Schaefer","Marcus Hays","Marina Walsh","Marion Savage","Marylou Bass","Marylou Mccarthy","Mathew Howard","Maurice Jacobson","Mauricio Bautista","Max Smith","Melanie Bridges","Melissa Brandt","Merlin Wu","Michel Simpson","Mickey Kennedy","Mike Sloan","Milton Walsh","Mohamed Allison","Mohammad Christensen","Nadia Macdonald","Naomi Snyder","Ned Lowe","Nettie Leonard","Olive Perkins","Ophelia Morrow","Oren Montes","Orlando Henderson","Owen Buchanan","Paul Norman","Rafael Barrett","Raymond Cochran","Reed Hooper","Reinaldo Houston","Renato Simmons","Rene Calhoun","Reva Hardin","Robert French","Robin Bender","Rodolfo Scott","Roland Blake","Roland Sullivan","Rolf Barnett","Ross Marquez","Ruthie Daugherty","Sandra Potts","Scott Stephenson","Scotty Gonzales","Sean Wiggins","Shana Gallagher","Sharron Montes","Sheryl Lindsey","Socorro Hayden","Solomon Andrade","Stacey Whitehead","Stevie Hale","Stuart Oliver","Stuart Riddle","Tammy Merritt","Theo Wiley","Theresa Murillo","Timothy Roberts","Tony Torres","Tracy Logan","Troy Hoover","Twila Rubio","Velma Everett","Vincent Mccormick","Vincenzo Stafford","Vito Clark","Waldo Spencer","Werner Lowe","Werner Shepard","Wesley Ford","Wm Cantu","Zelma Pierce"]
[null,null,null,null,null,"Mohamed Allison",{"$f":"IF('Resulting List'!F37=\"\",\"\",'Resulting List'!F37)","v":""},null,{"$f":"TRANSPOSE(_xlfn._xlws.SORT(_xlfn.UNIQUE(_xlfn._xlws.FILTER(Customers[Names],ISNUMBER(SEARCH(Customers[[#This Row],[Search Criteria]],Customers[Names])),\"No data.\"))))","v":"Adriana Todd"},"Albert Ramirez","Alex Rubio","Amanda Beck","Amparo Orozco","Amy Todd","Angelina Roberson","April Fox","Arden Ayala","Arnoldo Pennington","Aubrey Giles","Bette Rivers","Brianna Alexander","Brianna Mora","Britt Vazquez","Broderick Gillespie","Brooke Roman","Calvin Buck","Carmela Mullins","Carol Stevenson","Carolina Russell","Carolyn Roberts","Chelsea Gilbert","Cheryl Williamson","Christa Frederick","Christian Armstrong","Christopher Stuart","Chung Krueger","Clare Whitney","Clarissa Archer","Claudio Lam","Cordell Mills","Craig Shepherd","Damien Kramer","Dane Burke","Danielle Stout","Darrel Liu","Darrin Mcneil","Darron Aguilar","Della Huber","Delores Krause","Dena Rosario","Dominick Johnston","Dona Herring","Dorothy Winters","Douglas Wiley","Doyle David","Earlene Hester","Earline Shepherd","Edwin Sparks","Eli Galvan","Elinor Kaufman","Elroy Porter","Elvin Flynn","Emmitt Porter","Erik Parsons","Ethel Forbes","Felicia Ware","Fidel Haynes","Francisco Valenzuela","Frank Hunt","Gabriela Moore","Gabrielle Patrick","Gale Fitzpatrick","Gayle Curtis","Genevieve Lucero","Gerry Oneal","Grady Ellis","Grover Escobar","Hans Patel","Horacio Black","Humberto Compton","Hunter Short","Ilene Mcguire","Imelda Lloyd","Ira Macdonald","Issac Allen","Jacques Velazquez","Janis Mullins","Janna Cowan","Javier Garner","Jayson Abbott","Jeannie Tapia","Jefferson Lee","Jeramy Keith","Jermaine Bradshaw","Jewel Lee","Jimmie Yang","Jodie Wood","John Cline","Josefina Dickerson","Josie Pineda","Judith Griffin","Julius Soto","Kelli Romero","Kerri Joseph","Kim Mccall","Lakeisha Velazquez","Latonya Logan","Lee Schmidt","Lela Atkins","Leland Robertson","Leonardo House","Leroy Mcintyre","Lesley Blevins","Lilia Berg","Lilly Stone","Lincoln Bond","Lindsay Hurst","Lionel Fuller","Lorene Hunter","Louis Kidd","Lucius Warren","Lucy Mejia","Lupe Ingram","Lynette Fuller","Lynnette Wright","Madge Copeland","Madge Tanner","Mae Sawyer","Malcolm Newman","Mamie Wong","Mandy Swanson","Marcella Everett","Marco Bright","Marcos Schaefer","Marcus Hays","Marina Walsh","Marion Savage","Marylou Bass","Marylou Mccarthy","Mathew Howard","Maurice Jacobson","Mauricio Bautista","Max Smith","Melanie Bridges","Melissa Brandt","Merlin Wu","Michel Simpson","Mickey Kennedy","Mike Sloan","Milton Walsh","Mohamed Allison","Mohammad Christensen","Nadia Macdonald","Naomi Snyder","Ned Lowe","Nettie Leonard","Olive Perkins","Ophelia Morrow","Oren Montes","Orlando Henderson","Owen Buchanan","Paul Norman","Rafael Barrett","Raymond Cochran","Reed Hooper","Reinaldo Houston","Renato Simmons","Rene Calhoun","Reva Hardin","Robert French","Robin Bender","Rodolfo Scott","Roland Blake","Roland Sullivan","Rolf Barnett","Ross Marquez","Ruthie Daugherty","Sandra Potts","Scott Stephenson","Scotty Gonzales","Sean Wiggins","Shana Gallagher","Sharron Montes","Sheryl Lindsey","Socorro Hayden","Solomon Andrade","Stacey Whitehead","Stevie Hale","Stuart Oliver","Stuart Riddle","Tammy Merritt","Theo Wiley","Theresa Murillo","Timothy Roberts","Tony Torres","Tracy Logan","Troy Hoover","Twila Rubio","Velma Everett","Vincent Mccormick","Vincenzo Stafford","Vito Clark","Waldo Spencer","Werner Lowe","Werner Shepard","Wesley Ford","Wm Cantu","Zelma Pierce"]
[null,null,null,null,null,"Lincoln Bond",{"$f":"IF('Resulting List'!F38=\"\",\"\",'Resulting List'!F38)","v":""},null,{"$f":"TRANSPOSE(_xlfn._xlws.SORT(_xlfn.UNIQUE(_xlfn._xlws.FILTER(Customers[Names],ISNUMBER(SEARCH(Customers[[#This Row],[Search Criteria]],Customers[Names])),\"No data.\"))))","v":"Adriana Todd"},"Albert Ramirez","Alex Rubio","Amanda Beck","Amparo Orozco","Amy Todd","Angelina Roberson","April Fox","Arden Ayala","Arnoldo Pennington","Aubrey Giles","Bette Rivers","Brianna Alexander","Brianna Mora","Britt Vazquez","Broderick Gillespie","Brooke Roman","Calvin Buck","Carmela Mullins","Carol Stevenson","Carolina Russell","Carolyn Roberts","Chelsea Gilbert","Cheryl Williamson","Christa Frederick","Christian Armstrong","Christopher Stuart","Chung Krueger","Clare Whitney","Clarissa Archer","Claudio Lam","Cordell Mills","Craig Shepherd","Damien Kramer","Dane Burke","Danielle Stout","Darrel Liu","Darrin Mcneil","Darron Aguilar","Della Huber","Delores Krause","Dena Rosario","Dominick Johnston","Dona Herring","Dorothy Winters","Douglas Wiley","Doyle David","Earlene Hester","Earline Shepherd","Edwin Sparks","Eli Galvan","Elinor Kaufman","Elroy Porter","Elvin Flynn","Emmitt Porter","Erik Parsons","Ethel Forbes","Felicia Ware","Fidel Haynes","Francisco Valenzuela","Frank Hunt","Gabriela Moore","Gabrielle Patrick","Gale Fitzpatrick","Gayle Curtis","Genevieve Lucero","Gerry Oneal","Grady Ellis","Grover Escobar","Hans Patel","Horacio Black","Humberto Compton","Hunter Short","Ilene Mcguire","Imelda Lloyd","Ira Macdonald","Issac Allen","Jacques Velazquez","Janis Mullins","Janna Cowan","Javier Garner","Jayson Abbott","Jeannie Tapia","Jefferson Lee","Jeramy Keith","Jermaine Bradshaw","Jewel Lee","Jimmie Yang","Jodie Wood","John Cline","Josefina Dickerson","Josie Pineda","Judith Griffin","Julius Soto","Kelli Romero","Kerri Joseph","Kim Mccall","Lakeisha Velazquez","Latonya Logan","Lee Schmidt","Lela Atkins","Leland Robertson","Leonardo House","Leroy Mcintyre","Lesley Blevins","Lilia Berg","Lilly Stone","Lincoln Bond","Lindsay Hurst","Lionel Fuller","Lorene Hunter","Louis Kidd","Lucius Warren","Lucy Mejia","Lupe Ingram","Lynette Fuller","Lynnette Wright","Madge Copeland","Madge Tanner","Mae Sawyer","Malcolm Newman","Mamie Wong","Mandy Swanson","Marcella Everett","Marco Bright","Marcos Schaefer","Marcus Hays","Marina Walsh","Marion Savage","Marylou Bass","Marylou Mccarthy","Mathew Howard","Maurice Jacobson","Mauricio Bautista","Max Smith","Melanie Bridges","Melissa Brandt","Merlin Wu","Michel Simpson","Mickey Kennedy","Mike Sloan","Milton Walsh","Mohamed Allison","Mohammad Christensen","Nadia Macdonald","Naomi Snyder","Ned Lowe","Nettie Leonard","Olive Perkins","Ophelia Morrow","Oren Montes","Orlando Henderson","Owen Buchanan","Paul Norman","Rafael Barrett","Raymond Cochran","Reed Hooper","Reinaldo Houston","Renato Simmons","Rene Calhoun","Reva Hardin","Robert French","Robin Bender","Rodolfo Scott","Roland Blake","Roland Sullivan","Rolf Barnett","Ross Marquez","Ruthie Daugherty","Sandra Potts","Scott Stephenson","Scotty Gonzales","Sean Wiggins","Shana Gallagher","Sharron Montes","Sheryl Lindsey","Socorro Hayden","Solomon Andrade","Stacey Whitehead","Stevie Hale","Stuart Oliver","Stuart Riddle","Tammy Merritt","Theo Wiley","Theresa Murillo","Timothy Roberts","Tony Torres","Tracy Logan","Troy Hoover","Twila Rubio","Velma Everett","Vincent Mccormick","Vincenzo Stafford","Vito Clark","Waldo Spencer","Werner Lowe","Werner Shepard","Wesley Ford","Wm Cantu","Zelma Pierce"]
[null,null,null,null,null,"Waldo Spencer",{"$f":"IF('Resulting List'!F39=\"\",\"\",'Resulting List'!F39)","v":""},null,{"$f":"TRANSPOSE(_xlfn._xlws.SORT(_xlfn.UNIQUE(_xlfn._xlws.FILTER(Customers[Names],ISNUMBER(SEARCH(Customers[[#This Row],[Search Criteria]],Customers[Names])),\"No data.\"))))","v":"Adriana Todd"},"Albert Ramirez","Alex Rubio","Amanda Beck","Amparo Orozco","Amy Todd","Angelina Roberson","April Fox","Arden Ayala","Arnoldo Pennington","Aubrey Giles","Bette Rivers","Brianna Alexander","Brianna Mora","Britt Vazquez","Broderick Gillespie","Brooke Roman","Calvin Buck","Carmela Mullins","Carol Stevenson","Carolina Russell","Carolyn Roberts","Chelsea Gilbert","Cheryl Williamson","Christa Frederick","Christian Armstrong","Christopher Stuart","Chung Krueger","Clare Whitney","Clarissa Archer","Claudio Lam","Cordell Mills","Craig Shepherd","Damien Kramer","Dane Burke","Danielle Stout","Darrel Liu","Darrin Mcneil","Darron Aguilar","Della Huber","Delores Krause","Dena Rosario","Dominick Johnston","Dona Herring","Dorothy Winters","Douglas Wiley","Doyle David","Earlene Hester","Earline Shepherd","Edwin Sparks","Eli Galvan","Elinor Kaufman","Elroy Porter","Elvin Flynn","Emmitt Porter","Erik Parsons","Ethel Forbes","Felicia Ware","Fidel Haynes","Francisco Valenzuela","Frank Hunt","Gabriela Moore","Gabrielle Patrick","Gale Fitzpatrick","Gayle Curtis","Genevieve Lucero","Gerry Oneal","Grady Ellis","Grover Escobar","Hans Patel","Horacio Black","Humberto Compton","Hunter Short","Ilene Mcguire","Imelda Lloyd","Ira Macdonald","Issac Allen","Jacques Velazquez","Janis Mullins","Janna Cowan","Javier Garner","Jayson Abbott","Jeannie Tapia","Jefferson Lee","Jeramy Keith","Jermaine Bradshaw","Jewel Lee","Jimmie Yang","Jodie Wood","John Cline","Josefina Dickerson","Josie Pineda","Judith Griffin","Julius Soto","Kelli Romero","Kerri Joseph","Kim Mccall","Lakeisha Velazquez","Latonya Logan","Lee Schmidt","Lela Atkins","Leland Robertson","Leonardo House","Leroy Mcintyre","Lesley Blevins","Lilia Berg","Lilly Stone","Lincoln Bond","Lindsay Hurst","Lionel Fuller","Lorene Hunter","Louis Kidd","Lucius Warren","Lucy Mejia","Lupe Ingram","Lynette Fuller","Lynnette Wright","Madge Copeland","Madge Tanner","Mae Sawyer","Malcolm Newman","Mamie Wong","Mandy Swanson","Marcella Everett","Marco Bright","Marcos Schaefer","Marcus Hays","Marina Walsh","Marion Savage","Marylou Bass","Marylou Mccarthy","Mathew Howard","Maurice Jacobson","Mauricio Bautista","Max Smith","Melanie Bridges","Melissa Brandt","Merlin Wu","Michel Simpson","Mickey Kennedy","Mike Sloan","Milton Walsh","Mohamed Allison","Mohammad Christensen","Nadia Macdonald","Naomi Snyder","Ned Lowe","Nettie Leonard","Olive Perkins","Ophelia Morrow","Oren Montes","Orlando Henderson","Owen Buchanan","Paul Norman","Rafael Barrett","Raymond Cochran","Reed Hooper","Reinaldo Houston","Renato Simmons","Rene Calhoun","Reva Hardin","Robert French","Robin Bender","Rodolfo Scott","Roland Blake","Roland Sullivan","Rolf Barnett","Ross Marquez","Ruthie Daugherty","Sandra Potts","Scott Stephenson","Scotty Gonzales","Sean Wiggins","Shana Gallagher","Sharron Montes","Sheryl Lindsey","Socorro Hayden","Solomon Andrade","Stacey Whitehead","Stevie Hale","Stuart Oliver","Stuart Riddle","Tammy Merritt","Theo Wiley","Theresa Murillo","Timothy Roberts","Tony Torres","Tracy Logan","Troy Hoover","Twila Rubio","Velma Everett","Vincent Mccormick","Vincenzo Stafford","Vito Clark","Waldo Spencer","Werner Lowe","Werner Shepard","Wesley Ford","Wm Cantu","Zelma Pierce"]
[null,null,null,null,null,"Gabriela Moore",{"$f":"IF('Resulting List'!F40=\"\",\"\",'Resulting List'!F40)","v":""},null,{"$f":"TRANSPOSE(_xlfn._xlws.SORT(_xlfn.UNIQUE(_xlfn._xlws.FILTER(Customers[Names],ISNUMBER(SEARCH(Customers[[#This Row],[Search Criteria]],Customers[Names])),\"No data.\"))))","v":"Adriana Todd"},"Albert Ramirez","Alex Rubio","Amanda Beck","Amparo Orozco","Amy Todd","Angelina Roberson","April Fox","Arden Ayala","Arnoldo Pennington","Aubrey Giles","Bette Rivers","Brianna Alexander","Brianna Mora","Britt Vazquez","Broderick Gillespie","Brooke Roman","Calvin Buck","Carmela Mullins","Carol Stevenson","Carolina Russell","Carolyn Roberts","Chelsea Gilbert","Cheryl Williamson","Christa Frederick","Christian Armstrong","Christopher Stuart","Chung Krueger","Clare Whitney","Clarissa Archer","Claudio Lam","Cordell Mills","Craig Shepherd","Damien Kramer","Dane Burke","Danielle Stout","Darrel Liu","Darrin Mcneil","Darron Aguilar","Della Huber","Delores Krause","Dena Rosario","Dominick Johnston","Dona Herring","Dorothy Winters","Douglas Wiley","Doyle David","Earlene Hester","Earline Shepherd","Edwin Sparks","Eli Galvan","Elinor Kaufman","Elroy Porter","Elvin Flynn","Emmitt Porter","Erik Parsons","Ethel Forbes","Felicia Ware","Fidel Haynes","Francisco Valenzuela","Frank Hunt","Gabriela Moore","Gabrielle Patrick","Gale Fitzpatrick","Gayle Curtis","Genevieve Lucero","Gerry Oneal","Grady Ellis","Grover Escobar","Hans Patel","Horacio Black","Humberto Compton","Hunter Short","Ilene Mcguire","Imelda Lloyd","Ira Macdonald","Issac Allen","Jacques Velazquez","Janis Mullins","Janna Cowan","Javier Garner","Jayson Abbott","Jeannie Tapia","Jefferson Lee","Jeramy Keith","Jermaine Bradshaw","Jewel Lee","Jimmie Yang","Jodie Wood","John Cline","Josefina Dickerson","Josie Pineda","Judith Griffin","Julius Soto","Kelli Romero","Kerri Joseph","Kim Mccall","Lakeisha Velazquez","Latonya Logan","Lee Schmidt","Lela Atkins","Leland Robertson","Leonardo House","Leroy Mcintyre","Lesley Blevins","Lilia Berg","Lilly Stone","Lincoln Bond","Lindsay Hurst","Lionel Fuller","Lorene Hunter","Louis Kidd","Lucius Warren","Lucy Mejia","Lupe Ingram","Lynette Fuller","Lynnette Wright","Madge Copeland","Madge Tanner","Mae Sawyer","Malcolm Newman","Mamie Wong","Mandy Swanson","Marcella Everett","Marco Bright","Marcos Schaefer","Marcus Hays","Marina Walsh","Marion Savage","Marylou Bass","Marylou Mccarthy","Mathew Howard","Maurice Jacobson","Mauricio Bautista","Max Smith","Melanie Bridges","Melissa Brandt","Merlin Wu","Michel Simpson","Mickey Kennedy","Mike Sloan","Milton Walsh","Mohamed Allison","Mohammad Christensen","Nadia Macdonald","Naomi Snyder","Ned Lowe","Nettie Leonard","Olive Perkins","Ophelia Morrow","Oren Montes","Orlando Henderson","Owen Buchanan","Paul Norman","Rafael Barrett","Raymond Cochran","Reed Hooper","Reinaldo Houston","Renato Simmons","Rene Calhoun","Reva Hardin","Robert French","Robin Bender","Rodolfo Scott","Roland Blake","Roland Sullivan","Rolf Barnett","Ross Marquez","Ruthie Daugherty","Sandra Potts","Scott Stephenson","Scotty Gonzales","Sean Wiggins","Shana Gallagher","Sharron Montes","Sheryl Lindsey","Socorro Hayden","Solomon Andrade","Stacey Whitehead","Stevie Hale","Stuart Oliver","Stuart Riddle","Tammy Merritt","Theo Wiley","Theresa Murillo","Timothy Roberts","Tony Torres","Tracy Logan","Troy Hoover","Twila Rubio","Velma Everett","Vincent Mccormick","Vincenzo Stafford","Vito Clark","Waldo Spencer","Werner Lowe","Werner Shepard","Wesley Ford","Wm Cantu","Zelma Pierce"]
[null,null,null,null,null,"Renato Simmons",{"$f":"IF('Resulting List'!F41=\"\",\"\",'Resulting List'!F41)","v":""},null,{"$f":"TRANSPOSE(_xlfn._xlws.SORT(_xlfn.UNIQUE(_xlfn._xlws.FILTER(Customers[Names],ISNUMBER(SEARCH(Customers[[#This Row],[Search Criteria]],Customers[Names])),\"No data.\"))))","v":"Adriana Todd"},"Albert Ramirez","Alex Rubio","Amanda Beck","Amparo Orozco","Amy Todd","Angelina Roberson","April Fox","Arden Ayala","Arnoldo Pennington","Aubrey Giles","Bette Rivers","Brianna Alexander","Brianna Mora","Britt Vazquez","Broderick Gillespie","Brooke Roman","Calvin Buck","Carmela Mullins","Carol Stevenson","Carolina Russell","Carolyn Roberts","Chelsea Gilbert","Cheryl Williamson","Christa Frederick","Christian Armstrong","Christopher Stuart","Chung Krueger","Clare Whitney","Clarissa Archer","Claudio Lam","Cordell Mills","Craig Shepherd","Damien Kramer","Dane Burke","Danielle Stout","Darrel Liu","Darrin Mcneil","Darron Aguilar","Della Huber","Delores Krause","Dena Rosario","Dominick Johnston","Dona Herring","Dorothy Winters","Douglas Wiley","Doyle David","Earlene Hester","Earline Shepherd","Edwin Sparks","Eli Galvan","Elinor Kaufman","Elroy Porter","Elvin Flynn","Emmitt Porter","Erik Parsons","Ethel Forbes","Felicia Ware","Fidel Haynes","Francisco Valenzuela","Frank Hunt","Gabriela Moore","Gabrielle Patrick","Gale Fitzpatrick","Gayle Curtis","Genevieve Lucero","Gerry Oneal","Grady Ellis","Grover Escobar","Hans Patel","Horacio Black","Humberto Compton","Hunter Short","Ilene Mcguire","Imelda Lloyd","Ira Macdonald","Issac Allen","Jacques Velazquez","Janis Mullins","Janna Cowan","Javier Garner","Jayson Abbott","Jeannie Tapia","Jefferson Lee","Jeramy Keith","Jermaine Bradshaw","Jewel Lee","Jimmie Yang","Jodie Wood","John Cline","Josefina Dickerson","Josie Pineda","Judith Griffin","Julius Soto","Kelli Romero","Kerri Joseph","Kim Mccall","Lakeisha Velazquez","Latonya Logan","Lee Schmidt","Lela Atkins","Leland Robertson","Leonardo House","Leroy Mcintyre","Lesley Blevins","Lilia Berg","Lilly Stone","Lincoln Bond","Lindsay Hurst","Lionel Fuller","Lorene Hunter","Louis Kidd","Lucius Warren","Lucy Mejia","Lupe Ingram","Lynette Fuller","Lynnette Wright","Madge Copeland","Madge Tanner","Mae Sawyer","Malcolm Newman","Mamie Wong","Mandy Swanson","Marcella Everett","Marco Bright","Marcos Schaefer","Marcus Hays","Marina Walsh","Marion Savage","Marylou Bass","Marylou Mccarthy","Mathew Howard","Maurice Jacobson","Mauricio Bautista","Max Smith","Melanie Bridges","Melissa Brandt","Merlin Wu","Michel Simpson","Mickey Kennedy","Mike Sloan","Milton Walsh","Mohamed Allison","Mohammad Christensen","Nadia Macdonald","Naomi Snyder","Ned Lowe","Nettie Leonard","Olive Perkins","Ophelia Morrow","Oren Montes","Orlando Henderson","Owen Buchanan","Paul Norman","Rafael Barrett","Raymond Cochran","Reed Hooper","Reinaldo Houston","Renato Simmons","Rene Calhoun","Reva Hardin","Robert French","Robin Bender","Rodolfo Scott","Roland Blake","Roland Sullivan","Rolf Barnett","Ross Marquez","Ruthie Daugherty","Sandra Potts","Scott Stephenson","Scotty Gonzales","Sean Wiggins","Shana Gallagher","Sharron Montes","Sheryl Lindsey","Socorro Hayden","Solomon Andrade","Stacey Whitehead","Stevie Hale","Stuart Oliver","Stuart Riddle","Tammy Merritt","Theo Wiley","Theresa Murillo","Timothy Roberts","Tony Torres","Tracy Logan","Troy Hoover","Twila Rubio","Velma Everett","Vincent Mccormick","Vincenzo Stafford","Vito Clark","Waldo Spencer","Werner Lowe","Werner Shepard","Wesley Ford","Wm Cantu","Zelma Pierce"]
[null,null,null,null,null,"Malcolm Newman",{"$f":"IF('Resulting List'!F42=\"\",\"\",'Resulting List'!F42)","v":""},null,{"$f":"TRANSPOSE(_xlfn._xlws.SORT(_xlfn.UNIQUE(_xlfn._xlws.FILTER(Customers[Names],ISNUMBER(SEARCH(Customers[[#This Row],[Search Criteria]],Customers[Names])),\"No data.\"))))","v":"Adriana Todd"},"Albert Ramirez","Alex Rubio","Amanda Beck","Amparo Orozco","Amy Todd","Angelina Roberson","April Fox","Arden Ayala","Arnoldo Pennington","Aubrey Giles","Bette Rivers","Brianna Alexander","Brianna Mora","Britt Vazquez","Broderick Gillespie","Brooke Roman","Calvin Buck","Carmela Mullins","Carol Stevenson","Carolina Russell","Carolyn Roberts","Chelsea Gilbert","Cheryl Williamson","Christa Frederick","Christian Armstrong","Christopher Stuart","Chung Krueger","Clare Whitney","Clarissa Archer","Claudio Lam","Cordell Mills","Craig Shepherd","Damien Kramer","Dane Burke","Danielle Stout","Darrel Liu","Darrin Mcneil","Darron Aguilar","Della Huber","Delores Krause","Dena Rosario","Dominick Johnston","Dona Herring","Dorothy Winters","Douglas Wiley","Doyle David","Earlene Hester","Earline Shepherd","Edwin Sparks","Eli Galvan","Elinor Kaufman","Elroy Porter","Elvin Flynn","Emmitt Porter","Erik Parsons","Ethel Forbes","Felicia Ware","Fidel Haynes","Francisco Valenzuela","Frank Hunt","Gabriela Moore","Gabrielle Patrick","Gale Fitzpatrick","Gayle Curtis","Genevieve Lucero","Gerry Oneal","Grady Ellis","Grover Escobar","Hans Patel","Horacio Black","Humberto Compton","Hunter Short","Ilene Mcguire","Imelda Lloyd","Ira Macdonald","Issac Allen","Jacques Velazquez","Janis Mullins","Janna Cowan","Javier Garner","Jayson Abbott","Jeannie Tapia","Jefferson Lee","Jeramy Keith","Jermaine Bradshaw","Jewel Lee","Jimmie Yang","Jodie Wood","John Cline","Josefina Dickerson","Josie Pineda","Judith Griffin","Julius Soto","Kelli Romero","Kerri Joseph","Kim Mccall","Lakeisha Velazquez","Latonya Logan","Lee Schmidt","Lela Atkins","Leland Robertson","Leonardo House","Leroy Mcintyre","Lesley Blevins","Lilia Berg","Lilly Stone","Lincoln Bond","Lindsay Hurst","Lionel Fuller","Lorene Hunter","Louis Kidd","Lucius Warren","Lucy Mejia","Lupe Ingram","Lynette Fuller","Lynnette Wright","Madge Copeland","Madge Tanner","Mae Sawyer","Malcolm Newman","Mamie Wong","Mandy Swanson","Marcella Everett","Marco Bright","Marcos Schaefer","Marcus Hays","Marina Walsh","Marion Savage","Marylou Bass","Marylou Mccarthy","Mathew Howard","Maurice Jacobson","Mauricio Bautista","Max Smith","Melanie Bridges","Melissa Brandt","Merlin Wu","Michel Simpson","Mickey Kennedy","Mike Sloan","Milton Walsh","Mohamed Allison","Mohammad Christensen","Nadia Macdonald","Naomi Snyder","Ned Lowe","Nettie Leonard","Olive Perkins","Ophelia Morrow","Oren Montes","Orlando Henderson","Owen Buchanan","Paul Norman","Rafael Barrett","Raymond Cochran","Reed Hooper","Reinaldo Houston","Renato Simmons","Rene Calhoun","Reva Hardin","Robert French","Robin Bender","Rodolfo Scott","Roland Blake","Roland Sullivan","Rolf Barnett","Ross Marquez","Ruthie Daugherty","Sandra Potts","Scott Stephenson","Scotty Gonzales","Sean Wiggins","Shana Gallagher","Sharron Montes","Sheryl Lindsey","Socorro Hayden","Solomon Andrade","Stacey Whitehead","Stevie Hale","Stuart Oliver","Stuart Riddle","Tammy Merritt","Theo Wiley","Theresa Murillo","Timothy Roberts","Tony Torres","Tracy Logan","Troy Hoover","Twila Rubio","Velma Everett","Vincent Mccormick","Vincenzo Stafford","Vito Clark","Waldo Spencer","Werner Lowe","Werner Shepard","Wesley Ford","Wm Cantu","Zelma Pierce"]
[null,null,null,null,null,"Max Smith",{"$f":"IF('Resulting List'!F43=\"\",\"\",'Resulting List'!F43)","v":""},null,{"$f":"TRANSPOSE(_xlfn._xlws.SORT(_xlfn.UNIQUE(_xlfn._xlws.FILTER(Customers[Names],ISNUMBER(SEARCH(Customers[[#This Row],[Search Criteria]],Customers[Names])),\"No data.\"))))","v":"Adriana Todd"},"Albert Ramirez","Alex Rubio","Amanda Beck","Amparo Orozco","Amy Todd","Angelina Roberson","April Fox","Arden Ayala","Arnoldo Pennington","Aubrey Giles","Bette Rivers","Brianna Alexander","Brianna Mora","Britt Vazquez","Broderick Gillespie","Brooke Roman","Calvin Buck","Carmela Mullins","Carol Stevenson","Carolina Russell","Carolyn Roberts","Chelsea Gilbert","Cheryl Williamson","Christa Frederick","Christian Armstrong","Christopher Stuart","Chung Krueger","Clare Whitney","Clarissa Archer","Claudio Lam","Cordell Mills","Craig Shepherd","Damien Kramer","Dane Burke","Danielle Stout","Darrel Liu","Darrin Mcneil","Darron Aguilar","Della Huber","Delores Krause","Dena Rosario","Dominick Johnston","Dona Herring","Dorothy Winters","Douglas Wiley","Doyle David","Earlene Hester","Earline Shepherd","Edwin Sparks","Eli Galvan","Elinor Kaufman","Elroy Porter","Elvin Flynn","Emmitt Porter","Erik Parsons","Ethel Forbes","Felicia Ware","Fidel Haynes","Francisco Valenzuela","Frank Hunt","Gabriela Moore","Gabrielle Patrick","Gale Fitzpatrick","Gayle Curtis","Genevieve Lucero","Gerry Oneal","Grady Ellis","Grover Escobar","Hans Patel","Horacio Black","Humberto Compton","Hunter Short","Ilene Mcguire","Imelda Lloyd","Ira Macdonald","Issac Allen","Jacques Velazquez","Janis Mullins","Janna Cowan","Javier Garner","Jayson Abbott","Jeannie Tapia","Jefferson Lee","Jeramy Keith","Jermaine Bradshaw","Jewel Lee","Jimmie Yang","Jodie Wood","John Cline","Josefina Dickerson","Josie Pineda","Judith Griffin","Julius Soto","Kelli Romero","Kerri Joseph","Kim Mccall","Lakeisha Velazquez","Latonya Logan","Lee Schmidt","Lela Atkins","Leland Robertson","Leonardo House","Leroy Mcintyre","Lesley Blevins","Lilia Berg","Lilly Stone","Lincoln Bond","Lindsay Hurst","Lionel Fuller","Lorene Hunter","Louis Kidd","Lucius Warren","Lucy Mejia","Lupe Ingram","Lynette Fuller","Lynnette Wright","Madge Copeland","Madge Tanner","Mae Sawyer","Malcolm Newman","Mamie Wong","Mandy Swanson","Marcella Everett","Marco Bright","Marcos Schaefer","Marcus Hays","Marina Walsh","Marion Savage","Marylou Bass","Marylou Mccarthy","Mathew Howard","Maurice Jacobson","Mauricio Bautista","Max Smith","Melanie Bridges","Melissa Brandt","Merlin Wu","Michel Simpson","Mickey Kennedy","Mike Sloan","Milton Walsh","Mohamed Allison","Mohammad Christensen","Nadia Macdonald","Naomi Snyder","Ned Lowe","Nettie Leonard","Olive Perkins","Ophelia Morrow","Oren Montes","Orlando Henderson","Owen Buchanan","Paul Norman","Rafael Barrett","Raymond Cochran","Reed Hooper","Reinaldo Houston","Renato Simmons","Rene Calhoun","Reva Hardin","Robert French","Robin Bender","Rodolfo Scott","Roland Blake","Roland Sullivan","Rolf Barnett","Ross Marquez","Ruthie Daugherty","Sandra Potts","Scott Stephenson","Scotty Gonzales","Sean Wiggins","Shana Gallagher","Sharron Montes","Sheryl Lindsey","Socorro Hayden","Solomon Andrade","Stacey Whitehead","Stevie Hale","Stuart Oliver","Stuart Riddle","Tammy Merritt","Theo Wiley","Theresa Murillo","Timothy Roberts","Tony Torres","Tracy Logan","Troy Hoover","Twila Rubio","Velma Everett","Vincent Mccormick","Vincenzo Stafford","Vito Clark","Waldo Spencer","Werner Lowe","Werner Shepard","Wesley Ford","Wm Cantu","Zelma Pierce"]
[null,null,null,null,null,"Edwin Sparks",{"$f":"IF('Resulting List'!F44=\"\",\"\",'Resulting List'!F44)","v":""},null,{"$f":"TRANSPOSE(_xlfn._xlws.SORT(_xlfn.UNIQUE(_xlfn._xlws.FILTER(Customers[Names],ISNUMBER(SEARCH(Customers[[#This Row],[Search Criteria]],Customers[Names])),\"No data.\"))))","v":"Adriana Todd"},"Albert Ramirez","Alex Rubio","Amanda Beck","Amparo Orozco","Amy Todd","Angelina Roberson","April Fox","Arden Ayala","Arnoldo Pennington","Aubrey Giles","Bette Rivers","Brianna Alexander","Brianna Mora","Britt Vazquez","Broderick Gillespie","Brooke Roman","Calvin Buck","Carmela Mullins","Carol Stevenson","Carolina Russell","Carolyn Roberts","Chelsea Gilbert","Cheryl Williamson","Christa Frederick","Christian Armstrong","Christopher Stuart","Chung Krueger","Clare Whitney","Clarissa Archer","Claudio Lam","Cordell Mills","Craig Shepherd","Damien Kramer","Dane Burke","Danielle Stout","Darrel Liu","Darrin Mcneil","Darron Aguilar","Della Huber","Delores Krause","Dena Rosario","Dominick Johnston","Dona Herring","Dorothy Winters","Douglas Wiley","Doyle David","Earlene Hester","Earline Shepherd","Edwin Sparks","Eli Galvan","Elinor Kaufman","Elroy Porter","Elvin Flynn","Emmitt Porter","Erik Parsons","Ethel Forbes","Felicia Ware","Fidel Haynes","Francisco Valenzuela","Frank Hunt","Gabriela Moore","Gabrielle Patrick","Gale Fitzpatrick","Gayle Curtis","Genevieve Lucero","Gerry Oneal","Grady Ellis","Grover Escobar","Hans Patel","Horacio Black","Humberto Compton","Hunter Short","Ilene Mcguire","Imelda Lloyd","Ira Macdonald","Issac Allen","Jacques Velazquez","Janis Mullins","Janna Cowan","Javier Garner","Jayson Abbott","Jeannie Tapia","Jefferson Lee","Jeramy Keith","Jermaine Bradshaw","Jewel Lee","Jimmie Yang","Jodie Wood","John Cline","Josefina Dickerson","Josie Pineda","Judith Griffin","Julius Soto","Kelli Romero","Kerri Joseph","Kim Mccall","Lakeisha Velazquez","Latonya Logan","Lee Schmidt","Lela Atkins","Leland Robertson","Leonardo House","Leroy Mcintyre","Lesley Blevins","Lilia Berg","Lilly Stone","Lincoln Bond","Lindsay Hurst","Lionel Fuller","Lorene Hunter","Louis Kidd","Lucius Warren","Lucy Mejia","Lupe Ingram","Lynette Fuller","Lynnette Wright","Madge Copeland","Madge Tanner","Mae Sawyer","Malcolm Newman","Mamie Wong","Mandy Swanson","Marcella Everett","Marco Bright","Marcos Schaefer","Marcus Hays","Marina Walsh","Marion Savage","Marylou Bass","Marylou Mccarthy","Mathew Howard","Maurice Jacobson","Mauricio Bautista","Max Smith","Melanie Bridges","Melissa Brandt","Merlin Wu","Michel Simpson","Mickey Kennedy","Mike Sloan","Milton Walsh","Mohamed Allison","Mohammad Christensen","Nadia Macdonald","Naomi Snyder","Ned Lowe","Nettie Leonard","Olive Perkins","Ophelia Morrow","Oren Montes","Orlando Henderson","Owen Buchanan","Paul Norman","Rafael Barrett","Raymond Cochran","Reed Hooper","Reinaldo Houston","Renato Simmons","Rene Calhoun","Reva Hardin","Robert French","Robin Bender","Rodolfo Scott","Roland Blake","Roland Sullivan","Rolf Barnett","Ross Marquez","Ruthie Daugherty","Sandra Potts","Scott Stephenson","Scotty Gonzales","Sean Wiggins","Shana Gallagher","Sharron Montes","Sheryl Lindsey","Socorro Hayden","Solomon Andrade","Stacey Whitehead","Stevie Hale","Stuart Oliver","Stuart Riddle","Tammy Merritt","Theo Wiley","Theresa Murillo","Timothy Roberts","Tony Torres","Tracy Logan","Troy Hoover","Twila Rubio","Velma Everett","Vincent Mccormick","Vincenzo Stafford","Vito Clark","Waldo Spencer","Werner Lowe","Werner Shepard","Wesley Ford","Wm Cantu","Zelma Pierce"]
[null,null,null,null,null,"Chelsea Gilbert",{"$f":"IF('Resulting List'!F45=\"\",\"\",'Resulting List'!F45)","v":""},null,{"$f":"TRANSPOSE(_xlfn._xlws.SORT(_xlfn.UNIQUE(_xlfn._xlws.FILTER(Customers[Names],ISNUMBER(SEARCH(Customers[[#This Row],[Search Criteria]],Customers[Names])),\"No data.\"))))","v":"Adriana Todd"},"Albert Ramirez","Alex Rubio","Amanda Beck","Amparo Orozco","Amy Todd","Angelina Roberson","April Fox","Arden Ayala","Arnoldo Pennington","Aubrey Giles","Bette Rivers","Brianna Alexander","Brianna Mora","Britt Vazquez","Broderick Gillespie","Brooke Roman","Calvin Buck","Carmela Mullins","Carol Stevenson","Carolina Russell","Carolyn Roberts","Chelsea Gilbert","Cheryl Williamson","Christa Frederick","Christian Armstrong","Christopher Stuart","Chung Krueger","Clare Whitney","Clarissa Archer","Claudio Lam","Cordell Mills","Craig Shepherd","Damien Kramer","Dane Burke","Danielle Stout","Darrel Liu","Darrin Mcneil","Darron Aguilar","Della Huber","Delores Krause","Dena Rosario","Dominick Johnston","Dona Herring","Dorothy Winters","Douglas Wiley","Doyle David","Earlene Hester","Earline Shepherd","Edwin Sparks","Eli Galvan","Elinor Kaufman","Elroy Porter","Elvin Flynn","Emmitt Porter","Erik Parsons","Ethel Forbes","Felicia Ware","Fidel Haynes","Francisco Valenzuela","Frank Hunt","Gabriela Moore","Gabrielle Patrick","Gale Fitzpatrick","Gayle Curtis","Genevieve Lucero","Gerry Oneal","Grady Ellis","Grover Escobar","Hans Patel","Horacio Black","Humberto Compton","Hunter Short","Ilene Mcguire","Imelda Lloyd","Ira Macdonald","Issac Allen","Jacques Velazquez","Janis Mullins","Janna Cowan","Javier Garner","Jayson Abbott","Jeannie Tapia","Jefferson Lee","Jeramy Keith","Jermaine Bradshaw","Jewel Lee","Jimmie Yang","Jodie Wood","John Cline","Josefina Dickerson","Josie Pineda","Judith Griffin","Julius Soto","Kelli Romero","Kerri Joseph","Kim Mccall","Lakeisha Velazquez","Latonya Logan","Lee Schmidt","Lela Atkins","Leland Robertson","Leonardo House","Leroy Mcintyre","Lesley Blevins","Lilia Berg","Lilly Stone","Lincoln Bond","Lindsay Hurst","Lionel Fuller","Lorene Hunter","Louis Kidd","Lucius Warren","Lucy Mejia","Lupe Ingram","Lynette Fuller","Lynnette Wright","Madge Copeland","Madge Tanner","Mae Sawyer","Malcolm Newman","Mamie Wong","Mandy Swanson","Marcella Everett","Marco Bright","Marcos Schaefer","Marcus Hays","Marina Walsh","Marion Savage","Marylou Bass","Marylou Mccarthy","Mathew Howard","Maurice Jacobson","Mauricio Bautista","Max Smith","Melanie Bridges","Melissa Brandt","Merlin Wu","Michel Simpson","Mickey Kennedy","Mike Sloan","Milton Walsh","Mohamed Allison","Mohammad Christensen","Nadia Macdonald","Naomi Snyder","Ned Lowe","Nettie Leonard","Olive Perkins","Ophelia Morrow","Oren Montes","Orlando Henderson","Owen Buchanan","Paul Norman","Rafael Barrett","Raymond Cochran","Reed Hooper","Reinaldo Houston","Renato Simmons","Rene Calhoun","Reva Hardin","Robert French","Robin Bender","Rodolfo Scott","Roland Blake","Roland Sullivan","Rolf Barnett","Ross Marquez","Ruthie Daugherty","Sandra Potts","Scott Stephenson","Scotty Gonzales","Sean Wiggins","Shana Gallagher","Sharron Montes","Sheryl Lindsey","Socorro Hayden","Solomon Andrade","Stacey Whitehead","Stevie Hale","Stuart Oliver","Stuart Riddle","Tammy Merritt","Theo Wiley","Theresa Murillo","Timothy Roberts","Tony Torres","Tracy Logan","Troy Hoover","Twila Rubio","Velma Everett","Vincent Mccormick","Vincenzo Stafford","Vito Clark","Waldo Spencer","Werner Lowe","Werner Shepard","Wesley Ford","Wm Cantu","Zelma Pierce"]
[null,null,null,null,null,"Scott Stephenson",{"$f":"IF('Resulting List'!F46=\"\",\"\",'Resulting List'!F46)","v":""},null,{"$f":"TRANSPOSE(_xlfn._xlws.SORT(_xlfn.UNIQUE(_xlfn._xlws.FILTER(Customers[Names],ISNUMBER(SEARCH(Customers[[#This Row],[Search Criteria]],Customers[Names])),\"No data.\"))))","v":"Adriana Todd"},"Albert Ramirez","Alex Rubio","Amanda Beck","Amparo Orozco","Amy Todd","Angelina Roberson","April Fox","Arden Ayala","Arnoldo Pennington","Aubrey Giles","Bette Rivers","Brianna Alexander","Brianna Mora","Britt Vazquez","Broderick Gillespie","Brooke Roman","Calvin Buck","Carmela Mullins","Carol Stevenson","Carolina Russell","Carolyn Roberts","Chelsea Gilbert","Cheryl Williamson","Christa Frederick","Christian Armstrong","Christopher Stuart","Chung Krueger","Clare Whitney","Clarissa Archer","Claudio Lam","Cordell Mills","Craig Shepherd","Damien Kramer","Dane Burke","Danielle Stout","Darrel Liu","Darrin Mcneil","Darron Aguilar","Della Huber","Delores Krause","Dena Rosario","Dominick Johnston","Dona Herring","Dorothy Winters","Douglas Wiley","Doyle David","Earlene Hester","Earline Shepherd","Edwin Sparks","Eli Galvan","Elinor Kaufman","Elroy Porter","Elvin Flynn","Emmitt Porter","Erik Parsons","Ethel Forbes","Felicia Ware","Fidel Haynes","Francisco Valenzuela","Frank Hunt","Gabriela Moore","Gabrielle Patrick","Gale Fitzpatrick","Gayle Curtis","Genevieve Lucero","Gerry Oneal","Grady Ellis","Grover Escobar","Hans Patel","Horacio Black","Humberto Compton","Hunter Short","Ilene Mcguire","Imelda Lloyd","Ira Macdonald","Issac Allen","Jacques Velazquez","Janis Mullins","Janna Cowan","Javier Garner","Jayson Abbott","Jeannie Tapia","Jefferson Lee","Jeramy Keith","Jermaine Bradshaw","Jewel Lee","Jimmie Yang","Jodie Wood","John Cline","Josefina Dickerson","Josie Pineda","Judith Griffin","Julius Soto","Kelli Romero","Kerri Joseph","Kim Mccall","Lakeisha Velazquez","Latonya Logan","Lee Schmidt","Lela Atkins","Leland Robertson","Leonardo House","Leroy Mcintyre","Lesley Blevins","Lilia Berg","Lilly Stone","Lincoln Bond","Lindsay Hurst","Lionel Fuller","Lorene Hunter","Louis Kidd","Lucius Warren","Lucy Mejia","Lupe Ingram","Lynette Fuller","Lynnette Wright","Madge Copeland","Madge Tanner","Mae Sawyer","Malcolm Newman","Mamie Wong","Mandy Swanson","Marcella Everett","Marco Bright","Marcos Schaefer","Marcus Hays","Marina Walsh","Marion Savage","Marylou Bass","Marylou Mccarthy","Mathew Howard","Maurice Jacobson","Mauricio Bautista","Max Smith","Melanie Bridges","Melissa Brandt","Merlin Wu","Michel Simpson","Mickey Kennedy","Mike Sloan","Milton Walsh","Mohamed Allison","Mohammad Christensen","Nadia Macdonald","Naomi Snyder","Ned Lowe","Nettie Leonard","Olive Perkins","Ophelia Morrow","Oren Montes","Orlando Henderson","Owen Buchanan","Paul Norman","Rafael Barrett","Raymond Cochran","Reed Hooper","Reinaldo Houston","Renato Simmons","Rene Calhoun","Reva Hardin","Robert French","Robin Bender","Rodolfo Scott","Roland Blake","Roland Sullivan","Rolf Barnett","Ross Marquez","Ruthie Daugherty","Sandra Potts","Scott Stephenson","Scotty Gonzales","Sean Wiggins","Shana Gallagher","Sharron Montes","Sheryl Lindsey","Socorro Hayden","Solomon Andrade","Stacey Whitehead","Stevie Hale","Stuart Oliver","Stuart Riddle","Tammy Merritt","Theo Wiley","Theresa Murillo","Timothy Roberts","Tony Torres","Tracy Logan","Troy Hoover","Twila Rubio","Velma Everett","Vincent Mccormick","Vincenzo Stafford","Vito Clark","Waldo Spencer","Werner Lowe","Werner Shepard","Wesley Ford","Wm Cantu","Zelma Pierce"]
[null,null,null,null,null,"Rene Calhoun",{"$f":"IF('Resulting List'!F47=\"\",\"\",'Resulting List'!F47)","v":""},null,{"$f":"TRANSPOSE(_xlfn._xlws.SORT(_xlfn.UNIQUE(_xlfn._xlws.FILTER(Customers[Names],ISNUMBER(SEARCH(Customers[[#This Row],[Search Criteria]],Customers[Names])),\"No data.\"))))","v":"Adriana Todd"},"Albert Ramirez","Alex Rubio","Amanda Beck","Amparo Orozco","Amy Todd","Angelina Roberson","April Fox","Arden Ayala","Arnoldo Pennington","Aubrey Giles","Bette Rivers","Brianna Alexander","Brianna Mora","Britt Vazquez","Broderick Gillespie","Brooke Roman","Calvin Buck","Carmela Mullins","Carol Stevenson","Carolina Russell","Carolyn Roberts","Chelsea Gilbert","Cheryl Williamson","Christa Frederick","Christian Armstrong","Christopher Stuart","Chung Krueger","Clare Whitney","Clarissa Archer","Claudio Lam","Cordell Mills","Craig Shepherd","Damien Kramer","Dane Burke","Danielle Stout","Darrel Liu","Darrin Mcneil","Darron Aguilar","Della Huber","Delores Krause","Dena Rosario","Dominick Johnston","Dona Herring","Dorothy Winters","Douglas Wiley","Doyle David","Earlene Hester","Earline Shepherd","Edwin Sparks","Eli Galvan","Elinor Kaufman","Elroy Porter","Elvin Flynn","Emmitt Porter","Erik Parsons","Ethel Forbes","Felicia Ware","Fidel Haynes","Francisco Valenzuela","Frank Hunt","Gabriela Moore","Gabrielle Patrick","Gale Fitzpatrick","Gayle Curtis","Genevieve Lucero","Gerry Oneal","Grady Ellis","Grover Escobar","Hans Patel","Horacio Black","Humberto Compton","Hunter Short","Ilene Mcguire","Imelda Lloyd","Ira Macdonald","Issac Allen","Jacques Velazquez","Janis Mullins","Janna Cowan","Javier Garner","Jayson Abbott","Jeannie Tapia","Jefferson Lee","Jeramy Keith","Jermaine Bradshaw","Jewel Lee","Jimmie Yang","Jodie Wood","John Cline","Josefina Dickerson","Josie Pineda","Judith Griffin","Julius Soto","Kelli Romero","Kerri Joseph","Kim Mccall","Lakeisha Velazquez","Latonya Logan","Lee Schmidt","Lela Atkins","Leland Robertson","Leonardo House","Leroy Mcintyre","Lesley Blevins","Lilia Berg","Lilly Stone","Lincoln Bond","Lindsay Hurst","Lionel Fuller","Lorene Hunter","Louis Kidd","Lucius Warren","Lucy Mejia","Lupe Ingram","Lynette Fuller","Lynnette Wright","Madge Copeland","Madge Tanner","Mae Sawyer","Malcolm Newman","Mamie Wong","Mandy Swanson","Marcella Everett","Marco Bright","Marcos Schaefer","Marcus Hays","Marina Walsh","Marion Savage","Marylou Bass","Marylou Mccarthy","Mathew Howard","Maurice Jacobson","Mauricio Bautista","Max Smith","Melanie Bridges","Melissa Brandt","Merlin Wu","Michel Simpson","Mickey Kennedy","Mike Sloan","Milton Walsh","Mohamed Allison","Mohammad Christensen","Nadia Macdonald","Naomi Snyder","Ned Lowe","Nettie Leonard","Olive Perkins","Ophelia Morrow","Oren Montes","Orlando Henderson","Owen Buchanan","Paul Norman","Rafael Barrett","Raymond Cochran","Reed Hooper","Reinaldo Houston","Renato Simmons","Rene Calhoun","Reva Hardin","Robert French","Robin Bender","Rodolfo Scott","Roland Blake","Roland Sullivan","Rolf Barnett","Ross Marquez","Ruthie Daugherty","Sandra Potts","Scott Stephenson","Scotty Gonzales","Sean Wiggins","Shana Gallagher","Sharron Montes","Sheryl Lindsey","Socorro Hayden","Solomon Andrade","Stacey Whitehead","Stevie Hale","Stuart Oliver","Stuart Riddle","Tammy Merritt","Theo Wiley","Theresa Murillo","Timothy Roberts","Tony Torres","Tracy Logan","Troy Hoover","Twila Rubio","Velma Everett","Vincent Mccormick","Vincenzo Stafford","Vito Clark","Waldo Spencer","Werner Lowe","Werner Shepard","Wesley Ford","Wm Cantu","Zelma Pierce"]
[null,null,null,null,null,"Horacio Black",{"$f":"IF('Resulting List'!F48=\"\",\"\",'Resulting List'!F48)","v":""},null,{"$f":"TRANSPOSE(_xlfn._xlws.SORT(_xlfn.UNIQUE(_xlfn._xlws.FILTER(Customers[Names],ISNUMBER(SEARCH(Customers[[#This Row],[Search Criteria]],Customers[Names])),\"No data.\"))))","v":"Adriana Todd"},"Albert Ramirez","Alex Rubio","Amanda Beck","Amparo Orozco","Amy Todd","Angelina Roberson","April Fox","Arden Ayala","Arnoldo Pennington","Aubrey Giles","Bette Rivers","Brianna Alexander","Brianna Mora","Britt Vazquez","Broderick Gillespie","Brooke Roman","Calvin Buck","Carmela Mullins","Carol Stevenson","Carolina Russell","Carolyn Roberts","Chelsea Gilbert","Cheryl Williamson","Christa Frederick","Christian Armstrong","Christopher Stuart","Chung Krueger","Clare Whitney","Clarissa Archer","Claudio Lam","Cordell Mills","Craig Shepherd","Damien Kramer","Dane Burke","Danielle Stout","Darrel Liu","Darrin Mcneil","Darron Aguilar","Della Huber","Delores Krause","Dena Rosario","Dominick Johnston","Dona Herring","Dorothy Winters","Douglas Wiley","Doyle David","Earlene Hester","Earline Shepherd","Edwin Sparks","Eli Galvan","Elinor Kaufman","Elroy Porter","Elvin Flynn","Emmitt Porter","Erik Parsons","Ethel Forbes","Felicia Ware","Fidel Haynes","Francisco Valenzuela","Frank Hunt","Gabriela Moore","Gabrielle Patrick","Gale Fitzpatrick","Gayle Curtis","Genevieve Lucero","Gerry Oneal","Grady Ellis","Grover Escobar","Hans Patel","Horacio Black","Humberto Compton","Hunter Short","Ilene Mcguire","Imelda Lloyd","Ira Macdonald","Issac Allen","Jacques Velazquez","Janis Mullins","Janna Cowan","Javier Garner","Jayson Abbott","Jeannie Tapia","Jefferson Lee","Jeramy Keith","Jermaine Bradshaw","Jewel Lee","Jimmie Yang","Jodie Wood","John Cline","Josefina Dickerson","Josie Pineda","Judith Griffin","Julius Soto","Kelli Romero","Kerri Joseph","Kim Mccall","Lakeisha Velazquez","Latonya Logan","Lee Schmidt","Lela Atkins","Leland Robertson","Leonardo House","Leroy Mcintyre","Lesley Blevins","Lilia Berg","Lilly Stone","Lincoln Bond","Lindsay Hurst","Lionel Fuller","Lorene Hunter","Louis Kidd","Lucius Warren","Lucy Mejia","Lupe Ingram","Lynette Fuller","Lynnette Wright","Madge Copeland","Madge Tanner","Mae Sawyer","Malcolm Newman","Mamie Wong","Mandy Swanson","Marcella Everett","Marco Bright","Marcos Schaefer","Marcus Hays","Marina Walsh","Marion Savage","Marylou Bass","Marylou Mccarthy","Mathew Howard","Maurice Jacobson","Mauricio Bautista","Max Smith","Melanie Bridges","Melissa Brandt","Merlin Wu","Michel Simpson","Mickey Kennedy","Mike Sloan","Milton Walsh","Mohamed Allison","Mohammad Christensen","Nadia Macdonald","Naomi Snyder","Ned Lowe","Nettie Leonard","Olive Perkins","Ophelia Morrow","Oren Montes","Orlando Henderson","Owen Buchanan","Paul Norman","Rafael Barrett","Raymond Cochran","Reed Hooper","Reinaldo Houston","Renato Simmons","Rene Calhoun","Reva Hardin","Robert French","Robin Bender","Rodolfo Scott","Roland Blake","Roland Sullivan","Rolf Barnett","Ross Marquez","Ruthie Daugherty","Sandra Potts","Scott Stephenson","Scotty Gonzales","Sean Wiggins","Shana Gallagher","Sharron Montes","Sheryl Lindsey","Socorro Hayden","Solomon Andrade","Stacey Whitehead","Stevie Hale","Stuart Oliver","Stuart Riddle","Tammy Merritt","Theo Wiley","Theresa Murillo","Timothy Roberts","Tony Torres","Tracy Logan","Troy Hoover","Twila Rubio","Velma Everett","Vincent Mccormick","Vincenzo Stafford","Vito Clark","Waldo Spencer","Werner Lowe","Werner Shepard","Wesley Ford","Wm Cantu","Zelma Pierce"]
[null,null,null,null,null,"Madge Copeland",{"$f":"IF('Resulting List'!F49=\"\",\"\",'Resulting List'!F49)","v":""},null,{"$f":"TRANSPOSE(_xlfn._xlws.SORT(_xlfn.UNIQUE(_xlfn._xlws.FILTER(Customers[Names],ISNUMBER(SEARCH(Customers[[#This Row],[Search Criteria]],Customers[Names])),\"No data.\"))))","v":"Adriana Todd"},"Albert Ramirez","Alex Rubio","Amanda Beck","Amparo Orozco","Amy Todd","Angelina Roberson","April Fox","Arden Ayala","Arnoldo Pennington","Aubrey Giles","Bette Rivers","Brianna Alexander","Brianna Mora","Britt Vazquez","Broderick Gillespie","Brooke Roman","Calvin Buck","Carmela Mullins","Carol Stevenson","Carolina Russell","Carolyn Roberts","Chelsea Gilbert","Cheryl Williamson","Christa Frederick","Christian Armstrong","Christopher Stuart","Chung Krueger","Clare Whitney","Clarissa Archer","Claudio Lam","Cordell Mills","Craig Shepherd","Damien Kramer","Dane Burke","Danielle Stout","Darrel Liu","Darrin Mcneil","Darron Aguilar","Della Huber","Delores Krause","Dena Rosario","Dominick Johnston","Dona Herring","Dorothy Winters","Douglas Wiley","Doyle David","Earlene Hester","Earline Shepherd","Edwin Sparks","Eli Galvan","Elinor Kaufman","Elroy Porter","Elvin Flynn","Emmitt Porter","Erik Parsons","Ethel Forbes","Felicia Ware","Fidel Haynes","Francisco Valenzuela","Frank Hunt","Gabriela Moore","Gabrielle Patrick","Gale Fitzpatrick","Gayle Curtis","Genevieve Lucero","Gerry Oneal","Grady Ellis","Grover Escobar","Hans Patel","Horacio Black","Humberto Compton","Hunter Short","Ilene Mcguire","Imelda Lloyd","Ira Macdonald","Issac Allen","Jacques Velazquez","Janis Mullins","Janna Cowan","Javier Garner","Jayson Abbott","Jeannie Tapia","Jefferson Lee","Jeramy Keith","Jermaine Bradshaw","Jewel Lee","Jimmie Yang","Jodie Wood","John Cline","Josefina Dickerson","Josie Pineda","Judith Griffin","Julius Soto","Kelli Romero","Kerri Joseph","Kim Mccall","Lakeisha Velazquez","Latonya Logan","Lee Schmidt","Lela Atkins","Leland Robertson","Leonardo House","Leroy Mcintyre","Lesley Blevins","Lilia Berg","Lilly Stone","Lincoln Bond","Lindsay Hurst","Lionel Fuller","Lorene Hunter","Louis Kidd","Lucius Warren","Lucy Mejia","Lupe Ingram","Lynette Fuller","Lynnette Wright","Madge Copeland","Madge Tanner","Mae Sawyer","Malcolm Newman","Mamie Wong","Mandy Swanson","Marcella Everett","Marco Bright","Marcos Schaefer","Marcus Hays","Marina Walsh","Marion Savage","Marylou Bass","Marylou Mccarthy","Mathew Howard","Maurice Jacobson","Mauricio Bautista","Max Smith","Melanie Bridges","Melissa Brandt","Merlin Wu","Michel Simpson","Mickey Kennedy","Mike Sloan","Milton Walsh","Mohamed Allison","Mohammad Christensen","Nadia Macdonald","Naomi Snyder","Ned Lowe","Nettie Leonard","Olive Perkins","Ophelia Morrow","Oren Montes","Orlando Henderson","Owen Buchanan","Paul Norman","Rafael Barrett","Raymond Cochran","Reed Hooper","Reinaldo Houston","Renato Simmons","Rene Calhoun","Reva Hardin","Robert French","Robin Bender","Rodolfo Scott","Roland Blake","Roland Sullivan","Rolf Barnett","Ross Marquez","Ruthie Daugherty","Sandra Potts","Scott Stephenson","Scotty Gonzales","Sean Wiggins","Shana Gallagher","Sharron Montes","Sheryl Lindsey","Socorro Hayden","Solomon Andrade","Stacey Whitehead","Stevie Hale","Stuart Oliver","Stuart Riddle","Tammy Merritt","Theo Wiley","Theresa Murillo","Timothy Roberts","Tony Torres","Tracy Logan","Troy Hoover","Twila Rubio","Velma Everett","Vincent Mccormick","Vincenzo Stafford","Vito Clark","Waldo Spencer","Werner Lowe","Werner Shepard","Wesley Ford","Wm Cantu","Zelma Pierce"]
[null,null,null,null,null,"Reed Hooper",{"$f":"IF('Resulting List'!F50=\"\",\"\",'Resulting List'!F50)","v":""},null,{"$f":"TRANSPOSE(_xlfn._xlws.SORT(_xlfn.UNIQUE(_xlfn._xlws.FILTER(Customers[Names],ISNUMBER(SEARCH(Customers[[#This Row],[Search Criteria]],Customers[Names])),\"No data.\"))))","v":"Adriana Todd"},"Albert Ramirez","Alex Rubio","Amanda Beck","Amparo Orozco","Amy Todd","Angelina Roberson","April Fox","Arden Ayala","Arnoldo Pennington","Aubrey Giles","Bette Rivers","Brianna Alexander","Brianna Mora","Britt Vazquez","Broderick Gillespie","Brooke Roman","Calvin Buck","Carmela Mullins","Carol Stevenson","Carolina Russell","Carolyn Roberts","Chelsea Gilbert","Cheryl Williamson","Christa Frederick","Christian Armstrong","Christopher Stuart","Chung Krueger","Clare Whitney","Clarissa Archer","Claudio Lam","Cordell Mills","Craig Shepherd","Damien Kramer","Dane Burke","Danielle Stout","Darrel Liu","Darrin Mcneil","Darron Aguilar","Della Huber","Delores Krause","Dena Rosario","Dominick Johnston","Dona Herring","Dorothy Winters","Douglas Wiley","Doyle David","Earlene Hester","Earline Shepherd","Edwin Sparks","Eli Galvan","Elinor Kaufman","Elroy Porter","Elvin Flynn","Emmitt Porter","Erik Parsons","Ethel Forbes","Felicia Ware","Fidel Haynes","Francisco Valenzuela","Frank Hunt","Gabriela Moore","Gabrielle Patrick","Gale Fitzpatrick","Gayle Curtis","Genevieve Lucero","Gerry Oneal","Grady Ellis","Grover Escobar","Hans Patel","Horacio Black","Humberto Compton","Hunter Short","Ilene Mcguire","Imelda Lloyd","Ira Macdonald","Issac Allen","Jacques Velazquez","Janis Mullins","Janna Cowan","Javier Garner","Jayson Abbott","Jeannie Tapia","Jefferson Lee","Jeramy Keith","Jermaine Bradshaw","Jewel Lee","Jimmie Yang","Jodie Wood","John Cline","Josefina Dickerson","Josie Pineda","Judith Griffin","Julius Soto","Kelli Romero","Kerri Joseph","Kim Mccall","Lakeisha Velazquez","Latonya Logan","Lee Schmidt","Lela Atkins","Leland Robertson","Leonardo House","Leroy Mcintyre","Lesley Blevins","Lilia Berg","Lilly Stone","Lincoln Bond","Lindsay Hurst","Lionel Fuller","Lorene Hunter","Louis Kidd","Lucius Warren","Lucy Mejia","Lupe Ingram","Lynette Fuller","Lynnette Wright","Madge Copeland","Madge Tanner","Mae Sawyer","Malcolm Newman","Mamie Wong","Mandy Swanson","Marcella Everett","Marco Bright","Marcos Schaefer","Marcus Hays","Marina Walsh","Marion Savage","Marylou Bass","Marylou Mccarthy","Mathew Howard","Maurice Jacobson","Mauricio Bautista","Max Smith","Melanie Bridges","Melissa Brandt","Merlin Wu","Michel Simpson","Mickey Kennedy","Mike Sloan","Milton Walsh","Mohamed Allison","Mohammad Christensen","Nadia Macdonald","Naomi Snyder","Ned Lowe","Nettie Leonard","Olive Perkins","Ophelia Morrow","Oren Montes","Orlando Henderson","Owen Buchanan","Paul Norman","Rafael Barrett","Raymond Cochran","Reed Hooper","Reinaldo Houston","Renato Simmons","Rene Calhoun","Reva Hardin","Robert French","Robin Bender","Rodolfo Scott","Roland Blake","Roland Sullivan","Rolf Barnett","Ross Marquez","Ruthie Daugherty","Sandra Potts","Scott Stephenson","Scotty Gonzales","Sean Wiggins","Shana Gallagher","Sharron Montes","Sheryl Lindsey","Socorro Hayden","Solomon Andrade","Stacey Whitehead","Stevie Hale","Stuart Oliver","Stuart Riddle","Tammy Merritt","Theo Wiley","Theresa Murillo","Timothy Roberts","Tony Torres","Tracy Logan","Troy Hoover","Twila Rubio","Velma Everett","Vincent Mccormick","Vincenzo Stafford","Vito Clark","Waldo Spencer","Werner Lowe","Werner Shepard","Wesley Ford","Wm Cantu","Zelma Pierce"]
[null,null,null,null,null,"Arden Ayala",{"$f":"IF('Resulting List'!F51=\"\",\"\",'Resulting List'!F51)","v":""},null,{"$f":"TRANSPOSE(_xlfn._xlws.SORT(_xlfn.UNIQUE(_xlfn._xlws.FILTER(Customers[Names],ISNUMBER(SEARCH(Customers[[#This Row],[Search Criteria]],Customers[Names])),\"No data.\"))))","v":"Adriana Todd"},"Albert Ramirez","Alex Rubio","Amanda Beck","Amparo Orozco","Amy Todd","Angelina Roberson","April Fox","Arden Ayala","Arnoldo Pennington","Aubrey Giles","Bette Rivers","Brianna Alexander","Brianna Mora","Britt Vazquez","Broderick Gillespie","Brooke Roman","Calvin Buck","Carmela Mullins","Carol Stevenson","Carolina Russell","Carolyn Roberts","Chelsea Gilbert","Cheryl Williamson","Christa Frederick","Christian Armstrong","Christopher Stuart","Chung Krueger","Clare Whitney","Clarissa Archer","Claudio Lam","Cordell Mills","Craig Shepherd","Damien Kramer","Dane Burke","Danielle Stout","Darrel Liu","Darrin Mcneil","Darron Aguilar","Della Huber","Delores Krause","Dena Rosario","Dominick Johnston","Dona Herring","Dorothy Winters","Douglas Wiley","Doyle David","Earlene Hester","Earline Shepherd","Edwin Sparks","Eli Galvan","Elinor Kaufman","Elroy Porter","Elvin Flynn","Emmitt Porter","Erik Parsons","Ethel Forbes","Felicia Ware","Fidel Haynes","Francisco Valenzuela","Frank Hunt","Gabriela Moore","Gabrielle Patrick","Gale Fitzpatrick","Gayle Curtis","Genevieve Lucero","Gerry Oneal","Grady Ellis","Grover Escobar","Hans Patel","Horacio Black","Humberto Compton","Hunter Short","Ilene Mcguire","Imelda Lloyd","Ira Macdonald","Issac Allen","Jacques Velazquez","Janis Mullins","Janna Cowan","Javier Garner","Jayson Abbott","Jeannie Tapia","Jefferson Lee","Jeramy Keith","Jermaine Bradshaw","Jewel Lee","Jimmie Yang","Jodie Wood","John Cline","Josefina Dickerson","Josie Pineda","Judith Griffin","Julius Soto","Kelli Romero","Kerri Joseph","Kim Mccall","Lakeisha Velazquez","Latonya Logan","Lee Schmidt","Lela Atkins","Leland Robertson","Leonardo House","Leroy Mcintyre","Lesley Blevins","Lilia Berg","Lilly Stone","Lincoln Bond","Lindsay Hurst","Lionel Fuller","Lorene Hunter","Louis Kidd","Lucius Warren","Lucy Mejia","Lupe Ingram","Lynette Fuller","Lynnette Wright","Madge Copeland","Madge Tanner","Mae Sawyer","Malcolm Newman","Mamie Wong","Mandy Swanson","Marcella Everett","Marco Bright","Marcos Schaefer","Marcus Hays","Marina Walsh","Marion Savage","Marylou Bass","Marylou Mccarthy","Mathew Howard","Maurice Jacobson","Mauricio Bautista","Max Smith","Melanie Bridges","Melissa Brandt","Merlin Wu","Michel Simpson","Mickey Kennedy","Mike Sloan","Milton Walsh","Mohamed Allison","Mohammad Christensen","Nadia Macdonald","Naomi Snyder","Ned Lowe","Nettie Leonard","Olive Perkins","Ophelia Morrow","Oren Montes","Orlando Henderson","Owen Buchanan","Paul Norman","Rafael Barrett","Raymond Cochran","Reed Hooper","Reinaldo Houston","Renato Simmons","Rene Calhoun","Reva Hardin","Robert French","Robin Bender","Rodolfo Scott","Roland Blake","Roland Sullivan","Rolf Barnett","Ross Marquez","Ruthie Daugherty","Sandra Potts","Scott Stephenson","Scotty Gonzales","Sean Wiggins","Shana Gallagher","Sharron Montes","Sheryl Lindsey","Socorro Hayden","Solomon Andrade","Stacey Whitehead","Stevie Hale","Stuart Oliver","Stuart Riddle","Tammy Merritt","Theo Wiley","Theresa Murillo","Timothy Roberts","Tony Torres","Tracy Logan","Troy Hoover","Twila Rubio","Velma Everett","Vincent Mccormick","Vincenzo Stafford","Vito Clark","Waldo Spencer","Werner Lowe","Werner Shepard","Wesley Ford","Wm Cantu","Zelma Pierce"]
[null,null,null,null,null,"Ross Marquez",{"$f":"IF('Resulting List'!F52=\"\",\"\",'Resulting List'!F52)","v":""},null,{"$f":"TRANSPOSE(_xlfn._xlws.SORT(_xlfn.UNIQUE(_xlfn._xlws.FILTER(Customers[Names],ISNUMBER(SEARCH(Customers[[#This Row],[Search Criteria]],Customers[Names])),\"No data.\"))))","v":"Adriana Todd"},"Albert Ramirez","Alex Rubio","Amanda Beck","Amparo Orozco","Amy Todd","Angelina Roberson","April Fox","Arden Ayala","Arnoldo Pennington","Aubrey Giles","Bette Rivers","Brianna Alexander","Brianna Mora","Britt Vazquez","Broderick Gillespie","Brooke Roman","Calvin Buck","Carmela Mullins","Carol Stevenson","Carolina Russell","Carolyn Roberts","Chelsea Gilbert","Cheryl Williamson","Christa Frederick","Christian Armstrong","Christopher Stuart","Chung Krueger","Clare Whitney","Clarissa Archer","Claudio Lam","Cordell Mills","Craig Shepherd","Damien Kramer","Dane Burke","Danielle Stout","Darrel Liu","Darrin Mcneil","Darron Aguilar","Della Huber","Delores Krause","Dena Rosario","Dominick Johnston","Dona Herring","Dorothy Winters","Douglas Wiley","Doyle David","Earlene Hester","Earline Shepherd","Edwin Sparks","Eli Galvan","Elinor Kaufman","Elroy Porter","Elvin Flynn","Emmitt Porter","Erik Parsons","Ethel Forbes","Felicia Ware","Fidel Haynes","Francisco Valenzuela","Frank Hunt","Gabriela Moore","Gabrielle Patrick","Gale Fitzpatrick","Gayle Curtis","Genevieve Lucero","Gerry Oneal","Grady Ellis","Grover Escobar","Hans Patel","Horacio Black","Humberto Compton","Hunter Short","Ilene Mcguire","Imelda Lloyd","Ira Macdonald","Issac Allen","Jacques Velazquez","Janis Mullins","Janna Cowan","Javier Garner","Jayson Abbott","Jeannie Tapia","Jefferson Lee","Jeramy Keith","Jermaine Bradshaw","Jewel Lee","Jimmie Yang","Jodie Wood","John Cline","Josefina Dickerson","Josie Pineda","Judith Griffin","Julius Soto","Kelli Romero","Kerri Joseph","Kim Mccall","Lakeisha Velazquez","Latonya Logan","Lee Schmidt","Lela Atkins","Leland Robertson","Leonardo House","Leroy Mcintyre","Lesley Blevins","Lilia Berg","Lilly Stone","Lincoln Bond","Lindsay Hurst","Lionel Fuller","Lorene Hunter","Louis Kidd","Lucius Warren","Lucy Mejia","Lupe Ingram","Lynette Fuller","Lynnette Wright","Madge Copeland","Madge Tanner","Mae Sawyer","Malcolm Newman","Mamie Wong","Mandy Swanson","Marcella Everett","Marco Bright","Marcos Schaefer","Marcus Hays","Marina Walsh","Marion Savage","Marylou Bass","Marylou Mccarthy","Mathew Howard","Maurice Jacobson","Mauricio Bautista","Max Smith","Melanie Bridges","Melissa Brandt","Merlin Wu","Michel Simpson","Mickey Kennedy","Mike Sloan","Milton Walsh","Mohamed Allison","Mohammad Christensen","Nadia Macdonald","Naomi Snyder","Ned Lowe","Nettie Leonard","Olive Perkins","Ophelia Morrow","Oren Montes","Orlando Henderson","Owen Buchanan","Paul Norman","Rafael Barrett","Raymond Cochran","Reed Hooper","Reinaldo Houston","Renato Simmons","Rene Calhoun","Reva Hardin","Robert French","Robin Bender","Rodolfo Scott","Roland Blake","Roland Sullivan","Rolf Barnett","Ross Marquez","Ruthie Daugherty","Sandra Potts","Scott Stephenson","Scotty Gonzales","Sean Wiggins","Shana Gallagher","Sharron Montes","Sheryl Lindsey","Socorro Hayden","Solomon Andrade","Stacey Whitehead","Stevie Hale","Stuart Oliver","Stuart Riddle","Tammy Merritt","Theo Wiley","Theresa Murillo","Timothy Roberts","Tony Torres","Tracy Logan","Troy Hoover","Twila Rubio","Velma Everett","Vincent Mccormick","Vincenzo Stafford","Vito Clark","Waldo Spencer","Werner Lowe","Werner Shepard","Wesley Ford","Wm Cantu","Zelma Pierce"]
[null,null,null,null,null,"Ira Macdonald",{"$f":"IF('Resulting List'!F53=\"\",\"\",'Resulting List'!F53)","v":""},null,{"$f":"TRANSPOSE(_xlfn._xlws.SORT(_xlfn.UNIQUE(_xlfn._xlws.FILTER(Customers[Names],ISNUMBER(SEARCH(Customers[[#This Row],[Search Criteria]],Customers[Names])),\"No data.\"))))","v":"Adriana Todd"},"Albert Ramirez","Alex Rubio","Amanda Beck","Amparo Orozco","Amy Todd","Angelina Roberson","April Fox","Arden Ayala","Arnoldo Pennington","Aubrey Giles","Bette Rivers","Brianna Alexander","Brianna Mora","Britt Vazquez","Broderick Gillespie","Brooke Roman","Calvin Buck","Carmela Mullins","Carol Stevenson","Carolina Russell","Carolyn Roberts","Chelsea Gilbert","Cheryl Williamson","Christa Frederick","Christian Armstrong","Christopher Stuart","Chung Krueger","Clare Whitney","Clarissa Archer","Claudio Lam","Cordell Mills","Craig Shepherd","Damien Kramer","Dane Burke","Danielle Stout","Darrel Liu","Darrin Mcneil","Darron Aguilar","Della Huber","Delores Krause","Dena Rosario","Dominick Johnston","Dona Herring","Dorothy Winters","Douglas Wiley","Doyle David","Earlene Hester","Earline Shepherd","Edwin Sparks","Eli Galvan","Elinor Kaufman","Elroy Porter","Elvin Flynn","Emmitt Porter","Erik Parsons","Ethel Forbes","Felicia Ware","Fidel Haynes","Francisco Valenzuela","Frank Hunt","Gabriela Moore","Gabrielle Patrick","Gale Fitzpatrick","Gayle Curtis","Genevieve Lucero","Gerry Oneal","Grady Ellis","Grover Escobar","Hans Patel","Horacio Black","Humberto Compton","Hunter Short","Ilene Mcguire","Imelda Lloyd","Ira Macdonald","Issac Allen","Jacques Velazquez","Janis Mullins","Janna Cowan","Javier Garner","Jayson Abbott","Jeannie Tapia","Jefferson Lee","Jeramy Keith","Jermaine Bradshaw","Jewel Lee","Jimmie Yang","Jodie Wood","John Cline","Josefina Dickerson","Josie Pineda","Judith Griffin","Julius Soto","Kelli Romero","Kerri Joseph","Kim Mccall","Lakeisha Velazquez","Latonya Logan","Lee Schmidt","Lela Atkins","Leland Robertson","Leonardo House","Leroy Mcintyre","Lesley Blevins","Lilia Berg","Lilly Stone","Lincoln Bond","Lindsay Hurst","Lionel Fuller","Lorene Hunter","Louis Kidd","Lucius Warren","Lucy Mejia","Lupe Ingram","Lynette Fuller","Lynnette Wright","Madge Copeland","Madge Tanner","Mae Sawyer","Malcolm Newman","Mamie Wong","Mandy Swanson","Marcella Everett","Marco Bright","Marcos Schaefer","Marcus Hays","Marina Walsh","Marion Savage","Marylou Bass","Marylou Mccarthy","Mathew Howard","Maurice Jacobson","Mauricio Bautista","Max Smith","Melanie Bridges","Melissa Brandt","Merlin Wu","Michel Simpson","Mickey Kennedy","Mike Sloan","Milton Walsh","Mohamed Allison","Mohammad Christensen","Nadia Macdonald","Naomi Snyder","Ned Lowe","Nettie Leonard","Olive Perkins","Ophelia Morrow","Oren Montes","Orlando Henderson","Owen Buchanan","Paul Norman","Rafael Barrett","Raymond Cochran","Reed Hooper","Reinaldo Houston","Renato Simmons","Rene Calhoun","Reva Hardin","Robert French","Robin Bender","Rodolfo Scott","Roland Blake","Roland Sullivan","Rolf Barnett","Ross Marquez","Ruthie Daugherty","Sandra Potts","Scott Stephenson","Scotty Gonzales","Sean Wiggins","Shana Gallagher","Sharron Montes","Sheryl Lindsey","Socorro Hayden","Solomon Andrade","Stacey Whitehead","Stevie Hale","Stuart Oliver","Stuart Riddle","Tammy Merritt","Theo Wiley","Theresa Murillo","Timothy Roberts","Tony Torres","Tracy Logan","Troy Hoover","Twila Rubio","Velma Everett","Vincent Mccormick","Vincenzo Stafford","Vito Clark","Waldo Spencer","Werner Lowe","Werner Shepard","Wesley Ford","Wm Cantu","Zelma Pierce"]
[null,null,null,null,null,"Elroy Porter",{"$f":"IF('Resulting List'!F54=\"\",\"\",'Resulting List'!F54)","v":""},null,{"$f":"TRANSPOSE(_xlfn._xlws.SORT(_xlfn.UNIQUE(_xlfn._xlws.FILTER(Customers[Names],ISNUMBER(SEARCH(Customers[[#This Row],[Search Criteria]],Customers[Names])),\"No data.\"))))","v":"Adriana Todd"},"Albert Ramirez","Alex Rubio","Amanda Beck","Amparo Orozco","Amy Todd","Angelina Roberson","April Fox","Arden Ayala","Arnoldo Pennington","Aubrey Giles","Bette Rivers","Brianna Alexander","Brianna Mora","Britt Vazquez","Broderick Gillespie","Brooke Roman","Calvin Buck","Carmela Mullins","Carol Stevenson","Carolina Russell","Carolyn Roberts","Chelsea Gilbert","Cheryl Williamson","Christa Frederick","Christian Armstrong","Christopher Stuart","Chung Krueger","Clare Whitney","Clarissa Archer","Claudio Lam","Cordell Mills","Craig Shepherd","Damien Kramer","Dane Burke","Danielle Stout","Darrel Liu","Darrin Mcneil","Darron Aguilar","Della Huber","Delores Krause","Dena Rosario","Dominick Johnston","Dona Herring","Dorothy Winters","Douglas Wiley","Doyle David","Earlene Hester","Earline Shepherd","Edwin Sparks","Eli Galvan","Elinor Kaufman","Elroy Porter","Elvin Flynn","Emmitt Porter","Erik Parsons","Ethel Forbes","Felicia Ware","Fidel Haynes","Francisco Valenzuela","Frank Hunt","Gabriela Moore","Gabrielle Patrick","Gale Fitzpatrick","Gayle Curtis","Genevieve Lucero","Gerry Oneal","Grady Ellis","Grover Escobar","Hans Patel","Horacio Black","Humberto Compton","Hunter Short","Ilene Mcguire","Imelda Lloyd","Ira Macdonald","Issac Allen","Jacques Velazquez","Janis Mullins","Janna Cowan","Javier Garner","Jayson Abbott","Jeannie Tapia","Jefferson Lee","Jeramy Keith","Jermaine Bradshaw","Jewel Lee","Jimmie Yang","Jodie Wood","John Cline","Josefina Dickerson","Josie Pineda","Judith Griffin","Julius Soto","Kelli Romero","Kerri Joseph","Kim Mccall","Lakeisha Velazquez","Latonya Logan","Lee Schmidt","Lela Atkins","Leland Robertson","Leonardo House","Leroy Mcintyre","Lesley Blevins","Lilia Berg","Lilly Stone","Lincoln Bond","Lindsay Hurst","Lionel Fuller","Lorene Hunter","Louis Kidd","Lucius Warren","Lucy Mejia","Lupe Ingram","Lynette Fuller","Lynnette Wright","Madge Copeland","Madge Tanner","Mae Sawyer","Malcolm Newman","Mamie Wong","Mandy Swanson","Marcella Everett","Marco Bright","Marcos Schaefer","Marcus Hays","Marina Walsh","Marion Savage","Marylou Bass","Marylou Mccarthy","Mathew Howard","Maurice Jacobson","Mauricio Bautista","Max Smith","Melanie Bridges","Melissa Brandt","Merlin Wu","Michel Simpson","Mickey Kennedy","Mike Sloan","Milton Walsh","Mohamed Allison","Mohammad Christensen","Nadia Macdonald","Naomi Snyder","Ned Lowe","Nettie Leonard","Olive Perkins","Ophelia Morrow","Oren Montes","Orlando Henderson","Owen Buchanan","Paul Norman","Rafael Barrett","Raymond Cochran","Reed Hooper","Reinaldo Houston","Renato Simmons","Rene Calhoun","Reva Hardin","Robert French","Robin Bender","Rodolfo Scott","Roland Blake","Roland Sullivan","Rolf Barnett","Ross Marquez","Ruthie Daugherty","Sandra Potts","Scott Stephenson","Scotty Gonzales","Sean Wiggins","Shana Gallagher","Sharron Montes","Sheryl Lindsey","Socorro Hayden","Solomon Andrade","Stacey Whitehead","Stevie Hale","Stuart Oliver","Stuart Riddle","Tammy Merritt","Theo Wiley","Theresa Murillo","Timothy Roberts","Tony Torres","Tracy Logan","Troy Hoover","Twila Rubio","Velma Everett","Vincent Mccormick","Vincenzo Stafford","Vito Clark","Waldo Spencer","Werner Lowe","Werner Shepard","Wesley Ford","Wm Cantu","Zelma Pierce"]
[null,null,null,null,null,"Tammy Merritt",{"$f":"IF('Resulting List'!F55=\"\",\"\",'Resulting List'!F55)","v":""},null,{"$f":"TRANSPOSE(_xlfn._xlws.SORT(_xlfn.UNIQUE(_xlfn._xlws.FILTER(Customers[Names],ISNUMBER(SEARCH(Customers[[#This Row],[Search Criteria]],Customers[Names])),\"No data.\"))))","v":"Adriana Todd"},"Albert Ramirez","Alex Rubio","Amanda Beck","Amparo Orozco","Amy Todd","Angelina Roberson","April Fox","Arden Ayala","Arnoldo Pennington","Aubrey Giles","Bette Rivers","Brianna Alexander","Brianna Mora","Britt Vazquez","Broderick Gillespie","Brooke Roman","Calvin Buck","Carmela Mullins","Carol Stevenson","Carolina Russell","Carolyn Roberts","Chelsea Gilbert","Cheryl Williamson","Christa Frederick","Christian Armstrong","Christopher Stuart","Chung Krueger","Clare Whitney","Clarissa Archer","Claudio Lam","Cordell Mills","Craig Shepherd","Damien Kramer","Dane Burke","Danielle Stout","Darrel Liu","Darrin Mcneil","Darron Aguilar","Della Huber","Delores Krause","Dena Rosario","Dominick Johnston","Dona Herring","Dorothy Winters","Douglas Wiley","Doyle David","Earlene Hester","Earline Shepherd","Edwin Sparks","Eli Galvan","Elinor Kaufman","Elroy Porter","Elvin Flynn","Emmitt Porter","Erik Parsons","Ethel Forbes","Felicia Ware","Fidel Haynes","Francisco Valenzuela","Frank Hunt","Gabriela Moore","Gabrielle Patrick","Gale Fitzpatrick","Gayle Curtis","Genevieve Lucero","Gerry Oneal","Grady Ellis","Grover Escobar","Hans Patel","Horacio Black","Humberto Compton","Hunter Short","Ilene Mcguire","Imelda Lloyd","Ira Macdonald","Issac Allen","Jacques Velazquez","Janis Mullins","Janna Cowan","Javier Garner","Jayson Abbott","Jeannie Tapia","Jefferson Lee","Jeramy Keith","Jermaine Bradshaw","Jewel Lee","Jimmie Yang","Jodie Wood","John Cline","Josefina Dickerson","Josie Pineda","Judith Griffin","Julius Soto","Kelli Romero","Kerri Joseph","Kim Mccall","Lakeisha Velazquez","Latonya Logan","Lee Schmidt","Lela Atkins","Leland Robertson","Leonardo House","Leroy Mcintyre","Lesley Blevins","Lilia Berg","Lilly Stone","Lincoln Bond","Lindsay Hurst","Lionel Fuller","Lorene Hunter","Louis Kidd","Lucius Warren","Lucy Mejia","Lupe Ingram","Lynette Fuller","Lynnette Wright","Madge Copeland","Madge Tanner","Mae Sawyer","Malcolm Newman","Mamie Wong","Mandy Swanson","Marcella Everett","Marco Bright","Marcos Schaefer","Marcus Hays","Marina Walsh","Marion Savage","Marylou Bass","Marylou Mccarthy","Mathew Howard","Maurice Jacobson","Mauricio Bautista","Max Smith","Melanie Bridges","Melissa Brandt","Merlin Wu","Michel Simpson","Mickey Kennedy","Mike Sloan","Milton Walsh","Mohamed Allison","Mohammad Christensen","Nadia Macdonald","Naomi Snyder","Ned Lowe","Nettie Leonard","Olive Perkins","Ophelia Morrow","Oren Montes","Orlando Henderson","Owen Buchanan","Paul Norman","Rafael Barrett","Raymond Cochran","Reed Hooper","Reinaldo Houston","Renato Simmons","Rene Calhoun","Reva Hardin","Robert French","Robin Bender","Rodolfo Scott","Roland Blake","Roland Sullivan","Rolf Barnett","Ross Marquez","Ruthie Daugherty","Sandra Potts","Scott Stephenson","Scotty Gonzales","Sean Wiggins","Shana Gallagher","Sharron Montes","Sheryl Lindsey","Socorro Hayden","Solomon Andrade","Stacey Whitehead","Stevie Hale","Stuart Oliver","Stuart Riddle","Tammy Merritt","Theo Wiley","Theresa Murillo","Timothy Roberts","Tony Torres","Tracy Logan","Troy Hoover","Twila Rubio","Velma Everett","Vincent Mccormick","Vincenzo Stafford","Vito Clark","Waldo Spencer","Werner Lowe","Werner Shepard","Wesley Ford","Wm Cantu","Zelma Pierce"]
[null,null,null,null,null,"Lupe Ingram",{"$f":"IF('Resulting List'!F56=\"\",\"\",'Resulting List'!F56)","v":""},null,{"$f":"TRANSPOSE(_xlfn._xlws.SORT(_xlfn.UNIQUE(_xlfn._xlws.FILTER(Customers[Names],ISNUMBER(SEARCH(Customers[[#This Row],[Search Criteria]],Customers[Names])),\"No data.\"))))","v":"Adriana Todd"},"Albert Ramirez","Alex Rubio","Amanda Beck","Amparo Orozco","Amy Todd","Angelina Roberson","April Fox","Arden Ayala","Arnoldo Pennington","Aubrey Giles","Bette Rivers","Brianna Alexander","Brianna Mora","Britt Vazquez","Broderick Gillespie","Brooke Roman","Calvin Buck","Carmela Mullins","Carol Stevenson","Carolina Russell","Carolyn Roberts","Chelsea Gilbert","Cheryl Williamson","Christa Frederick","Christian Armstrong","Christopher Stuart","Chung Krueger","Clare Whitney","Clarissa Archer","Claudio Lam","Cordell Mills","Craig Shepherd","Damien Kramer","Dane Burke","Danielle Stout","Darrel Liu","Darrin Mcneil","Darron Aguilar","Della Huber","Delores Krause","Dena Rosario","Dominick Johnston","Dona Herring","Dorothy Winters","Douglas Wiley","Doyle David","Earlene Hester","Earline Shepherd","Edwin Sparks","Eli Galvan","Elinor Kaufman","Elroy Porter","Elvin Flynn","Emmitt Porter","Erik Parsons","Ethel Forbes","Felicia Ware","Fidel Haynes","Francisco Valenzuela","Frank Hunt","Gabriela Moore","Gabrielle Patrick","Gale Fitzpatrick","Gayle Curtis","Genevieve Lucero","Gerry Oneal","Grady Ellis","Grover Escobar","Hans Patel","Horacio Black","Humberto Compton","Hunter Short","Ilene Mcguire","Imelda Lloyd","Ira Macdonald","Issac Allen","Jacques Velazquez","Janis Mullins","Janna Cowan","Javier Garner","Jayson Abbott","Jeannie Tapia","Jefferson Lee","Jeramy Keith","Jermaine Bradshaw","Jewel Lee","Jimmie Yang","Jodie Wood","John Cline","Josefina Dickerson","Josie Pineda","Judith Griffin","Julius Soto","Kelli Romero","Kerri Joseph","Kim Mccall","Lakeisha Velazquez","Latonya Logan","Lee Schmidt","Lela Atkins","Leland Robertson","Leonardo House","Leroy Mcintyre","Lesley Blevins","Lilia Berg","Lilly Stone","Lincoln Bond","Lindsay Hurst","Lionel Fuller","Lorene Hunter","Louis Kidd","Lucius Warren","Lucy Mejia","Lupe Ingram","Lynette Fuller","Lynnette Wright","Madge Copeland","Madge Tanner","Mae Sawyer","Malcolm Newman","Mamie Wong","Mandy Swanson","Marcella Everett","Marco Bright","Marcos Schaefer","Marcus Hays","Marina Walsh","Marion Savage","Marylou Bass","Marylou Mccarthy","Mathew Howard","Maurice Jacobson","Mauricio Bautista","Max Smith","Melanie Bridges","Melissa Brandt","Merlin Wu","Michel Simpson","Mickey Kennedy","Mike Sloan","Milton Walsh","Mohamed Allison","Mohammad Christensen","Nadia Macdonald","Naomi Snyder","Ned Lowe","Nettie Leonard","Olive Perkins","Ophelia Morrow","Oren Montes","Orlando Henderson","Owen Buchanan","Paul Norman","Rafael Barrett","Raymond Cochran","Reed Hooper","Reinaldo Houston","Renato Simmons","Rene Calhoun","Reva Hardin","Robert French","Robin Bender","Rodolfo Scott","Roland Blake","Roland Sullivan","Rolf Barnett","Ross Marquez","Ruthie Daugherty","Sandra Potts","Scott Stephenson","Scotty Gonzales","Sean Wiggins","Shana Gallagher","Sharron Montes","Sheryl Lindsey","Socorro Hayden","Solomon Andrade","Stacey Whitehead","Stevie Hale","Stuart Oliver","Stuart Riddle","Tammy Merritt","Theo Wiley","Theresa Murillo","Timothy Roberts","Tony Torres","Tracy Logan","Troy Hoover","Twila Rubio","Velma Everett","Vincent Mccormick","Vincenzo Stafford","Vito Clark","Waldo Spencer","Werner Lowe","Werner Shepard","Wesley Ford","Wm Cantu","Zelma Pierce"]
[null,null,null,null,null,"Naomi Snyder",{"$f":"IF('Resulting List'!F57=\"\",\"\",'Resulting List'!F57)","v":""},null,{"$f":"TRANSPOSE(_xlfn._xlws.SORT(_xlfn.UNIQUE(_xlfn._xlws.FILTER(Customers[Names],ISNUMBER(SEARCH(Customers[[#This Row],[Search Criteria]],Customers[Names])),\"No data.\"))))","v":"Adriana Todd"},"Albert Ramirez","Alex Rubio","Amanda Beck","Amparo Orozco","Amy Todd","Angelina Roberson","April Fox","Arden Ayala","Arnoldo Pennington","Aubrey Giles","Bette Rivers","Brianna Alexander","Brianna Mora","Britt Vazquez","Broderick Gillespie","Brooke Roman","Calvin Buck","Carmela Mullins","Carol Stevenson","Carolina Russell","Carolyn Roberts","Chelsea Gilbert","Cheryl Williamson","Christa Frederick","Christian Armstrong","Christopher Stuart","Chung Krueger","Clare Whitney","Clarissa Archer","Claudio Lam","Cordell Mills","Craig Shepherd","Damien Kramer","Dane Burke","Danielle Stout","Darrel Liu","Darrin Mcneil","Darron Aguilar","Della Huber","Delores Krause","Dena Rosario","Dominick Johnston","Dona Herring","Dorothy Winters","Douglas Wiley","Doyle David","Earlene Hester","Earline Shepherd","Edwin Sparks","Eli Galvan","Elinor Kaufman","Elroy Porter","Elvin Flynn","Emmitt Porter","Erik Parsons","Ethel Forbes","Felicia Ware","Fidel Haynes","Francisco Valenzuela","Frank Hunt","Gabriela Moore","Gabrielle Patrick","Gale Fitzpatrick","Gayle Curtis","Genevieve Lucero","Gerry Oneal","Grady Ellis","Grover Escobar","Hans Patel","Horacio Black","Humberto Compton","Hunter Short","Ilene Mcguire","Imelda Lloyd","Ira Macdonald","Issac Allen","Jacques Velazquez","Janis Mullins","Janna Cowan","Javier Garner","Jayson Abbott","Jeannie Tapia","Jefferson Lee","Jeramy Keith","Jermaine Bradshaw","Jewel Lee","Jimmie Yang","Jodie Wood","John Cline","Josefina Dickerson","Josie Pineda","Judith Griffin","Julius Soto","Kelli Romero","Kerri Joseph","Kim Mccall","Lakeisha Velazquez","Latonya Logan","Lee Schmidt","Lela Atkins","Leland Robertson","Leonardo House","Leroy Mcintyre","Lesley Blevins","Lilia Berg","Lilly Stone","Lincoln Bond","Lindsay Hurst","Lionel Fuller","Lorene Hunter","Louis Kidd","Lucius Warren","Lucy Mejia","Lupe Ingram","Lynette Fuller","Lynnette Wright","Madge Copeland","Madge Tanner","Mae Sawyer","Malcolm Newman","Mamie Wong","Mandy Swanson","Marcella Everett","Marco Bright","Marcos Schaefer","Marcus Hays","Marina Walsh","Marion Savage","Marylou Bass","Marylou Mccarthy","Mathew Howard","Maurice Jacobson","Mauricio Bautista","Max Smith","Melanie Bridges","Melissa Brandt","Merlin Wu","Michel Simpson","Mickey Kennedy","Mike Sloan","Milton Walsh","Mohamed Allison","Mohammad Christensen","Nadia Macdonald","Naomi Snyder","Ned Lowe","Nettie Leonard","Olive Perkins","Ophelia Morrow","Oren Montes","Orlando Henderson","Owen Buchanan","Paul Norman","Rafael Barrett","Raymond Cochran","Reed Hooper","Reinaldo Houston","Renato Simmons","Rene Calhoun","Reva Hardin","Robert French","Robin Bender","Rodolfo Scott","Roland Blake","Roland Sullivan","Rolf Barnett","Ross Marquez","Ruthie Daugherty","Sandra Potts","Scott Stephenson","Scotty Gonzales","Sean Wiggins","Shana Gallagher","Sharron Montes","Sheryl Lindsey","Socorro Hayden","Solomon Andrade","Stacey Whitehead","Stevie Hale","Stuart Oliver","Stuart Riddle","Tammy Merritt","Theo Wiley","Theresa Murillo","Timothy Roberts","Tony Torres","Tracy Logan","Troy Hoover","Twila Rubio","Velma Everett","Vincent Mccormick","Vincenzo Stafford","Vito Clark","Waldo Spencer","Werner Lowe","Werner Shepard","Wesley Ford","Wm Cantu","Zelma Pierce"]
[null,null,null,null,null,"Frank Hunt",{"$f":"IF('Resulting List'!F58=\"\",\"\",'Resulting List'!F58)","v":""},null,{"$f":"TRANSPOSE(_xlfn._xlws.SORT(_xlfn.UNIQUE(_xlfn._xlws.FILTER(Customers[Names],ISNUMBER(SEARCH(Customers[[#This Row],[Search Criteria]],Customers[Names])),\"No data.\"))))","v":"Adriana Todd"},"Albert Ramirez","Alex Rubio","Amanda Beck","Amparo Orozco","Amy Todd","Angelina Roberson","April Fox","Arden Ayala","Arnoldo Pennington","Aubrey Giles","Bette Rivers","Brianna Alexander","Brianna Mora","Britt Vazquez","Broderick Gillespie","Brooke Roman","Calvin Buck","Carmela Mullins","Carol Stevenson","Carolina Russell","Carolyn Roberts","Chelsea Gilbert","Cheryl Williamson","Christa Frederick","Christian Armstrong","Christopher Stuart","Chung Krueger","Clare Whitney","Clarissa Archer","Claudio Lam","Cordell Mills","Craig Shepherd","Damien Kramer","Dane Burke","Danielle Stout","Darrel Liu","Darrin Mcneil","Darron Aguilar","Della Huber","Delores Krause","Dena Rosario","Dominick Johnston","Dona Herring","Dorothy Winters","Douglas Wiley","Doyle David","Earlene Hester","Earline Shepherd","Edwin Sparks","Eli Galvan","Elinor Kaufman","Elroy Porter","Elvin Flynn","Emmitt Porter","Erik Parsons","Ethel Forbes","Felicia Ware","Fidel Haynes","Francisco Valenzuela","Frank Hunt","Gabriela Moore","Gabrielle Patrick","Gale Fitzpatrick","Gayle Curtis","Genevieve Lucero","Gerry Oneal","Grady Ellis","Grover Escobar","Hans Patel","Horacio Black","Humberto Compton","Hunter Short","Ilene Mcguire","Imelda Lloyd","Ira Macdonald","Issac Allen","Jacques Velazquez","Janis Mullins","Janna Cowan","Javier Garner","Jayson Abbott","Jeannie Tapia","Jefferson Lee","Jeramy Keith","Jermaine Bradshaw","Jewel Lee","Jimmie Yang","Jodie Wood","John Cline","Josefina Dickerson","Josie Pineda","Judith Griffin","Julius Soto","Kelli Romero","Kerri Joseph","Kim Mccall","Lakeisha Velazquez","Latonya Logan","Lee Schmidt","Lela Atkins","Leland Robertson","Leonardo House","Leroy Mcintyre","Lesley Blevins","Lilia Berg","Lilly Stone","Lincoln Bond","Lindsay Hurst","Lionel Fuller","Lorene Hunter","Louis Kidd","Lucius Warren","Lucy Mejia","Lupe Ingram","Lynette Fuller","Lynnette Wright","Madge Copeland","Madge Tanner","Mae Sawyer","Malcolm Newman","Mamie Wong","Mandy Swanson","Marcella Everett","Marco Bright","Marcos Schaefer","Marcus Hays","Marina Walsh","Marion Savage","Marylou Bass","Marylou Mccarthy","Mathew Howard","Maurice Jacobson","Mauricio Bautista","Max Smith","Melanie Bridges","Melissa Brandt","Merlin Wu","Michel Simpson","Mickey Kennedy","Mike Sloan","Milton Walsh","Mohamed Allison","Mohammad Christensen","Nadia Macdonald","Naomi Snyder","Ned Lowe","Nettie Leonard","Olive Perkins","Ophelia Morrow","Oren Montes","Orlando Henderson","Owen Buchanan","Paul Norman","Rafael Barrett","Raymond Cochran","Reed Hooper","Reinaldo Houston","Renato Simmons","Rene Calhoun","Reva Hardin","Robert French","Robin Bender","Rodolfo Scott","Roland Blake","Roland Sullivan","Rolf Barnett","Ross Marquez","Ruthie Daugherty","Sandra Potts","Scott Stephenson","Scotty Gonzales","Sean Wiggins","Shana Gallagher","Sharron Montes","Sheryl Lindsey","Socorro Hayden","Solomon Andrade","Stacey Whitehead","Stevie Hale","Stuart Oliver","Stuart Riddle","Tammy Merritt","Theo Wiley","Theresa Murillo","Timothy Roberts","Tony Torres","Tracy Logan","Troy Hoover","Twila Rubio","Velma Everett","Vincent Mccormick","Vincenzo Stafford","Vito Clark","Waldo Spencer","Werner Lowe","Werner Shepard","Wesley Ford","Wm Cantu","Zelma Pierce"]
[null,null,null,null,null,"Craig Shepherd",{"$f":"IF('Resulting List'!F59=\"\",\"\",'Resulting List'!F59)","v":""},null,{"$f":"TRANSPOSE(_xlfn._xlws.SORT(_xlfn.UNIQUE(_xlfn._xlws.FILTER(Customers[Names],ISNUMBER(SEARCH(Customers[[#This Row],[Search Criteria]],Customers[Names])),\"No data.\"))))","v":"Adriana Todd"},"Albert Ramirez","Alex Rubio","Amanda Beck","Amparo Orozco","Amy Todd","Angelina Roberson","April Fox","Arden Ayala","Arnoldo Pennington","Aubrey Giles","Bette Rivers","Brianna Alexander","Brianna Mora","Britt Vazquez","Broderick Gillespie","Brooke Roman","Calvin Buck","Carmela Mullins","Carol Stevenson","Carolina Russell","Carolyn Roberts","Chelsea Gilbert","Cheryl Williamson","Christa Frederick","Christian Armstrong","Christopher Stuart","Chung Krueger","Clare Whitney","Clarissa Archer","Claudio Lam","Cordell Mills","Craig Shepherd","Damien Kramer","Dane Burke","Danielle Stout","Darrel Liu","Darrin Mcneil","Darron Aguilar","Della Huber","Delores Krause","Dena Rosario","Dominick Johnston","Dona Herring","Dorothy Winters","Douglas Wiley","Doyle David","Earlene Hester","Earline Shepherd","Edwin Sparks","Eli Galvan","Elinor Kaufman","Elroy Porter","Elvin Flynn","Emmitt Porter","Erik Parsons","Ethel Forbes","Felicia Ware","Fidel Haynes","Francisco Valenzuela","Frank Hunt","Gabriela Moore","Gabrielle Patrick","Gale Fitzpatrick","Gayle Curtis","Genevieve Lucero","Gerry Oneal","Grady Ellis","Grover Escobar","Hans Patel","Horacio Black","Humberto Compton","Hunter Short","Ilene Mcguire","Imelda Lloyd","Ira Macdonald","Issac Allen","Jacques Velazquez","Janis Mullins","Janna Cowan","Javier Garner","Jayson Abbott","Jeannie Tapia","Jefferson Lee","Jeramy Keith","Jermaine Bradshaw","Jewel Lee","Jimmie Yang","Jodie Wood","John Cline","Josefina Dickerson","Josie Pineda","Judith Griffin","Julius Soto","Kelli Romero","Kerri Joseph","Kim Mccall","Lakeisha Velazquez","Latonya Logan","Lee Schmidt","Lela Atkins","Leland Robertson","Leonardo House","Leroy Mcintyre","Lesley Blevins","Lilia Berg","Lilly Stone","Lincoln Bond","Lindsay Hurst","Lionel Fuller","Lorene Hunter","Louis Kidd","Lucius Warren","Lucy Mejia","Lupe Ingram","Lynette Fuller","Lynnette Wright","Madge Copeland","Madge Tanner","Mae Sawyer","Malcolm Newman","Mamie Wong","Mandy Swanson","Marcella Everett","Marco Bright","Marcos Schaefer","Marcus Hays","Marina Walsh","Marion Savage","Marylou Bass","Marylou Mccarthy","Mathew Howard","Maurice Jacobson","Mauricio Bautista","Max Smith","Melanie Bridges","Melissa Brandt","Merlin Wu","Michel Simpson","Mickey Kennedy","Mike Sloan","Milton Walsh","Mohamed Allison","Mohammad Christensen","Nadia Macdonald","Naomi Snyder","Ned Lowe","Nettie Leonard","Olive Perkins","Ophelia Morrow","Oren Montes","Orlando Henderson","Owen Buchanan","Paul Norman","Rafael Barrett","Raymond Cochran","Reed Hooper","Reinaldo Houston","Renato Simmons","Rene Calhoun","Reva Hardin","Robert French","Robin Bender","Rodolfo Scott","Roland Blake","Roland Sullivan","Rolf Barnett","Ross Marquez","Ruthie Daugherty","Sandra Potts","Scott Stephenson","Scotty Gonzales","Sean Wiggins","Shana Gallagher","Sharron Montes","Sheryl Lindsey","Socorro Hayden","Solomon Andrade","Stacey Whitehead","Stevie Hale","Stuart Oliver","Stuart Riddle","Tammy Merritt","Theo Wiley","Theresa Murillo","Timothy Roberts","Tony Torres","Tracy Logan","Troy Hoover","Twila Rubio","Velma Everett","Vincent Mccormick","Vincenzo Stafford","Vito Clark","Waldo Spencer","Werner Lowe","Werner Shepard","Wesley Ford","Wm Cantu","Zelma Pierce"]
[null,null,null,null,null,"Gabrielle Patrick",{"$f":"IF('Resulting List'!F60=\"\",\"\",'Resulting List'!F60)","v":""},null,{"$f":"TRANSPOSE(_xlfn._xlws.SORT(_xlfn.UNIQUE(_xlfn._xlws.FILTER(Customers[Names],ISNUMBER(SEARCH(Customers[[#This Row],[Search Criteria]],Customers[Names])),\"No data.\"))))","v":"Adriana Todd"},"Albert Ramirez","Alex Rubio","Amanda Beck","Amparo Orozco","Amy Todd","Angelina Roberson","April Fox","Arden Ayala","Arnoldo Pennington","Aubrey Giles","Bette Rivers","Brianna Alexander","Brianna Mora","Britt Vazquez","Broderick Gillespie","Brooke Roman","Calvin Buck","Carmela Mullins","Carol Stevenson","Carolina Russell","Carolyn Roberts","Chelsea Gilbert","Cheryl Williamson","Christa Frederick","Christian Armstrong","Christopher Stuart","Chung Krueger","Clare Whitney","Clarissa Archer","Claudio Lam","Cordell Mills","Craig Shepherd","Damien Kramer","Dane Burke","Danielle Stout","Darrel Liu","Darrin Mcneil","Darron Aguilar","Della Huber","Delores Krause","Dena Rosario","Dominick Johnston","Dona Herring","Dorothy Winters","Douglas Wiley","Doyle David","Earlene Hester","Earline Shepherd","Edwin Sparks","Eli Galvan","Elinor Kaufman","Elroy Porter","Elvin Flynn","Emmitt Porter","Erik Parsons","Ethel Forbes","Felicia Ware","Fidel Haynes","Francisco Valenzuela","Frank Hunt","Gabriela Moore","Gabrielle Patrick","Gale Fitzpatrick","Gayle Curtis","Genevieve Lucero","Gerry Oneal","Grady Ellis","Grover Escobar","Hans Patel","Horacio Black","Humberto Compton","Hunter Short","Ilene Mcguire","Imelda Lloyd","Ira Macdonald","Issac Allen","Jacques Velazquez","Janis Mullins","Janna Cowan","Javier Garner","Jayson Abbott","Jeannie Tapia","Jefferson Lee","Jeramy Keith","Jermaine Bradshaw","Jewel Lee","Jimmie Yang","Jodie Wood","John Cline","Josefina Dickerson","Josie Pineda","Judith Griffin","Julius Soto","Kelli Romero","Kerri Joseph","Kim Mccall","Lakeisha Velazquez","Latonya Logan","Lee Schmidt","Lela Atkins","Leland Robertson","Leonardo House","Leroy Mcintyre","Lesley Blevins","Lilia Berg","Lilly Stone","Lincoln Bond","Lindsay Hurst","Lionel Fuller","Lorene Hunter","Louis Kidd","Lucius Warren","Lucy Mejia","Lupe Ingram","Lynette Fuller","Lynnette Wright","Madge Copeland","Madge Tanner","Mae Sawyer","Malcolm Newman","Mamie Wong","Mandy Swanson","Marcella Everett","Marco Bright","Marcos Schaefer","Marcus Hays","Marina Walsh","Marion Savage","Marylou Bass","Marylou Mccarthy","Mathew Howard","Maurice Jacobson","Mauricio Bautista","Max Smith","Melanie Bridges","Melissa Brandt","Merlin Wu","Michel Simpson","Mickey Kennedy","Mike Sloan","Milton Walsh","Mohamed Allison","Mohammad Christensen","Nadia Macdonald","Naomi Snyder","Ned Lowe","Nettie Leonard","Olive Perkins","Ophelia Morrow","Oren Montes","Orlando Henderson","Owen Buchanan","Paul Norman","Rafael Barrett","Raymond Cochran","Reed Hooper","Reinaldo Houston","Renato Simmons","Rene Calhoun","Reva Hardin","Robert French","Robin Bender","Rodolfo Scott","Roland Blake","Roland Sullivan","Rolf Barnett","Ross Marquez","Ruthie Daugherty","Sandra Potts","Scott Stephenson","Scotty Gonzales","Sean Wiggins","Shana Gallagher","Sharron Montes","Sheryl Lindsey","Socorro Hayden","Solomon Andrade","Stacey Whitehead","Stevie Hale","Stuart Oliver","Stuart Riddle","Tammy Merritt","Theo Wiley","Theresa Murillo","Timothy Roberts","Tony Torres","Tracy Logan","Troy Hoover","Twila Rubio","Velma Everett","Vincent Mccormick","Vincenzo Stafford","Vito Clark","Waldo Spencer","Werner Lowe","Werner Shepard","Wesley Ford","Wm Cantu","Zelma Pierce"]
[null,null,null,null,null,"Broderick Gillespie",{"$f":"IF('Resulting List'!F61=\"\",\"\",'Resulting List'!F61)","v":""},null,{"$f":"TRANSPOSE(_xlfn._xlws.SORT(_xlfn.UNIQUE(_xlfn._xlws.FILTER(Customers[Names],ISNUMBER(SEARCH(Customers[[#This Row],[Search Criteria]],Customers[Names])),\"No data.\"))))","v":"Adriana Todd"},"Albert Ramirez","Alex Rubio","Amanda Beck","Amparo Orozco","Amy Todd","Angelina Roberson","April Fox","Arden Ayala","Arnoldo Pennington","Aubrey Giles","Bette Rivers","Brianna Alexander","Brianna Mora","Britt Vazquez","Broderick Gillespie","Brooke Roman","Calvin Buck","Carmela Mullins","Carol Stevenson","Carolina Russell","Carolyn Roberts","Chelsea Gilbert","Cheryl Williamson","Christa Frederick","Christian Armstrong","Christopher Stuart","Chung Krueger","Clare Whitney","Clarissa Archer","Claudio Lam","Cordell Mills","Craig Shepherd","Damien Kramer","Dane Burke","Danielle Stout","Darrel Liu","Darrin Mcneil","Darron Aguilar","Della Huber","Delores Krause","Dena Rosario","Dominick Johnston","Dona Herring","Dorothy Winters","Douglas Wiley","Doyle David","Earlene Hester","Earline Shepherd","Edwin Sparks","Eli Galvan","Elinor Kaufman","Elroy Porter","Elvin Flynn","Emmitt Porter","Erik Parsons","Ethel Forbes","Felicia Ware","Fidel Haynes","Francisco Valenzuela","Frank Hunt","Gabriela Moore","Gabrielle Patrick","Gale Fitzpatrick","Gayle Curtis","Genevieve Lucero","Gerry Oneal","Grady Ellis","Grover Escobar","Hans Patel","Horacio Black","Humberto Compton","Hunter Short","Ilene Mcguire","Imelda Lloyd","Ira Macdonald","Issac Allen","Jacques Velazquez","Janis Mullins","Janna Cowan","Javier Garner","Jayson Abbott","Jeannie Tapia","Jefferson Lee","Jeramy Keith","Jermaine Bradshaw","Jewel Lee","Jimmie Yang","Jodie Wood","John Cline","Josefina Dickerson","Josie Pineda","Judith Griffin","Julius Soto","Kelli Romero","Kerri Joseph","Kim Mccall","Lakeisha Velazquez","Latonya Logan","Lee Schmidt","Lela Atkins","Leland Robertson","Leonardo House","Leroy Mcintyre","Lesley Blevins","Lilia Berg","Lilly Stone","Lincoln Bond","Lindsay Hurst","Lionel Fuller","Lorene Hunter","Louis Kidd","Lucius Warren","Lucy Mejia","Lupe Ingram","Lynette Fuller","Lynnette Wright","Madge Copeland","Madge Tanner","Mae Sawyer","Malcolm Newman","Mamie Wong","Mandy Swanson","Marcella Everett","Marco Bright","Marcos Schaefer","Marcus Hays","Marina Walsh","Marion Savage","Marylou Bass","Marylou Mccarthy","Mathew Howard","Maurice Jacobson","Mauricio Bautista","Max Smith","Melanie Bridges","Melissa Brandt","Merlin Wu","Michel Simpson","Mickey Kennedy","Mike Sloan","Milton Walsh","Mohamed Allison","Mohammad Christensen","Nadia Macdonald","Naomi Snyder","Ned Lowe","Nettie Leonard","Olive Perkins","Ophelia Morrow","Oren Montes","Orlando Henderson","Owen Buchanan","Paul Norman","Rafael Barrett","Raymond Cochran","Reed Hooper","Reinaldo Houston","Renato Simmons","Rene Calhoun","Reva Hardin","Robert French","Robin Bender","Rodolfo Scott","Roland Blake","Roland Sullivan","Rolf Barnett","Ross Marquez","Ruthie Daugherty","Sandra Potts","Scott Stephenson","Scotty Gonzales","Sean Wiggins","Shana Gallagher","Sharron Montes","Sheryl Lindsey","Socorro Hayden","Solomon Andrade","Stacey Whitehead","Stevie Hale","Stuart Oliver","Stuart Riddle","Tammy Merritt","Theo Wiley","Theresa Murillo","Timothy Roberts","Tony Torres","Tracy Logan","Troy Hoover","Twila Rubio","Velma Everett","Vincent Mccormick","Vincenzo Stafford","Vito Clark","Waldo Spencer","Werner Lowe","Werner Shepard","Wesley Ford","Wm Cantu","Zelma Pierce"]
[null,null,null,null,null,"Janna Cowan",{"$f":"IF('Resulting List'!F62=\"\",\"\",'Resulting List'!F62)","v":""},null,{"$f":"TRANSPOSE(_xlfn._xlws.SORT(_xlfn.UNIQUE(_xlfn._xlws.FILTER(Customers[Names],ISNUMBER(SEARCH(Customers[[#This Row],[Search Criteria]],Customers[Names])),\"No data.\"))))","v":"Adriana Todd"},"Albert Ramirez","Alex Rubio","Amanda Beck","Amparo Orozco","Amy Todd","Angelina Roberson","April Fox","Arden Ayala","Arnoldo Pennington","Aubrey Giles","Bette Rivers","Brianna Alexander","Brianna Mora","Britt Vazquez","Broderick Gillespie","Brooke Roman","Calvin Buck","Carmela Mullins","Carol Stevenson","Carolina Russell","Carolyn Roberts","Chelsea Gilbert","Cheryl Williamson","Christa Frederick","Christian Armstrong","Christopher Stuart","Chung Krueger","Clare Whitney","Clarissa Archer","Claudio Lam","Cordell Mills","Craig Shepherd","Damien Kramer","Dane Burke","Danielle Stout","Darrel Liu","Darrin Mcneil","Darron Aguilar","Della Huber","Delores Krause","Dena Rosario","Dominick Johnston","Dona Herring","Dorothy Winters","Douglas Wiley","Doyle David","Earlene Hester","Earline Shepherd","Edwin Sparks","Eli Galvan","Elinor Kaufman","Elroy Porter","Elvin Flynn","Emmitt Porter","Erik Parsons","Ethel Forbes","Felicia Ware","Fidel Haynes","Francisco Valenzuela","Frank Hunt","Gabriela Moore","Gabrielle Patrick","Gale Fitzpatrick","Gayle Curtis","Genevieve Lucero","Gerry Oneal","Grady Ellis","Grover Escobar","Hans Patel","Horacio Black","Humberto Compton","Hunter Short","Ilene Mcguire","Imelda Lloyd","Ira Macdonald","Issac Allen","Jacques Velazquez","Janis Mullins","Janna Cowan","Javier Garner","Jayson Abbott","Jeannie Tapia","Jefferson Lee","Jeramy Keith","Jermaine Bradshaw","Jewel Lee","Jimmie Yang","Jodie Wood","John Cline","Josefina Dickerson","Josie Pineda","Judith Griffin","Julius Soto","Kelli Romero","Kerri Joseph","Kim Mccall","Lakeisha Velazquez","Latonya Logan","Lee Schmidt","Lela Atkins","Leland Robertson","Leonardo House","Leroy Mcintyre","Lesley Blevins","Lilia Berg","Lilly Stone","Lincoln Bond","Lindsay Hurst","Lionel Fuller","Lorene Hunter","Louis Kidd","Lucius Warren","Lucy Mejia","Lupe Ingram","Lynette Fuller","Lynnette Wright","Madge Copeland","Madge Tanner","Mae Sawyer","Malcolm Newman","Mamie Wong","Mandy Swanson","Marcella Everett","Marco Bright","Marcos Schaefer","Marcus Hays","Marina Walsh","Marion Savage","Marylou Bass","Marylou Mccarthy","Mathew Howard","Maurice Jacobson","Mauricio Bautista","Max Smith","Melanie Bridges","Melissa Brandt","Merlin Wu","Michel Simpson","Mickey Kennedy","Mike Sloan","Milton Walsh","Mohamed Allison","Mohammad Christensen","Nadia Macdonald","Naomi Snyder","Ned Lowe","Nettie Leonard","Olive Perkins","Ophelia Morrow","Oren Montes","Orlando Henderson","Owen Buchanan","Paul Norman","Rafael Barrett","Raymond Cochran","Reed Hooper","Reinaldo Houston","Renato Simmons","Rene Calhoun","Reva Hardin","Robert French","Robin Bender","Rodolfo Scott","Roland Blake","Roland Sullivan","Rolf Barnett","Ross Marquez","Ruthie Daugherty","Sandra Potts","Scott Stephenson","Scotty Gonzales","Sean Wiggins","Shana Gallagher","Sharron Montes","Sheryl Lindsey","Socorro Hayden","Solomon Andrade","Stacey Whitehead","Stevie Hale","Stuart Oliver","Stuart Riddle","Tammy Merritt","Theo Wiley","Theresa Murillo","Timothy Roberts","Tony Torres","Tracy Logan","Troy Hoover","Twila Rubio","Velma Everett","Vincent Mccormick","Vincenzo Stafford","Vito Clark","Waldo Spencer","Werner Lowe","Werner Shepard","Wesley Ford","Wm Cantu","Zelma Pierce"]
[null,null,null,null,null,"Grover Escobar",{"$f":"IF('Resulting List'!F63=\"\",\"\",'Resulting List'!F63)","v":""},null,{"$f":"TRANSPOSE(_xlfn._xlws.SORT(_xlfn.UNIQUE(_xlfn._xlws.FILTER(Customers[Names],ISNUMBER(SEARCH(Customers[[#This Row],[Search Criteria]],Customers[Names])),\"No data.\"))))","v":"Adriana Todd"},"Albert Ramirez","Alex Rubio","Amanda Beck","Amparo Orozco","Amy Todd","Angelina Roberson","April Fox","Arden Ayala","Arnoldo Pennington","Aubrey Giles","Bette Rivers","Brianna Alexander","Brianna Mora","Britt Vazquez","Broderick Gillespie","Brooke Roman","Calvin Buck","Carmela Mullins","Carol Stevenson","Carolina Russell","Carolyn Roberts","Chelsea Gilbert","Cheryl Williamson","Christa Frederick","Christian Armstrong","Christopher Stuart","Chung Krueger","Clare Whitney","Clarissa Archer","Claudio Lam","Cordell Mills","Craig Shepherd","Damien Kramer","Dane Burke","Danielle Stout","Darrel Liu","Darrin Mcneil","Darron Aguilar","Della Huber","Delores Krause","Dena Rosario","Dominick Johnston","Dona Herring","Dorothy Winters","Douglas Wiley","Doyle David","Earlene Hester","Earline Shepherd","Edwin Sparks","Eli Galvan","Elinor Kaufman","Elroy Porter","Elvin Flynn","Emmitt Porter","Erik Parsons","Ethel Forbes","Felicia Ware","Fidel Haynes","Francisco Valenzuela","Frank Hunt","Gabriela Moore","Gabrielle Patrick","Gale Fitzpatrick","Gayle Curtis","Genevieve Lucero","Gerry Oneal","Grady Ellis","Grover Escobar","Hans Patel","Horacio Black","Humberto Compton","Hunter Short","Ilene Mcguire","Imelda Lloyd","Ira Macdonald","Issac Allen","Jacques Velazquez","Janis Mullins","Janna Cowan","Javier Garner","Jayson Abbott","Jeannie Tapia","Jefferson Lee","Jeramy Keith","Jermaine Bradshaw","Jewel Lee","Jimmie Yang","Jodie Wood","John Cline","Josefina Dickerson","Josie Pineda","Judith Griffin","Julius Soto","Kelli Romero","Kerri Joseph","Kim Mccall","Lakeisha Velazquez","Latonya Logan","Lee Schmidt","Lela Atkins","Leland Robertson","Leonardo House","Leroy Mcintyre","Lesley Blevins","Lilia Berg","Lilly Stone","Lincoln Bond","Lindsay Hurst","Lionel Fuller","Lorene Hunter","Louis Kidd","Lucius Warren","Lucy Mejia","Lupe Ingram","Lynette Fuller","Lynnette Wright","Madge Copeland","Madge Tanner","Mae Sawyer","Malcolm Newman","Mamie Wong","Mandy Swanson","Marcella Everett","Marco Bright","Marcos Schaefer","Marcus Hays","Marina Walsh","Marion Savage","Marylou Bass","Marylou Mccarthy","Mathew Howard","Maurice Jacobson","Mauricio Bautista","Max Smith","Melanie Bridges","Melissa Brandt","Merlin Wu","Michel Simpson","Mickey Kennedy","Mike Sloan","Milton Walsh","Mohamed Allison","Mohammad Christensen","Nadia Macdonald","Naomi Snyder","Ned Lowe","Nettie Leonard","Olive Perkins","Ophelia Morrow","Oren Montes","Orlando Henderson","Owen Buchanan","Paul Norman","Rafael Barrett","Raymond Cochran","Reed Hooper","Reinaldo Houston","Renato Simmons","Rene Calhoun","Reva Hardin","Robert French","Robin Bender","Rodolfo Scott","Roland Blake","Roland Sullivan","Rolf Barnett","Ross Marquez","Ruthie Daugherty","Sandra Potts","Scott Stephenson","Scotty Gonzales","Sean Wiggins","Shana Gallagher","Sharron Montes","Sheryl Lindsey","Socorro Hayden","Solomon Andrade","Stacey Whitehead","Stevie Hale","Stuart Oliver","Stuart Riddle","Tammy Merritt","Theo Wiley","Theresa Murillo","Timothy Roberts","Tony Torres","Tracy Logan","Troy Hoover","Twila Rubio","Velma Everett","Vincent Mccormick","Vincenzo Stafford","Vito Clark","Waldo Spencer","Werner Lowe","Werner Shepard","Wesley Ford","Wm Cantu","Zelma Pierce"]
[null,null,null,null,null,"Oren Montes",{"$f":"IF('Resulting List'!F64=\"\",\"\",'Resulting List'!F64)","v":""},null,{"$f":"TRANSPOSE(_xlfn._xlws.SORT(_xlfn.UNIQUE(_xlfn._xlws.FILTER(Customers[Names],ISNUMBER(SEARCH(Customers[[#This Row],[Search Criteria]],Customers[Names])),\"No data.\"))))","v":"Adriana Todd"},"Albert Ramirez","Alex Rubio","Amanda Beck","Amparo Orozco","Amy Todd","Angelina Roberson","April Fox","Arden Ayala","Arnoldo Pennington","Aubrey Giles","Bette Rivers","Brianna Alexander","Brianna Mora","Britt Vazquez","Broderick Gillespie","Brooke Roman","Calvin Buck","Carmela Mullins","Carol Stevenson","Carolina Russell","Carolyn Roberts","Chelsea Gilbert","Cheryl Williamson","Christa Frederick","Christian Armstrong","Christopher Stuart","Chung Krueger","Clare Whitney","Clarissa Archer","Claudio Lam","Cordell Mills","Craig Shepherd","Damien Kramer","Dane Burke","Danielle Stout","Darrel Liu","Darrin Mcneil","Darron Aguilar","Della Huber","Delores Krause","Dena Rosario","Dominick Johnston","Dona Herring","Dorothy Winters","Douglas Wiley","Doyle David","Earlene Hester","Earline Shepherd","Edwin Sparks","Eli Galvan","Elinor Kaufman","Elroy Porter","Elvin Flynn","Emmitt Porter","Erik Parsons","Ethel Forbes","Felicia Ware","Fidel Haynes","Francisco Valenzuela","Frank Hunt","Gabriela Moore","Gabrielle Patrick","Gale Fitzpatrick","Gayle Curtis","Genevieve Lucero","Gerry Oneal","Grady Ellis","Grover Escobar","Hans Patel","Horacio Black","Humberto Compton","Hunter Short","Ilene Mcguire","Imelda Lloyd","Ira Macdonald","Issac Allen","Jacques Velazquez","Janis Mullins","Janna Cowan","Javier Garner","Jayson Abbott","Jeannie Tapia","Jefferson Lee","Jeramy Keith","Jermaine Bradshaw","Jewel Lee","Jimmie Yang","Jodie Wood","John Cline","Josefina Dickerson","Josie Pineda","Judith Griffin","Julius Soto","Kelli Romero","Kerri Joseph","Kim Mccall","Lakeisha Velazquez","Latonya Logan","Lee Schmidt","Lela Atkins","Leland Robertson","Leonardo House","Leroy Mcintyre","Lesley Blevins","Lilia Berg","Lilly Stone","Lincoln Bond","Lindsay Hurst","Lionel Fuller","Lorene Hunter","Louis Kidd","Lucius Warren","Lucy Mejia","Lupe Ingram","Lynette Fuller","Lynnette Wright","Madge Copeland","Madge Tanner","Mae Sawyer","Malcolm Newman","Mamie Wong","Mandy Swanson","Marcella Everett","Marco Bright","Marcos Schaefer","Marcus Hays","Marina Walsh","Marion Savage","Marylou Bass","Marylou Mccarthy","Mathew Howard","Maurice Jacobson","Mauricio Bautista","Max Smith","Melanie Bridges","Melissa Brandt","Merlin Wu","Michel Simpson","Mickey Kennedy","Mike Sloan","Milton Walsh","Mohamed Allison","Mohammad Christensen","Nadia Macdonald","Naomi Snyder","Ned Lowe","Nettie Leonard","Olive Perkins","Ophelia Morrow","Oren Montes","Orlando Henderson","Owen Buchanan","Paul Norman","Rafael Barrett","Raymond Cochran","Reed Hooper","Reinaldo Houston","Renato Simmons","Rene Calhoun","Reva Hardin","Robert French","Robin Bender","Rodolfo Scott","Roland Blake","Roland Sullivan","Rolf Barnett","Ross Marquez","Ruthie Daugherty","Sandra Potts","Scott Stephenson","Scotty Gonzales","Sean Wiggins","Shana Gallagher","Sharron Montes","Sheryl Lindsey","Socorro Hayden","Solomon Andrade","Stacey Whitehead","Stevie Hale","Stuart Oliver","Stuart Riddle","Tammy Merritt","Theo Wiley","Theresa Murillo","Timothy Roberts","Tony Torres","Tracy Logan","Troy Hoover","Twila Rubio","Velma Everett","Vincent Mccormick","Vincenzo Stafford","Vito Clark","Waldo Spencer","Werner Lowe","Werner Shepard","Wesley Ford","Wm Cantu","Zelma Pierce"]
[null,null,null,null,null,"Danielle Stout",{"$f":"IF('Resulting List'!F65=\"\",\"\",'Resulting List'!F65)","v":""},null,{"$f":"TRANSPOSE(_xlfn._xlws.SORT(_xlfn.UNIQUE(_xlfn._xlws.FILTER(Customers[Names],ISNUMBER(SEARCH(Customers[[#This Row],[Search Criteria]],Customers[Names])),\"No data.\"))))","v":"Adriana Todd"},"Albert Ramirez","Alex Rubio","Amanda Beck","Amparo Orozco","Amy Todd","Angelina Roberson","April Fox","Arden Ayala","Arnoldo Pennington","Aubrey Giles","Bette Rivers","Brianna Alexander","Brianna Mora","Britt Vazquez","Broderick Gillespie","Brooke Roman","Calvin Buck","Carmela Mullins","Carol Stevenson","Carolina Russell","Carolyn Roberts","Chelsea Gilbert","Cheryl Williamson","Christa Frederick","Christian Armstrong","Christopher Stuart","Chung Krueger","Clare Whitney","Clarissa Archer","Claudio Lam","Cordell Mills","Craig Shepherd","Damien Kramer","Dane Burke","Danielle Stout","Darrel Liu","Darrin Mcneil","Darron Aguilar","Della Huber","Delores Krause","Dena Rosario","Dominick Johnston","Dona Herring","Dorothy Winters","Douglas Wiley","Doyle David","Earlene Hester","Earline Shepherd","Edwin Sparks","Eli Galvan","Elinor Kaufman","Elroy Porter","Elvin Flynn","Emmitt Porter","Erik Parsons","Ethel Forbes","Felicia Ware","Fidel Haynes","Francisco Valenzuela","Frank Hunt","Gabriela Moore","Gabrielle Patrick","Gale Fitzpatrick","Gayle Curtis","Genevieve Lucero","Gerry Oneal","Grady Ellis","Grover Escobar","Hans Patel","Horacio Black","Humberto Compton","Hunter Short","Ilene Mcguire","Imelda Lloyd","Ira Macdonald","Issac Allen","Jacques Velazquez","Janis Mullins","Janna Cowan","Javier Garner","Jayson Abbott","Jeannie Tapia","Jefferson Lee","Jeramy Keith","Jermaine Bradshaw","Jewel Lee","Jimmie Yang","Jodie Wood","John Cline","Josefina Dickerson","Josie Pineda","Judith Griffin","Julius Soto","Kelli Romero","Kerri Joseph","Kim Mccall","Lakeisha Velazquez","Latonya Logan","Lee Schmidt","Lela Atkins","Leland Robertson","Leonardo House","Leroy Mcintyre","Lesley Blevins","Lilia Berg","Lilly Stone","Lincoln Bond","Lindsay Hurst","Lionel Fuller","Lorene Hunter","Louis Kidd","Lucius Warren","Lucy Mejia","Lupe Ingram","Lynette Fuller","Lynnette Wright","Madge Copeland","Madge Tanner","Mae Sawyer","Malcolm Newman","Mamie Wong","Mandy Swanson","Marcella Everett","Marco Bright","Marcos Schaefer","Marcus Hays","Marina Walsh","Marion Savage","Marylou Bass","Marylou Mccarthy","Mathew Howard","Maurice Jacobson","Mauricio Bautista","Max Smith","Melanie Bridges","Melissa Brandt","Merlin Wu","Michel Simpson","Mickey Kennedy","Mike Sloan","Milton Walsh","Mohamed Allison","Mohammad Christensen","Nadia Macdonald","Naomi Snyder","Ned Lowe","Nettie Leonard","Olive Perkins","Ophelia Morrow","Oren Montes","Orlando Henderson","Owen Buchanan","Paul Norman","Rafael Barrett","Raymond Cochran","Reed Hooper","Reinaldo Houston","Renato Simmons","Rene Calhoun","Reva Hardin","Robert French","Robin Bender","Rodolfo Scott","Roland Blake","Roland Sullivan","Rolf Barnett","Ross Marquez","Ruthie Daugherty","Sandra Potts","Scott Stephenson","Scotty Gonzales","Sean Wiggins","Shana Gallagher","Sharron Montes","Sheryl Lindsey","Socorro Hayden","Solomon Andrade","Stacey Whitehead","Stevie Hale","Stuart Oliver","Stuart Riddle","Tammy Merritt","Theo Wiley","Theresa Murillo","Timothy Roberts","Tony Torres","Tracy Logan","Troy Hoover","Twila Rubio","Velma Everett","Vincent Mccormick","Vincenzo Stafford","Vito Clark","Waldo Spencer","Werner Lowe","Werner Shepard","Wesley Ford","Wm Cantu","Zelma Pierce"]
[null,null,null,null,null,"Carmela Mullins",{"$f":"IF('Resulting List'!F66=\"\",\"\",'Resulting List'!F66)","v":""},null,{"$f":"TRANSPOSE(_xlfn._xlws.SORT(_xlfn.UNIQUE(_xlfn._xlws.FILTER(Customers[Names],ISNUMBER(SEARCH(Customers[[#This Row],[Search Criteria]],Customers[Names])),\"No data.\"))))","v":"Adriana Todd"},"Albert Ramirez","Alex Rubio","Amanda Beck","Amparo Orozco","Amy Todd","Angelina Roberson","April Fox","Arden Ayala","Arnoldo Pennington","Aubrey Giles","Bette Rivers","Brianna Alexander","Brianna Mora","Britt Vazquez","Broderick Gillespie","Brooke Roman","Calvin Buck","Carmela Mullins","Carol Stevenson","Carolina Russell","Carolyn Roberts","Chelsea Gilbert","Cheryl Williamson","Christa Frederick","Christian Armstrong","Christopher Stuart","Chung Krueger","Clare Whitney","Clarissa Archer","Claudio Lam","Cordell Mills","Craig Shepherd","Damien Kramer","Dane Burke","Danielle Stout","Darrel Liu","Darrin Mcneil","Darron Aguilar","Della Huber","Delores Krause","Dena Rosario","Dominick Johnston","Dona Herring","Dorothy Winters","Douglas Wiley","Doyle David","Earlene Hester","Earline Shepherd","Edwin Sparks","Eli Galvan","Elinor Kaufman","Elroy Porter","Elvin Flynn","Emmitt Porter","Erik Parsons","Ethel Forbes","Felicia Ware","Fidel Haynes","Francisco Valenzuela","Frank Hunt","Gabriela Moore","Gabrielle Patrick","Gale Fitzpatrick","Gayle Curtis","Genevieve Lucero","Gerry Oneal","Grady Ellis","Grover Escobar","Hans Patel","Horacio Black","Humberto Compton","Hunter Short","Ilene Mcguire","Imelda Lloyd","Ira Macdonald","Issac Allen","Jacques Velazquez","Janis Mullins","Janna Cowan","Javier Garner","Jayson Abbott","Jeannie Tapia","Jefferson Lee","Jeramy Keith","Jermaine Bradshaw","Jewel Lee","Jimmie Yang","Jodie Wood","John Cline","Josefina Dickerson","Josie Pineda","Judith Griffin","Julius Soto","Kelli Romero","Kerri Joseph","Kim Mccall","Lakeisha Velazquez","Latonya Logan","Lee Schmidt","Lela Atkins","Leland Robertson","Leonardo House","Leroy Mcintyre","Lesley Blevins","Lilia Berg","Lilly Stone","Lincoln Bond","Lindsay Hurst","Lionel Fuller","Lorene Hunter","Louis Kidd","Lucius Warren","Lucy Mejia","Lupe Ingram","Lynette Fuller","Lynnette Wright","Madge Copeland","Madge Tanner","Mae Sawyer","Malcolm Newman","Mamie Wong","Mandy Swanson","Marcella Everett","Marco Bright","Marcos Schaefer","Marcus Hays","Marina Walsh","Marion Savage","Marylou Bass","Marylou Mccarthy","Mathew Howard","Maurice Jacobson","Mauricio Bautista","Max Smith","Melanie Bridges","Melissa Brandt","Merlin Wu","Michel Simpson","Mickey Kennedy","Mike Sloan","Milton Walsh","Mohamed Allison","Mohammad Christensen","Nadia Macdonald","Naomi Snyder","Ned Lowe","Nettie Leonard","Olive Perkins","Ophelia Morrow","Oren Montes","Orlando Henderson","Owen Buchanan","Paul Norman","Rafael Barrett","Raymond Cochran","Reed Hooper","Reinaldo Houston","Renato Simmons","Rene Calhoun","Reva Hardin","Robert French","Robin Bender","Rodolfo Scott","Roland Blake","Roland Sullivan","Rolf Barnett","Ross Marquez","Ruthie Daugherty","Sandra Potts","Scott Stephenson","Scotty Gonzales","Sean Wiggins","Shana Gallagher","Sharron Montes","Sheryl Lindsey","Socorro Hayden","Solomon Andrade","Stacey Whitehead","Stevie Hale","Stuart Oliver","Stuart Riddle","Tammy Merritt","Theo Wiley","Theresa Murillo","Timothy Roberts","Tony Torres","Tracy Logan","Troy Hoover","Twila Rubio","Velma Everett","Vincent Mccormick","Vincenzo Stafford","Vito Clark","Waldo Spencer","Werner Lowe","Werner Shepard","Wesley Ford","Wm Cantu","Zelma Pierce"]
[null,null,null,null,null,"Christian Armstrong",{"$f":"IF('Resulting List'!F67=\"\",\"\",'Resulting List'!F67)","v":""},null,{"$f":"TRANSPOSE(_xlfn._xlws.SORT(_xlfn.UNIQUE(_xlfn._xlws.FILTER(Customers[Names],ISNUMBER(SEARCH(Customers[[#This Row],[Search Criteria]],Customers[Names])),\"No data.\"))))","v":"Adriana Todd"},"Albert Ramirez","Alex Rubio","Amanda Beck","Amparo Orozco","Amy Todd","Angelina Roberson","April Fox","Arden Ayala","Arnoldo Pennington","Aubrey Giles","Bette Rivers","Brianna Alexander","Brianna Mora","Britt Vazquez","Broderick Gillespie","Brooke Roman","Calvin Buck","Carmela Mullins","Carol Stevenson","Carolina Russell","Carolyn Roberts","Chelsea Gilbert","Cheryl Williamson","Christa Frederick","Christian Armstrong","Christopher Stuart","Chung Krueger","Clare Whitney","Clarissa Archer","Claudio Lam","Cordell Mills","Craig Shepherd","Damien Kramer","Dane Burke","Danielle Stout","Darrel Liu","Darrin Mcneil","Darron Aguilar","Della Huber","Delores Krause","Dena Rosario","Dominick Johnston","Dona Herring","Dorothy Winters","Douglas Wiley","Doyle David","Earlene Hester","Earline Shepherd","Edwin Sparks","Eli Galvan","Elinor Kaufman","Elroy Porter","Elvin Flynn","Emmitt Porter","Erik Parsons","Ethel Forbes","Felicia Ware","Fidel Haynes","Francisco Valenzuela","Frank Hunt","Gabriela Moore","Gabrielle Patrick","Gale Fitzpatrick","Gayle Curtis","Genevieve Lucero","Gerry Oneal","Grady Ellis","Grover Escobar","Hans Patel","Horacio Black","Humberto Compton","Hunter Short","Ilene Mcguire","Imelda Lloyd","Ira Macdonald","Issac Allen","Jacques Velazquez","Janis Mullins","Janna Cowan","Javier Garner","Jayson Abbott","Jeannie Tapia","Jefferson Lee","Jeramy Keith","Jermaine Bradshaw","Jewel Lee","Jimmie Yang","Jodie Wood","John Cline","Josefina Dickerson","Josie Pineda","Judith Griffin","Julius Soto","Kelli Romero","Kerri Joseph","Kim Mccall","Lakeisha Velazquez","Latonya Logan","Lee Schmidt","Lela Atkins","Leland Robertson","Leonardo House","Leroy Mcintyre","Lesley Blevins","Lilia Berg","Lilly Stone","Lincoln Bond","Lindsay Hurst","Lionel Fuller","Lorene Hunter","Louis Kidd","Lucius Warren","Lucy Mejia","Lupe Ingram","Lynette Fuller","Lynnette Wright","Madge Copeland","Madge Tanner","Mae Sawyer","Malcolm Newman","Mamie Wong","Mandy Swanson","Marcella Everett","Marco Bright","Marcos Schaefer","Marcus Hays","Marina Walsh","Marion Savage","Marylou Bass","Marylou Mccarthy","Mathew Howard","Maurice Jacobson","Mauricio Bautista","Max Smith","Melanie Bridges","Melissa Brandt","Merlin Wu","Michel Simpson","Mickey Kennedy","Mike Sloan","Milton Walsh","Mohamed Allison","Mohammad Christensen","Nadia Macdonald","Naomi Snyder","Ned Lowe","Nettie Leonard","Olive Perkins","Ophelia Morrow","Oren Montes","Orlando Henderson","Owen Buchanan","Paul Norman","Rafael Barrett","Raymond Cochran","Reed Hooper","Reinaldo Houston","Renato Simmons","Rene Calhoun","Reva Hardin","Robert French","Robin Bender","Rodolfo Scott","Roland Blake","Roland Sullivan","Rolf Barnett","Ross Marquez","Ruthie Daugherty","Sandra Potts","Scott Stephenson","Scotty Gonzales","Sean Wiggins","Shana Gallagher","Sharron Montes","Sheryl Lindsey","Socorro Hayden","Solomon Andrade","Stacey Whitehead","Stevie Hale","Stuart Oliver","Stuart Riddle","Tammy Merritt","Theo Wiley","Theresa Murillo","Timothy Roberts","Tony Torres","Tracy Logan","Troy Hoover","Twila Rubio","Velma Everett","Vincent Mccormick","Vincenzo Stafford","Vito Clark","Waldo Spencer","Werner Lowe","Werner Shepard","Wesley Ford","Wm Cantu","Zelma Pierce"]
[null,null,null,null,null,"Elinor Kaufman",{"$f":"IF('Resulting List'!F68=\"\",\"\",'Resulting List'!F68)","v":""},null,{"$f":"TRANSPOSE(_xlfn._xlws.SORT(_xlfn.UNIQUE(_xlfn._xlws.FILTER(Customers[Names],ISNUMBER(SEARCH(Customers[[#This Row],[Search Criteria]],Customers[Names])),\"No data.\"))))","v":"Adriana Todd"},"Albert Ramirez","Alex Rubio","Amanda Beck","Amparo Orozco","Amy Todd","Angelina Roberson","April Fox","Arden Ayala","Arnoldo Pennington","Aubrey Giles","Bette Rivers","Brianna Alexander","Brianna Mora","Britt Vazquez","Broderick Gillespie","Brooke Roman","Calvin Buck","Carmela Mullins","Carol Stevenson","Carolina Russell","Carolyn Roberts","Chelsea Gilbert","Cheryl Williamson","Christa Frederick","Christian Armstrong","Christopher Stuart","Chung Krueger","Clare Whitney","Clarissa Archer","Claudio Lam","Cordell Mills","Craig Shepherd","Damien Kramer","Dane Burke","Danielle Stout","Darrel Liu","Darrin Mcneil","Darron Aguilar","Della Huber","Delores Krause","Dena Rosario","Dominick Johnston","Dona Herring","Dorothy Winters","Douglas Wiley","Doyle David","Earlene Hester","Earline Shepherd","Edwin Sparks","Eli Galvan","Elinor Kaufman","Elroy Porter","Elvin Flynn","Emmitt Porter","Erik Parsons","Ethel Forbes","Felicia Ware","Fidel Haynes","Francisco Valenzuela","Frank Hunt","Gabriela Moore","Gabrielle Patrick","Gale Fitzpatrick","Gayle Curtis","Genevieve Lucero","Gerry Oneal","Grady Ellis","Grover Escobar","Hans Patel","Horacio Black","Humberto Compton","Hunter Short","Ilene Mcguire","Imelda Lloyd","Ira Macdonald","Issac Allen","Jacques Velazquez","Janis Mullins","Janna Cowan","Javier Garner","Jayson Abbott","Jeannie Tapia","Jefferson Lee","Jeramy Keith","Jermaine Bradshaw","Jewel Lee","Jimmie Yang","Jodie Wood","John Cline","Josefina Dickerson","Josie Pineda","Judith Griffin","Julius Soto","Kelli Romero","Kerri Joseph","Kim Mccall","Lakeisha Velazquez","Latonya Logan","Lee Schmidt","Lela Atkins","Leland Robertson","Leonardo House","Leroy Mcintyre","Lesley Blevins","Lilia Berg","Lilly Stone","Lincoln Bond","Lindsay Hurst","Lionel Fuller","Lorene Hunter","Louis Kidd","Lucius Warren","Lucy Mejia","Lupe Ingram","Lynette Fuller","Lynnette Wright","Madge Copeland","Madge Tanner","Mae Sawyer","Malcolm Newman","Mamie Wong","Mandy Swanson","Marcella Everett","Marco Bright","Marcos Schaefer","Marcus Hays","Marina Walsh","Marion Savage","Marylou Bass","Marylou Mccarthy","Mathew Howard","Maurice Jacobson","Mauricio Bautista","Max Smith","Melanie Bridges","Melissa Brandt","Merlin Wu","Michel Simpson","Mickey Kennedy","Mike Sloan","Milton Walsh","Mohamed Allison","Mohammad Christensen","Nadia Macdonald","Naomi Snyder","Ned Lowe","Nettie Leonard","Olive Perkins","Ophelia Morrow","Oren Montes","Orlando Henderson","Owen Buchanan","Paul Norman","Rafael Barrett","Raymond Cochran","Reed Hooper","Reinaldo Houston","Renato Simmons","Rene Calhoun","Reva Hardin","Robert French","Robin Bender","Rodolfo Scott","Roland Blake","Roland Sullivan","Rolf Barnett","Ross Marquez","Ruthie Daugherty","Sandra Potts","Scott Stephenson","Scotty Gonzales","Sean Wiggins","Shana Gallagher","Sharron Montes","Sheryl Lindsey","Socorro Hayden","Solomon Andrade","Stacey Whitehead","Stevie Hale","Stuart Oliver","Stuart Riddle","Tammy Merritt","Theo Wiley","Theresa Murillo","Timothy Roberts","Tony Torres","Tracy Logan","Troy Hoover","Twila Rubio","Velma Everett","Vincent Mccormick","Vincenzo Stafford","Vito Clark","Waldo Spencer","Werner Lowe","Werner Shepard","Wesley Ford","Wm Cantu","Zelma Pierce"]
[null,null,null,null,null,"Robert French",{"$f":"IF('Resulting List'!F69=\"\",\"\",'Resulting List'!F69)","v":""},null,{"$f":"TRANSPOSE(_xlfn._xlws.SORT(_xlfn.UNIQUE(_xlfn._xlws.FILTER(Customers[Names],ISNUMBER(SEARCH(Customers[[#This Row],[Search Criteria]],Customers[Names])),\"No data.\"))))","v":"Adriana Todd"},"Albert Ramirez","Alex Rubio","Amanda Beck","Amparo Orozco","Amy Todd","Angelina Roberson","April Fox","Arden Ayala","Arnoldo Pennington","Aubrey Giles","Bette Rivers","Brianna Alexander","Brianna Mora","Britt Vazquez","Broderick Gillespie","Brooke Roman","Calvin Buck","Carmela Mullins","Carol Stevenson","Carolina Russell","Carolyn Roberts","Chelsea Gilbert","Cheryl Williamson","Christa Frederick","Christian Armstrong","Christopher Stuart","Chung Krueger","Clare Whitney","Clarissa Archer","Claudio Lam","Cordell Mills","Craig Shepherd","Damien Kramer","Dane Burke","Danielle Stout","Darrel Liu","Darrin Mcneil","Darron Aguilar","Della Huber","Delores Krause","Dena Rosario","Dominick Johnston","Dona Herring","Dorothy Winters","Douglas Wiley","Doyle David","Earlene Hester","Earline Shepherd","Edwin Sparks","Eli Galvan","Elinor Kaufman","Elroy Porter","Elvin Flynn","Emmitt Porter","Erik Parsons","Ethel Forbes","Felicia Ware","Fidel Haynes","Francisco Valenzuela","Frank Hunt","Gabriela Moore","Gabrielle Patrick","Gale Fitzpatrick","Gayle Curtis","Genevieve Lucero","Gerry Oneal","Grady Ellis","Grover Escobar","Hans Patel","Horacio Black","Humberto Compton","Hunter Short","Ilene Mcguire","Imelda Lloyd","Ira Macdonald","Issac Allen","Jacques Velazquez","Janis Mullins","Janna Cowan","Javier Garner","Jayson Abbott","Jeannie Tapia","Jefferson Lee","Jeramy Keith","Jermaine Bradshaw","Jewel Lee","Jimmie Yang","Jodie Wood","John Cline","Josefina Dickerson","Josie Pineda","Judith Griffin","Julius Soto","Kelli Romero","Kerri Joseph","Kim Mccall","Lakeisha Velazquez","Latonya Logan","Lee Schmidt","Lela Atkins","Leland Robertson","Leonardo House","Leroy Mcintyre","Lesley Blevins","Lilia Berg","Lilly Stone","Lincoln Bond","Lindsay Hurst","Lionel Fuller","Lorene Hunter","Louis Kidd","Lucius Warren","Lucy Mejia","Lupe Ingram","Lynette Fuller","Lynnette Wright","Madge Copeland","Madge Tanner","Mae Sawyer","Malcolm Newman","Mamie Wong","Mandy Swanson","Marcella Everett","Marco Bright","Marcos Schaefer","Marcus Hays","Marina Walsh","Marion Savage","Marylou Bass","Marylou Mccarthy","Mathew Howard","Maurice Jacobson","Mauricio Bautista","Max Smith","Melanie Bridges","Melissa Brandt","Merlin Wu","Michel Simpson","Mickey Kennedy","Mike Sloan","Milton Walsh","Mohamed Allison","Mohammad Christensen","Nadia Macdonald","Naomi Snyder","Ned Lowe","Nettie Leonard","Olive Perkins","Ophelia Morrow","Oren Montes","Orlando Henderson","Owen Buchanan","Paul Norman","Rafael Barrett","Raymond Cochran","Reed Hooper","Reinaldo Houston","Renato Simmons","Rene Calhoun","Reva Hardin","Robert French","Robin Bender","Rodolfo Scott","Roland Blake","Roland Sullivan","Rolf Barnett","Ross Marquez","Ruthie Daugherty","Sandra Potts","Scott Stephenson","Scotty Gonzales","Sean Wiggins","Shana Gallagher","Sharron Montes","Sheryl Lindsey","Socorro Hayden","Solomon Andrade","Stacey Whitehead","Stevie Hale","Stuart Oliver","Stuart Riddle","Tammy Merritt","Theo Wiley","Theresa Murillo","Timothy Roberts","Tony Torres","Tracy Logan","Troy Hoover","Twila Rubio","Velma Everett","Vincent Mccormick","Vincenzo Stafford","Vito Clark","Waldo Spencer","Werner Lowe","Werner Shepard","Wesley Ford","Wm Cantu","Zelma Pierce"]
[null,null,null,null,null,"Solomon Andrade",{"$f":"IF('Resulting List'!F70=\"\",\"\",'Resulting List'!F70)","v":""},null,{"$f":"TRANSPOSE(_xlfn._xlws.SORT(_xlfn.UNIQUE(_xlfn._xlws.FILTER(Customers[Names],ISNUMBER(SEARCH(Customers[[#This Row],[Search Criteria]],Customers[Names])),\"No data.\"))))","v":"Adriana Todd"},"Albert Ramirez","Alex Rubio","Amanda Beck","Amparo Orozco","Amy Todd","Angelina Roberson","April Fox","Arden Ayala","Arnoldo Pennington","Aubrey Giles","Bette Rivers","Brianna Alexander","Brianna Mora","Britt Vazquez","Broderick Gillespie","Brooke Roman","Calvin Buck","Carmela Mullins","Carol Stevenson","Carolina Russell","Carolyn Roberts","Chelsea Gilbert","Cheryl Williamson","Christa Frederick","Christian Armstrong","Christopher Stuart","Chung Krueger","Clare Whitney","Clarissa Archer","Claudio Lam","Cordell Mills","Craig Shepherd","Damien Kramer","Dane Burke","Danielle Stout","Darrel Liu","Darrin Mcneil","Darron Aguilar","Della Huber","Delores Krause","Dena Rosario","Dominick Johnston","Dona Herring","Dorothy Winters","Douglas Wiley","Doyle David","Earlene Hester","Earline Shepherd","Edwin Sparks","Eli Galvan","Elinor Kaufman","Elroy Porter","Elvin Flynn","Emmitt Porter","Erik Parsons","Ethel Forbes","Felicia Ware","Fidel Haynes","Francisco Valenzuela","Frank Hunt","Gabriela Moore","Gabrielle Patrick","Gale Fitzpatrick","Gayle Curtis","Genevieve Lucero","Gerry Oneal","Grady Ellis","Grover Escobar","Hans Patel","Horacio Black","Humberto Compton","Hunter Short","Ilene Mcguire","Imelda Lloyd","Ira Macdonald","Issac Allen","Jacques Velazquez","Janis Mullins","Janna Cowan","Javier Garner","Jayson Abbott","Jeannie Tapia","Jefferson Lee","Jeramy Keith","Jermaine Bradshaw","Jewel Lee","Jimmie Yang","Jodie Wood","John Cline","Josefina Dickerson","Josie Pineda","Judith Griffin","Julius Soto","Kelli Romero","Kerri Joseph","Kim Mccall","Lakeisha Velazquez","Latonya Logan","Lee Schmidt","Lela Atkins","Leland Robertson","Leonardo House","Leroy Mcintyre","Lesley Blevins","Lilia Berg","Lilly Stone","Lincoln Bond","Lindsay Hurst","Lionel Fuller","Lorene Hunter","Louis Kidd","Lucius Warren","Lucy Mejia","Lupe Ingram","Lynette Fuller","Lynnette Wright","Madge Copeland","Madge Tanner","Mae Sawyer","Malcolm Newman","Mamie Wong","Mandy Swanson","Marcella Everett","Marco Bright","Marcos Schaefer","Marcus Hays","Marina Walsh","Marion Savage","Marylou Bass","Marylou Mccarthy","Mathew Howard","Maurice Jacobson","Mauricio Bautista","Max Smith","Melanie Bridges","Melissa Brandt","Merlin Wu","Michel Simpson","Mickey Kennedy","Mike Sloan","Milton Walsh","Mohamed Allison","Mohammad Christensen","Nadia Macdonald","Naomi Snyder","Ned Lowe","Nettie Leonard","Olive Perkins","Ophelia Morrow","Oren Montes","Orlando Henderson","Owen Buchanan","Paul Norman","Rafael Barrett","Raymond Cochran","Reed Hooper","Reinaldo Houston","Renato Simmons","Rene Calhoun","Reva Hardin","Robert French","Robin Bender","Rodolfo Scott","Roland Blake","Roland Sullivan","Rolf Barnett","Ross Marquez","Ruthie Daugherty","Sandra Potts","Scott Stephenson","Scotty Gonzales","Sean Wiggins","Shana Gallagher","Sharron Montes","Sheryl Lindsey","Socorro Hayden","Solomon Andrade","Stacey Whitehead","Stevie Hale","Stuart Oliver","Stuart Riddle","Tammy Merritt","Theo Wiley","Theresa Murillo","Timothy Roberts","Tony Torres","Tracy Logan","Troy Hoover","Twila Rubio","Velma Everett","Vincent Mccormick","Vincenzo Stafford","Vito Clark","Waldo Spencer","Werner Lowe","Werner Shepard","Wesley Ford","Wm Cantu","Zelma Pierce"]
[null,null,null,null,null,"Mae Sawyer",{"$f":"IF('Resulting List'!F71=\"\",\"\",'Resulting List'!F71)","v":""},null,{"$f":"TRANSPOSE(_xlfn._xlws.SORT(_xlfn.UNIQUE(_xlfn._xlws.FILTER(Customers[Names],ISNUMBER(SEARCH(Customers[[#This Row],[Search Criteria]],Customers[Names])),\"No data.\"))))","v":"Adriana Todd"},"Albert Ramirez","Alex Rubio","Amanda Beck","Amparo Orozco","Amy Todd","Angelina Roberson","April Fox","Arden Ayala","Arnoldo Pennington","Aubrey Giles","Bette Rivers","Brianna Alexander","Brianna Mora","Britt Vazquez","Broderick Gillespie","Brooke Roman","Calvin Buck","Carmela Mullins","Carol Stevenson","Carolina Russell","Carolyn Roberts","Chelsea Gilbert","Cheryl Williamson","Christa Frederick","Christian Armstrong","Christopher Stuart","Chung Krueger","Clare Whitney","Clarissa Archer","Claudio Lam","Cordell Mills","Craig Shepherd","Damien Kramer","Dane Burke","Danielle Stout","Darrel Liu","Darrin Mcneil","Darron Aguilar","Della Huber","Delores Krause","Dena Rosario","Dominick Johnston","Dona Herring","Dorothy Winters","Douglas Wiley","Doyle David","Earlene Hester","Earline Shepherd","Edwin Sparks","Eli Galvan","Elinor Kaufman","Elroy Porter","Elvin Flynn","Emmitt Porter","Erik Parsons","Ethel Forbes","Felicia Ware","Fidel Haynes","Francisco Valenzuela","Frank Hunt","Gabriela Moore","Gabrielle Patrick","Gale Fitzpatrick","Gayle Curtis","Genevieve Lucero","Gerry Oneal","Grady Ellis","Grover Escobar","Hans Patel","Horacio Black","Humberto Compton","Hunter Short","Ilene Mcguire","Imelda Lloyd","Ira Macdonald","Issac Allen","Jacques Velazquez","Janis Mullins","Janna Cowan","Javier Garner","Jayson Abbott","Jeannie Tapia","Jefferson Lee","Jeramy Keith","Jermaine Bradshaw","Jewel Lee","Jimmie Yang","Jodie Wood","John Cline","Josefina Dickerson","Josie Pineda","Judith Griffin","Julius Soto","Kelli Romero","Kerri Joseph","Kim Mccall","Lakeisha Velazquez","Latonya Logan","Lee Schmidt","Lela Atkins","Leland Robertson","Leonardo House","Leroy Mcintyre","Lesley Blevins","Lilia Berg","Lilly Stone","Lincoln Bond","Lindsay Hurst","Lionel Fuller","Lorene Hunter","Louis Kidd","Lucius Warren","Lucy Mejia","Lupe Ingram","Lynette Fuller","Lynnette Wright","Madge Copeland","Madge Tanner","Mae Sawyer","Malcolm Newman","Mamie Wong","Mandy Swanson","Marcella Everett","Marco Bright","Marcos Schaefer","Marcus Hays","Marina Walsh","Marion Savage","Marylou Bass","Marylou Mccarthy","Mathew Howard","Maurice Jacobson","Mauricio Bautista","Max Smith","Melanie Bridges","Melissa Brandt","Merlin Wu","Michel Simpson","Mickey Kennedy","Mike Sloan","Milton Walsh","Mohamed Allison","Mohammad Christensen","Nadia Macdonald","Naomi Snyder","Ned Lowe","Nettie Leonard","Olive Perkins","Ophelia Morrow","Oren Montes","Orlando Henderson","Owen Buchanan","Paul Norman","Rafael Barrett","Raymond Cochran","Reed Hooper","Reinaldo Houston","Renato Simmons","Rene Calhoun","Reva Hardin","Robert French","Robin Bender","Rodolfo Scott","Roland Blake","Roland Sullivan","Rolf Barnett","Ross Marquez","Ruthie Daugherty","Sandra Potts","Scott Stephenson","Scotty Gonzales","Sean Wiggins","Shana Gallagher","Sharron Montes","Sheryl Lindsey","Socorro Hayden","Solomon Andrade","Stacey Whitehead","Stevie Hale","Stuart Oliver","Stuart Riddle","Tammy Merritt","Theo Wiley","Theresa Murillo","Timothy Roberts","Tony Torres","Tracy Logan","Troy Hoover","Twila Rubio","Velma Everett","Vincent Mccormick","Vincenzo Stafford","Vito Clark","Waldo Spencer","Werner Lowe","Werner Shepard","Wesley Ford","Wm Cantu","Zelma Pierce"]
[null,null,null,null,null,"Owen Buchanan",{"$f":"IF('Resulting List'!F72=\"\",\"\",'Resulting List'!F72)","v":""},null,{"$f":"TRANSPOSE(_xlfn._xlws.SORT(_xlfn.UNIQUE(_xlfn._xlws.FILTER(Customers[Names],ISNUMBER(SEARCH(Customers[[#This Row],[Search Criteria]],Customers[Names])),\"No data.\"))))","v":"Adriana Todd"},"Albert Ramirez","Alex Rubio","Amanda Beck","Amparo Orozco","Amy Todd","Angelina Roberson","April Fox","Arden Ayala","Arnoldo Pennington","Aubrey Giles","Bette Rivers","Brianna Alexander","Brianna Mora","Britt Vazquez","Broderick Gillespie","Brooke Roman","Calvin Buck","Carmela Mullins","Carol Stevenson","Carolina Russell","Carolyn Roberts","Chelsea Gilbert","Cheryl Williamson","Christa Frederick","Christian Armstrong","Christopher Stuart","Chung Krueger","Clare Whitney","Clarissa Archer","Claudio Lam","Cordell Mills","Craig Shepherd","Damien Kramer","Dane Burke","Danielle Stout","Darrel Liu","Darrin Mcneil","Darron Aguilar","Della Huber","Delores Krause","Dena Rosario","Dominick Johnston","Dona Herring","Dorothy Winters","Douglas Wiley","Doyle David","Earlene Hester","Earline Shepherd","Edwin Sparks","Eli Galvan","Elinor Kaufman","Elroy Porter","Elvin Flynn","Emmitt Porter","Erik Parsons","Ethel Forbes","Felicia Ware","Fidel Haynes","Francisco Valenzuela","Frank Hunt","Gabriela Moore","Gabrielle Patrick","Gale Fitzpatrick","Gayle Curtis","Genevieve Lucero","Gerry Oneal","Grady Ellis","Grover Escobar","Hans Patel","Horacio Black","Humberto Compton","Hunter Short","Ilene Mcguire","Imelda Lloyd","Ira Macdonald","Issac Allen","Jacques Velazquez","Janis Mullins","Janna Cowan","Javier Garner","Jayson Abbott","Jeannie Tapia","Jefferson Lee","Jeramy Keith","Jermaine Bradshaw","Jewel Lee","Jimmie Yang","Jodie Wood","John Cline","Josefina Dickerson","Josie Pineda","Judith Griffin","Julius Soto","Kelli Romero","Kerri Joseph","Kim Mccall","Lakeisha Velazquez","Latonya Logan","Lee Schmidt","Lela Atkins","Leland Robertson","Leonardo House","Leroy Mcintyre","Lesley Blevins","Lilia Berg","Lilly Stone","Lincoln Bond","Lindsay Hurst","Lionel Fuller","Lorene Hunter","Louis Kidd","Lucius Warren","Lucy Mejia","Lupe Ingram","Lynette Fuller","Lynnette Wright","Madge Copeland","Madge Tanner","Mae Sawyer","Malcolm Newman","Mamie Wong","Mandy Swanson","Marcella Everett","Marco Bright","Marcos Schaefer","Marcus Hays","Marina Walsh","Marion Savage","Marylou Bass","Marylou Mccarthy","Mathew Howard","Maurice Jacobson","Mauricio Bautista","Max Smith","Melanie Bridges","Melissa Brandt","Merlin Wu","Michel Simpson","Mickey Kennedy","Mike Sloan","Milton Walsh","Mohamed Allison","Mohammad Christensen","Nadia Macdonald","Naomi Snyder","Ned Lowe","Nettie Leonard","Olive Perkins","Ophelia Morrow","Oren Montes","Orlando Henderson","Owen Buchanan","Paul Norman","Rafael Barrett","Raymond Cochran","Reed Hooper","Reinaldo Houston","Renato Simmons","Rene Calhoun","Reva Hardin","Robert French","Robin Bender","Rodolfo Scott","Roland Blake","Roland Sullivan","Rolf Barnett","Ross Marquez","Ruthie Daugherty","Sandra Potts","Scott Stephenson","Scotty Gonzales","Sean Wiggins","Shana Gallagher","Sharron Montes","Sheryl Lindsey","Socorro Hayden","Solomon Andrade","Stacey Whitehead","Stevie Hale","Stuart Oliver","Stuart Riddle","Tammy Merritt","Theo Wiley","Theresa Murillo","Timothy Roberts","Tony Torres","Tracy Logan","Troy Hoover","Twila Rubio","Velma Everett","Vincent Mccormick","Vincenzo Stafford","Vito Clark","Waldo Spencer","Werner Lowe","Werner Shepard","Wesley Ford","Wm Cantu","Zelma Pierce"]
[null,null,null,null,null,"Kerri Joseph",{"$f":"IF('Resulting List'!F73=\"\",\"\",'Resulting List'!F73)","v":""},null,{"$f":"TRANSPOSE(_xlfn._xlws.SORT(_xlfn.UNIQUE(_xlfn._xlws.FILTER(Customers[Names],ISNUMBER(SEARCH(Customers[[#This Row],[Search Criteria]],Customers[Names])),\"No data.\"))))","v":"Adriana Todd"},"Albert Ramirez","Alex Rubio","Amanda Beck","Amparo Orozco","Amy Todd","Angelina Roberson","April Fox","Arden Ayala","Arnoldo Pennington","Aubrey Giles","Bette Rivers","Brianna Alexander","Brianna Mora","Britt Vazquez","Broderick Gillespie","Brooke Roman","Calvin Buck","Carmela Mullins","Carol Stevenson","Carolina Russell","Carolyn Roberts","Chelsea Gilbert","Cheryl Williamson","Christa Frederick","Christian Armstrong","Christopher Stuart","Chung Krueger","Clare Whitney","Clarissa Archer","Claudio Lam","Cordell Mills","Craig Shepherd","Damien Kramer","Dane Burke","Danielle Stout","Darrel Liu","Darrin Mcneil","Darron Aguilar","Della Huber","Delores Krause","Dena Rosario","Dominick Johnston","Dona Herring","Dorothy Winters","Douglas Wiley","Doyle David","Earlene Hester","Earline Shepherd","Edwin Sparks","Eli Galvan","Elinor Kaufman","Elroy Porter","Elvin Flynn","Emmitt Porter","Erik Parsons","Ethel Forbes","Felicia Ware","Fidel Haynes","Francisco Valenzuela","Frank Hunt","Gabriela Moore","Gabrielle Patrick","Gale Fitzpatrick","Gayle Curtis","Genevieve Lucero","Gerry Oneal","Grady Ellis","Grover Escobar","Hans Patel","Horacio Black","Humberto Compton","Hunter Short","Ilene Mcguire","Imelda Lloyd","Ira Macdonald","Issac Allen","Jacques Velazquez","Janis Mullins","Janna Cowan","Javier Garner","Jayson Abbott","Jeannie Tapia","Jefferson Lee","Jeramy Keith","Jermaine Bradshaw","Jewel Lee","Jimmie Yang","Jodie Wood","John Cline","Josefina Dickerson","Josie Pineda","Judith Griffin","Julius Soto","Kelli Romero","Kerri Joseph","Kim Mccall","Lakeisha Velazquez","Latonya Logan","Lee Schmidt","Lela Atkins","Leland Robertson","Leonardo House","Leroy Mcintyre","Lesley Blevins","Lilia Berg","Lilly Stone","Lincoln Bond","Lindsay Hurst","Lionel Fuller","Lorene Hunter","Louis Kidd","Lucius Warren","Lucy Mejia","Lupe Ingram","Lynette Fuller","Lynnette Wright","Madge Copeland","Madge Tanner","Mae Sawyer","Malcolm Newman","Mamie Wong","Mandy Swanson","Marcella Everett","Marco Bright","Marcos Schaefer","Marcus Hays","Marina Walsh","Marion Savage","Marylou Bass","Marylou Mccarthy","Mathew Howard","Maurice Jacobson","Mauricio Bautista","Max Smith","Melanie Bridges","Melissa Brandt","Merlin Wu","Michel Simpson","Mickey Kennedy","Mike Sloan","Milton Walsh","Mohamed Allison","Mohammad Christensen","Nadia Macdonald","Naomi Snyder","Ned Lowe","Nettie Leonard","Olive Perkins","Ophelia Morrow","Oren Montes","Orlando Henderson","Owen Buchanan","Paul Norman","Rafael Barrett","Raymond Cochran","Reed Hooper","Reinaldo Houston","Renato Simmons","Rene Calhoun","Reva Hardin","Robert French","Robin Bender","Rodolfo Scott","Roland Blake","Roland Sullivan","Rolf Barnett","Ross Marquez","Ruthie Daugherty","Sandra Potts","Scott Stephenson","Scotty Gonzales","Sean Wiggins","Shana Gallagher","Sharron Montes","Sheryl Lindsey","Socorro Hayden","Solomon Andrade","Stacey Whitehead","Stevie Hale","Stuart Oliver","Stuart Riddle","Tammy Merritt","Theo Wiley","Theresa Murillo","Timothy Roberts","Tony Torres","Tracy Logan","Troy Hoover","Twila Rubio","Velma Everett","Vincent Mccormick","Vincenzo Stafford","Vito Clark","Waldo Spencer","Werner Lowe","Werner Shepard","Wesley Ford","Wm Cantu","Zelma Pierce"]
[null,null,null,null,null,"Javier Garner",{"$f":"IF('Resulting List'!F74=\"\",\"\",'Resulting List'!F74)","v":""},null,{"$f":"TRANSPOSE(_xlfn._xlws.SORT(_xlfn.UNIQUE(_xlfn._xlws.FILTER(Customers[Names],ISNUMBER(SEARCH(Customers[[#This Row],[Search Criteria]],Customers[Names])),\"No data.\"))))","v":"Adriana Todd"},"Albert Ramirez","Alex Rubio","Amanda Beck","Amparo Orozco","Amy Todd","Angelina Roberson","April Fox","Arden Ayala","Arnoldo Pennington","Aubrey Giles","Bette Rivers","Brianna Alexander","Brianna Mora","Britt Vazquez","Broderick Gillespie","Brooke Roman","Calvin Buck","Carmela Mullins","Carol Stevenson","Carolina Russell","Carolyn Roberts","Chelsea Gilbert","Cheryl Williamson","Christa Frederick","Christian Armstrong","Christopher Stuart","Chung Krueger","Clare Whitney","Clarissa Archer","Claudio Lam","Cordell Mills","Craig Shepherd","Damien Kramer","Dane Burke","Danielle Stout","Darrel Liu","Darrin Mcneil","Darron Aguilar","Della Huber","Delores Krause","Dena Rosario","Dominick Johnston","Dona Herring","Dorothy Winters","Douglas Wiley","Doyle David","Earlene Hester","Earline Shepherd","Edwin Sparks","Eli Galvan","Elinor Kaufman","Elroy Porter","Elvin Flynn","Emmitt Porter","Erik Parsons","Ethel Forbes","Felicia Ware","Fidel Haynes","Francisco Valenzuela","Frank Hunt","Gabriela Moore","Gabrielle Patrick","Gale Fitzpatrick","Gayle Curtis","Genevieve Lucero","Gerry Oneal","Grady Ellis","Grover Escobar","Hans Patel","Horacio Black","Humberto Compton","Hunter Short","Ilene Mcguire","Imelda Lloyd","Ira Macdonald","Issac Allen","Jacques Velazquez","Janis Mullins","Janna Cowan","Javier Garner","Jayson Abbott","Jeannie Tapia","Jefferson Lee","Jeramy Keith","Jermaine Bradshaw","Jewel Lee","Jimmie Yang","Jodie Wood","John Cline","Josefina Dickerson","Josie Pineda","Judith Griffin","Julius Soto","Kelli Romero","Kerri Joseph","Kim Mccall","Lakeisha Velazquez","Latonya Logan","Lee Schmidt","Lela Atkins","Leland Robertson","Leonardo House","Leroy Mcintyre","Lesley Blevins","Lilia Berg","Lilly Stone","Lincoln Bond","Lindsay Hurst","Lionel Fuller","Lorene Hunter","Louis Kidd","Lucius Warren","Lucy Mejia","Lupe Ingram","Lynette Fuller","Lynnette Wright","Madge Copeland","Madge Tanner","Mae Sawyer","Malcolm Newman","Mamie Wong","Mandy Swanson","Marcella Everett","Marco Bright","Marcos Schaefer","Marcus Hays","Marina Walsh","Marion Savage","Marylou Bass","Marylou Mccarthy","Mathew Howard","Maurice Jacobson","Mauricio Bautista","Max Smith","Melanie Bridges","Melissa Brandt","Merlin Wu","Michel Simpson","Mickey Kennedy","Mike Sloan","Milton Walsh","Mohamed Allison","Mohammad Christensen","Nadia Macdonald","Naomi Snyder","Ned Lowe","Nettie Leonard","Olive Perkins","Ophelia Morrow","Oren Montes","Orlando Henderson","Owen Buchanan","Paul Norman","Rafael Barrett","Raymond Cochran","Reed Hooper","Reinaldo Houston","Renato Simmons","Rene Calhoun","Reva Hardin","Robert French","Robin Bender","Rodolfo Scott","Roland Blake","Roland Sullivan","Rolf Barnett","Ross Marquez","Ruthie Daugherty","Sandra Potts","Scott Stephenson","Scotty Gonzales","Sean Wiggins","Shana Gallagher","Sharron Montes","Sheryl Lindsey","Socorro Hayden","Solomon Andrade","Stacey Whitehead","Stevie Hale","Stuart Oliver","Stuart Riddle","Tammy Merritt","Theo Wiley","Theresa Murillo","Timothy Roberts","Tony Torres","Tracy Logan","Troy Hoover","Twila Rubio","Velma Everett","Vincent Mccormick","Vincenzo Stafford","Vito Clark","Waldo Spencer","Werner Lowe","Werner Shepard","Wesley Ford","Wm Cantu","Zelma Pierce"]
[null,null,null,null,null,"Paul Norman",{"$f":"IF('Resulting List'!F75=\"\",\"\",'Resulting List'!F75)","v":""},null,{"$f":"TRANSPOSE(_xlfn._xlws.SORT(_xlfn.UNIQUE(_xlfn._xlws.FILTER(Customers[Names],ISNUMBER(SEARCH(Customers[[#This Row],[Search Criteria]],Customers[Names])),\"No data.\"))))","v":"Adriana Todd"},"Albert Ramirez","Alex Rubio","Amanda Beck","Amparo Orozco","Amy Todd","Angelina Roberson","April Fox","Arden Ayala","Arnoldo Pennington","Aubrey Giles","Bette Rivers","Brianna Alexander","Brianna Mora","Britt Vazquez","Broderick Gillespie","Brooke Roman","Calvin Buck","Carmela Mullins","Carol Stevenson","Carolina Russell","Carolyn Roberts","Chelsea Gilbert","Cheryl Williamson","Christa Frederick","Christian Armstrong","Christopher Stuart","Chung Krueger","Clare Whitney","Clarissa Archer","Claudio Lam","Cordell Mills","Craig Shepherd","Damien Kramer","Dane Burke","Danielle Stout","Darrel Liu","Darrin Mcneil","Darron Aguilar","Della Huber","Delores Krause","Dena Rosario","Dominick Johnston","Dona Herring","Dorothy Winters","Douglas Wiley","Doyle David","Earlene Hester","Earline Shepherd","Edwin Sparks","Eli Galvan","Elinor Kaufman","Elroy Porter","Elvin Flynn","Emmitt Porter","Erik Parsons","Ethel Forbes","Felicia Ware","Fidel Haynes","Francisco Valenzuela","Frank Hunt","Gabriela Moore","Gabrielle Patrick","Gale Fitzpatrick","Gayle Curtis","Genevieve Lucero","Gerry Oneal","Grady Ellis","Grover Escobar","Hans Patel","Horacio Black","Humberto Compton","Hunter Short","Ilene Mcguire","Imelda Lloyd","Ira Macdonald","Issac Allen","Jacques Velazquez","Janis Mullins","Janna Cowan","Javier Garner","Jayson Abbott","Jeannie Tapia","Jefferson Lee","Jeramy Keith","Jermaine Bradshaw","Jewel Lee","Jimmie Yang","Jodie Wood","John Cline","Josefina Dickerson","Josie Pineda","Judith Griffin","Julius Soto","Kelli Romero","Kerri Joseph","Kim Mccall","Lakeisha Velazquez","Latonya Logan","Lee Schmidt","Lela Atkins","Leland Robertson","Leonardo House","Leroy Mcintyre","Lesley Blevins","Lilia Berg","Lilly Stone","Lincoln Bond","Lindsay Hurst","Lionel Fuller","Lorene Hunter","Louis Kidd","Lucius Warren","Lucy Mejia","Lupe Ingram","Lynette Fuller","Lynnette Wright","Madge Copeland","Madge Tanner","Mae Sawyer","Malcolm Newman","Mamie Wong","Mandy Swanson","Marcella Everett","Marco Bright","Marcos Schaefer","Marcus Hays","Marina Walsh","Marion Savage","Marylou Bass","Marylou Mccarthy","Mathew Howard","Maurice Jacobson","Mauricio Bautista","Max Smith","Melanie Bridges","Melissa Brandt","Merlin Wu","Michel Simpson","Mickey Kennedy","Mike Sloan","Milton Walsh","Mohamed Allison","Mohammad Christensen","Nadia Macdonald","Naomi Snyder","Ned Lowe","Nettie Leonard","Olive Perkins","Ophelia Morrow","Oren Montes","Orlando Henderson","Owen Buchanan","Paul Norman","Rafael Barrett","Raymond Cochran","Reed Hooper","Reinaldo Houston","Renato Simmons","Rene Calhoun","Reva Hardin","Robert French","Robin Bender","Rodolfo Scott","Roland Blake","Roland Sullivan","Rolf Barnett","Ross Marquez","Ruthie Daugherty","Sandra Potts","Scott Stephenson","Scotty Gonzales","Sean Wiggins","Shana Gallagher","Sharron Montes","Sheryl Lindsey","Socorro Hayden","Solomon Andrade","Stacey Whitehead","Stevie Hale","Stuart Oliver","Stuart Riddle","Tammy Merritt","Theo Wiley","Theresa Murillo","Timothy Roberts","Tony Torres","Tracy Logan","Troy Hoover","Twila Rubio","Velma Everett","Vincent Mccormick","Vincenzo Stafford","Vito Clark","Waldo Spencer","Werner Lowe","Werner Shepard","Wesley Ford","Wm Cantu","Zelma Pierce"]
[null,null,null,null,null,"Lynnette Wright",{"$f":"IF('Resulting List'!F76=\"\",\"\",'Resulting List'!F76)","v":""},null,{"$f":"TRANSPOSE(_xlfn._xlws.SORT(_xlfn.UNIQUE(_xlfn._xlws.FILTER(Customers[Names],ISNUMBER(SEARCH(Customers[[#This Row],[Search Criteria]],Customers[Names])),\"No data.\"))))","v":"Adriana Todd"},"Albert Ramirez","Alex Rubio","Amanda Beck","Amparo Orozco","Amy Todd","Angelina Roberson","April Fox","Arden Ayala","Arnoldo Pennington","Aubrey Giles","Bette Rivers","Brianna Alexander","Brianna Mora","Britt Vazquez","Broderick Gillespie","Brooke Roman","Calvin Buck","Carmela Mullins","Carol Stevenson","Carolina Russell","Carolyn Roberts","Chelsea Gilbert","Cheryl Williamson","Christa Frederick","Christian Armstrong","Christopher Stuart","Chung Krueger","Clare Whitney","Clarissa Archer","Claudio Lam","Cordell Mills","Craig Shepherd","Damien Kramer","Dane Burke","Danielle Stout","Darrel Liu","Darrin Mcneil","Darron Aguilar","Della Huber","Delores Krause","Dena Rosario","Dominick Johnston","Dona Herring","Dorothy Winters","Douglas Wiley","Doyle David","Earlene Hester","Earline Shepherd","Edwin Sparks","Eli Galvan","Elinor Kaufman","Elroy Porter","Elvin Flynn","Emmitt Porter","Erik Parsons","Ethel Forbes","Felicia Ware","Fidel Haynes","Francisco Valenzuela","Frank Hunt","Gabriela Moore","Gabrielle Patrick","Gale Fitzpatrick","Gayle Curtis","Genevieve Lucero","Gerry Oneal","Grady Ellis","Grover Escobar","Hans Patel","Horacio Black","Humberto Compton","Hunter Short","Ilene Mcguire","Imelda Lloyd","Ira Macdonald","Issac Allen","Jacques Velazquez","Janis Mullins","Janna Cowan","Javier Garner","Jayson Abbott","Jeannie Tapia","Jefferson Lee","Jeramy Keith","Jermaine Bradshaw","Jewel Lee","Jimmie Yang","Jodie Wood","John Cline","Josefina Dickerson","Josie Pineda","Judith Griffin","Julius Soto","Kelli Romero","Kerri Joseph","Kim Mccall","Lakeisha Velazquez","Latonya Logan","Lee Schmidt","Lela Atkins","Leland Robertson","Leonardo House","Leroy Mcintyre","Lesley Blevins","Lilia Berg","Lilly Stone","Lincoln Bond","Lindsay Hurst","Lionel Fuller","Lorene Hunter","Louis Kidd","Lucius Warren","Lucy Mejia","Lupe Ingram","Lynette Fuller","Lynnette Wright","Madge Copeland","Madge Tanner","Mae Sawyer","Malcolm Newman","Mamie Wong","Mandy Swanson","Marcella Everett","Marco Bright","Marcos Schaefer","Marcus Hays","Marina Walsh","Marion Savage","Marylou Bass","Marylou Mccarthy","Mathew Howard","Maurice Jacobson","Mauricio Bautista","Max Smith","Melanie Bridges","Melissa Brandt","Merlin Wu","Michel Simpson","Mickey Kennedy","Mike Sloan","Milton Walsh","Mohamed Allison","Mohammad Christensen","Nadia Macdonald","Naomi Snyder","Ned Lowe","Nettie Leonard","Olive Perkins","Ophelia Morrow","Oren Montes","Orlando Henderson","Owen Buchanan","Paul Norman","Rafael Barrett","Raymond Cochran","Reed Hooper","Reinaldo Houston","Renato Simmons","Rene Calhoun","Reva Hardin","Robert French","Robin Bender","Rodolfo Scott","Roland Blake","Roland Sullivan","Rolf Barnett","Ross Marquez","Ruthie Daugherty","Sandra Potts","Scott Stephenson","Scotty Gonzales","Sean Wiggins","Shana Gallagher","Sharron Montes","Sheryl Lindsey","Socorro Hayden","Solomon Andrade","Stacey Whitehead","Stevie Hale","Stuart Oliver","Stuart Riddle","Tammy Merritt","Theo Wiley","Theresa Murillo","Timothy Roberts","Tony Torres","Tracy Logan","Troy Hoover","Twila Rubio","Velma Everett","Vincent Mccormick","Vincenzo Stafford","Vito Clark","Waldo Spencer","Werner Lowe","Werner Shepard","Wesley Ford","Wm Cantu","Zelma Pierce"]
[null,null,null,null,null,"Louis Kidd",{"$f":"IF('Resulting List'!F77=\"\",\"\",'Resulting List'!F77)","v":""},null,{"$f":"TRANSPOSE(_xlfn._xlws.SORT(_xlfn.UNIQUE(_xlfn._xlws.FILTER(Customers[Names],ISNUMBER(SEARCH(Customers[[#This Row],[Search Criteria]],Customers[Names])),\"No data.\"))))","v":"Adriana Todd"},"Albert Ramirez","Alex Rubio","Amanda Beck","Amparo Orozco","Amy Todd","Angelina Roberson","April Fox","Arden Ayala","Arnoldo Pennington","Aubrey Giles","Bette Rivers","Brianna Alexander","Brianna Mora","Britt Vazquez","Broderick Gillespie","Brooke Roman","Calvin Buck","Carmela Mullins","Carol Stevenson","Carolina Russell","Carolyn Roberts","Chelsea Gilbert","Cheryl Williamson","Christa Frederick","Christian Armstrong","Christopher Stuart","Chung Krueger","Clare Whitney","Clarissa Archer","Claudio Lam","Cordell Mills","Craig Shepherd","Damien Kramer","Dane Burke","Danielle Stout","Darrel Liu","Darrin Mcneil","Darron Aguilar","Della Huber","Delores Krause","Dena Rosario","Dominick Johnston","Dona Herring","Dorothy Winters","Douglas Wiley","Doyle David","Earlene Hester","Earline Shepherd","Edwin Sparks","Eli Galvan","Elinor Kaufman","Elroy Porter","Elvin Flynn","Emmitt Porter","Erik Parsons","Ethel Forbes","Felicia Ware","Fidel Haynes","Francisco Valenzuela","Frank Hunt","Gabriela Moore","Gabrielle Patrick","Gale Fitzpatrick","Gayle Curtis","Genevieve Lucero","Gerry Oneal","Grady Ellis","Grover Escobar","Hans Patel","Horacio Black","Humberto Compton","Hunter Short","Ilene Mcguire","Imelda Lloyd","Ira Macdonald","Issac Allen","Jacques Velazquez","Janis Mullins","Janna Cowan","Javier Garner","Jayson Abbott","Jeannie Tapia","Jefferson Lee","Jeramy Keith","Jermaine Bradshaw","Jewel Lee","Jimmie Yang","Jodie Wood","John Cline","Josefina Dickerson","Josie Pineda","Judith Griffin","Julius Soto","Kelli Romero","Kerri Joseph","Kim Mccall","Lakeisha Velazquez","Latonya Logan","Lee Schmidt","Lela Atkins","Leland Robertson","Leonardo House","Leroy Mcintyre","Lesley Blevins","Lilia Berg","Lilly Stone","Lincoln Bond","Lindsay Hurst","Lionel Fuller","Lorene Hunter","Louis Kidd","Lucius Warren","Lucy Mejia","Lupe Ingram","Lynette Fuller","Lynnette Wright","Madge Copeland","Madge Tanner","Mae Sawyer","Malcolm Newman","Mamie Wong","Mandy Swanson","Marcella Everett","Marco Bright","Marcos Schaefer","Marcus Hays","Marina Walsh","Marion Savage","Marylou Bass","Marylou Mccarthy","Mathew Howard","Maurice Jacobson","Mauricio Bautista","Max Smith","Melanie Bridges","Melissa Brandt","Merlin Wu","Michel Simpson","Mickey Kennedy","Mike Sloan","Milton Walsh","Mohamed Allison","Mohammad Christensen","Nadia Macdonald","Naomi Snyder","Ned Lowe","Nettie Leonard","Olive Perkins","Ophelia Morrow","Oren Montes","Orlando Henderson","Owen Buchanan","Paul Norman","Rafael Barrett","Raymond Cochran","Reed Hooper","Reinaldo Houston","Renato Simmons","Rene Calhoun","Reva Hardin","Robert French","Robin Bender","Rodolfo Scott","Roland Blake","Roland Sullivan","Rolf Barnett","Ross Marquez","Ruthie Daugherty","Sandra Potts","Scott Stephenson","Scotty Gonzales","Sean Wiggins","Shana Gallagher","Sharron Montes","Sheryl Lindsey","Socorro Hayden","Solomon Andrade","Stacey Whitehead","Stevie Hale","Stuart Oliver","Stuart Riddle","Tammy Merritt","Theo Wiley","Theresa Murillo","Timothy Roberts","Tony Torres","Tracy Logan","Troy Hoover","Twila Rubio","Velma Everett","Vincent Mccormick","Vincenzo Stafford","Vito Clark","Waldo Spencer","Werner Lowe","Werner Shepard","Wesley Ford","Wm Cantu","Zelma Pierce"]
[null,null,null,null,null,"Lionel Fuller",{"$f":"IF('Resulting List'!F78=\"\",\"\",'Resulting List'!F78)","v":""},null,{"$f":"TRANSPOSE(_xlfn._xlws.SORT(_xlfn.UNIQUE(_xlfn._xlws.FILTER(Customers[Names],ISNUMBER(SEARCH(Customers[[#This Row],[Search Criteria]],Customers[Names])),\"No data.\"))))","v":"Adriana Todd"},"Albert Ramirez","Alex Rubio","Amanda Beck","Amparo Orozco","Amy Todd","Angelina Roberson","April Fox","Arden Ayala","Arnoldo Pennington","Aubrey Giles","Bette Rivers","Brianna Alexander","Brianna Mora","Britt Vazquez","Broderick Gillespie","Brooke Roman","Calvin Buck","Carmela Mullins","Carol Stevenson","Carolina Russell","Carolyn Roberts","Chelsea Gilbert","Cheryl Williamson","Christa Frederick","Christian Armstrong","Christopher Stuart","Chung Krueger","Clare Whitney","Clarissa Archer","Claudio Lam","Cordell Mills","Craig Shepherd","Damien Kramer","Dane Burke","Danielle Stout","Darrel Liu","Darrin Mcneil","Darron Aguilar","Della Huber","Delores Krause","Dena Rosario","Dominick Johnston","Dona Herring","Dorothy Winters","Douglas Wiley","Doyle David","Earlene Hester","Earline Shepherd","Edwin Sparks","Eli Galvan","Elinor Kaufman","Elroy Porter","Elvin Flynn","Emmitt Porter","Erik Parsons","Ethel Forbes","Felicia Ware","Fidel Haynes","Francisco Valenzuela","Frank Hunt","Gabriela Moore","Gabrielle Patrick","Gale Fitzpatrick","Gayle Curtis","Genevieve Lucero","Gerry Oneal","Grady Ellis","Grover Escobar","Hans Patel","Horacio Black","Humberto Compton","Hunter Short","Ilene Mcguire","Imelda Lloyd","Ira Macdonald","Issac Allen","Jacques Velazquez","Janis Mullins","Janna Cowan","Javier Garner","Jayson Abbott","Jeannie Tapia","Jefferson Lee","Jeramy Keith","Jermaine Bradshaw","Jewel Lee","Jimmie Yang","Jodie Wood","John Cline","Josefina Dickerson","Josie Pineda","Judith Griffin","Julius Soto","Kelli Romero","Kerri Joseph","Kim Mccall","Lakeisha Velazquez","Latonya Logan","Lee Schmidt","Lela Atkins","Leland Robertson","Leonardo House","Leroy Mcintyre","Lesley Blevins","Lilia Berg","Lilly Stone","Lincoln Bond","Lindsay Hurst","Lionel Fuller","Lorene Hunter","Louis Kidd","Lucius Warren","Lucy Mejia","Lupe Ingram","Lynette Fuller","Lynnette Wright","Madge Copeland","Madge Tanner","Mae Sawyer","Malcolm Newman","Mamie Wong","Mandy Swanson","Marcella Everett","Marco Bright","Marcos Schaefer","Marcus Hays","Marina Walsh","Marion Savage","Marylou Bass","Marylou Mccarthy","Mathew Howard","Maurice Jacobson","Mauricio Bautista","Max Smith","Melanie Bridges","Melissa Brandt","Merlin Wu","Michel Simpson","Mickey Kennedy","Mike Sloan","Milton Walsh","Mohamed Allison","Mohammad Christensen","Nadia Macdonald","Naomi Snyder","Ned Lowe","Nettie Leonard","Olive Perkins","Ophelia Morrow","Oren Montes","Orlando Henderson","Owen Buchanan","Paul Norman","Rafael Barrett","Raymond Cochran","Reed Hooper","Reinaldo Houston","Renato Simmons","Rene Calhoun","Reva Hardin","Robert French","Robin Bender","Rodolfo Scott","Roland Blake","Roland Sullivan","Rolf Barnett","Ross Marquez","Ruthie Daugherty","Sandra Potts","Scott Stephenson","Scotty Gonzales","Sean Wiggins","Shana Gallagher","Sharron Montes","Sheryl Lindsey","Socorro Hayden","Solomon Andrade","Stacey Whitehead","Stevie Hale","Stuart Oliver","Stuart Riddle","Tammy Merritt","Theo Wiley","Theresa Murillo","Timothy Roberts","Tony Torres","Tracy Logan","Troy Hoover","Twila Rubio","Velma Everett","Vincent Mccormick","Vincenzo Stafford","Vito Clark","Waldo Spencer","Werner Lowe","Werner Shepard","Wesley Ford","Wm Cantu","Zelma Pierce"]
[null,null,null,null,null,"Sharron Montes",{"$f":"IF('Resulting List'!F79=\"\",\"\",'Resulting List'!F79)","v":""},null,{"$f":"TRANSPOSE(_xlfn._xlws.SORT(_xlfn.UNIQUE(_xlfn._xlws.FILTER(Customers[Names],ISNUMBER(SEARCH(Customers[[#This Row],[Search Criteria]],Customers[Names])),\"No data.\"))))","v":"Adriana Todd"},"Albert Ramirez","Alex Rubio","Amanda Beck","Amparo Orozco","Amy Todd","Angelina Roberson","April Fox","Arden Ayala","Arnoldo Pennington","Aubrey Giles","Bette Rivers","Brianna Alexander","Brianna Mora","Britt Vazquez","Broderick Gillespie","Brooke Roman","Calvin Buck","Carmela Mullins","Carol Stevenson","Carolina Russell","Carolyn Roberts","Chelsea Gilbert","Cheryl Williamson","Christa Frederick","Christian Armstrong","Christopher Stuart","Chung Krueger","Clare Whitney","Clarissa Archer","Claudio Lam","Cordell Mills","Craig Shepherd","Damien Kramer","Dane Burke","Danielle Stout","Darrel Liu","Darrin Mcneil","Darron Aguilar","Della Huber","Delores Krause","Dena Rosario","Dominick Johnston","Dona Herring","Dorothy Winters","Douglas Wiley","Doyle David","Earlene Hester","Earline Shepherd","Edwin Sparks","Eli Galvan","Elinor Kaufman","Elroy Porter","Elvin Flynn","Emmitt Porter","Erik Parsons","Ethel Forbes","Felicia Ware","Fidel Haynes","Francisco Valenzuela","Frank Hunt","Gabriela Moore","Gabrielle Patrick","Gale Fitzpatrick","Gayle Curtis","Genevieve Lucero","Gerry Oneal","Grady Ellis","Grover Escobar","Hans Patel","Horacio Black","Humberto Compton","Hunter Short","Ilene Mcguire","Imelda Lloyd","Ira Macdonald","Issac Allen","Jacques Velazquez","Janis Mullins","Janna Cowan","Javier Garner","Jayson Abbott","Jeannie Tapia","Jefferson Lee","Jeramy Keith","Jermaine Bradshaw","Jewel Lee","Jimmie Yang","Jodie Wood","John Cline","Josefina Dickerson","Josie Pineda","Judith Griffin","Julius Soto","Kelli Romero","Kerri Joseph","Kim Mccall","Lakeisha Velazquez","Latonya Logan","Lee Schmidt","Lela Atkins","Leland Robertson","Leonardo House","Leroy Mcintyre","Lesley Blevins","Lilia Berg","Lilly Stone","Lincoln Bond","Lindsay Hurst","Lionel Fuller","Lorene Hunter","Louis Kidd","Lucius Warren","Lucy Mejia","Lupe Ingram","Lynette Fuller","Lynnette Wright","Madge Copeland","Madge Tanner","Mae Sawyer","Malcolm Newman","Mamie Wong","Mandy Swanson","Marcella Everett","Marco Bright","Marcos Schaefer","Marcus Hays","Marina Walsh","Marion Savage","Marylou Bass","Marylou Mccarthy","Mathew Howard","Maurice Jacobson","Mauricio Bautista","Max Smith","Melanie Bridges","Melissa Brandt","Merlin Wu","Michel Simpson","Mickey Kennedy","Mike Sloan","Milton Walsh","Mohamed Allison","Mohammad Christensen","Nadia Macdonald","Naomi Snyder","Ned Lowe","Nettie Leonard","Olive Perkins","Ophelia Morrow","Oren Montes","Orlando Henderson","Owen Buchanan","Paul Norman","Rafael Barrett","Raymond Cochran","Reed Hooper","Reinaldo Houston","Renato Simmons","Rene Calhoun","Reva Hardin","Robert French","Robin Bender","Rodolfo Scott","Roland Blake","Roland Sullivan","Rolf Barnett","Ross Marquez","Ruthie Daugherty","Sandra Potts","Scott Stephenson","Scotty Gonzales","Sean Wiggins","Shana Gallagher","Sharron Montes","Sheryl Lindsey","Socorro Hayden","Solomon Andrade","Stacey Whitehead","Stevie Hale","Stuart Oliver","Stuart Riddle","Tammy Merritt","Theo Wiley","Theresa Murillo","Timothy Roberts","Tony Torres","Tracy Logan","Troy Hoover","Twila Rubio","Velma Everett","Vincent Mccormick","Vincenzo Stafford","Vito Clark","Waldo Spencer","Werner Lowe","Werner Shepard","Wesley Ford","Wm Cantu","Zelma Pierce"]
[null,null,null,null,null,"Brianna Alexander",{"$f":"IF('Resulting List'!F80=\"\",\"\",'Resulting List'!F80)","v":""},null,{"$f":"TRANSPOSE(_xlfn._xlws.SORT(_xlfn.UNIQUE(_xlfn._xlws.FILTER(Customers[Names],ISNUMBER(SEARCH(Customers[[#This Row],[Search Criteria]],Customers[Names])),\"No data.\"))))","v":"Adriana Todd"},"Albert Ramirez","Alex Rubio","Amanda Beck","Amparo Orozco","Amy Todd","Angelina Roberson","April Fox","Arden Ayala","Arnoldo Pennington","Aubrey Giles","Bette Rivers","Brianna Alexander","Brianna Mora","Britt Vazquez","Broderick Gillespie","Brooke Roman","Calvin Buck","Carmela Mullins","Carol Stevenson","Carolina Russell","Carolyn Roberts","Chelsea Gilbert","Cheryl Williamson","Christa Frederick","Christian Armstrong","Christopher Stuart","Chung Krueger","Clare Whitney","Clarissa Archer","Claudio Lam","Cordell Mills","Craig Shepherd","Damien Kramer","Dane Burke","Danielle Stout","Darrel Liu","Darrin Mcneil","Darron Aguilar","Della Huber","Delores Krause","Dena Rosario","Dominick Johnston","Dona Herring","Dorothy Winters","Douglas Wiley","Doyle David","Earlene Hester","Earline Shepherd","Edwin Sparks","Eli Galvan","Elinor Kaufman","Elroy Porter","Elvin Flynn","Emmitt Porter","Erik Parsons","Ethel Forbes","Felicia Ware","Fidel Haynes","Francisco Valenzuela","Frank Hunt","Gabriela Moore","Gabrielle Patrick","Gale Fitzpatrick","Gayle Curtis","Genevieve Lucero","Gerry Oneal","Grady Ellis","Grover Escobar","Hans Patel","Horacio Black","Humberto Compton","Hunter Short","Ilene Mcguire","Imelda Lloyd","Ira Macdonald","Issac Allen","Jacques Velazquez","Janis Mullins","Janna Cowan","Javier Garner","Jayson Abbott","Jeannie Tapia","Jefferson Lee","Jeramy Keith","Jermaine Bradshaw","Jewel Lee","Jimmie Yang","Jodie Wood","John Cline","Josefina Dickerson","Josie Pineda","Judith Griffin","Julius Soto","Kelli Romero","Kerri Joseph","Kim Mccall","Lakeisha Velazquez","Latonya Logan","Lee Schmidt","Lela Atkins","Leland Robertson","Leonardo House","Leroy Mcintyre","Lesley Blevins","Lilia Berg","Lilly Stone","Lincoln Bond","Lindsay Hurst","Lionel Fuller","Lorene Hunter","Louis Kidd","Lucius Warren","Lucy Mejia","Lupe Ingram","Lynette Fuller","Lynnette Wright","Madge Copeland","Madge Tanner","Mae Sawyer","Malcolm Newman","Mamie Wong","Mandy Swanson","Marcella Everett","Marco Bright","Marcos Schaefer","Marcus Hays","Marina Walsh","Marion Savage","Marylou Bass","Marylou Mccarthy","Mathew Howard","Maurice Jacobson","Mauricio Bautista","Max Smith","Melanie Bridges","Melissa Brandt","Merlin Wu","Michel Simpson","Mickey Kennedy","Mike Sloan","Milton Walsh","Mohamed Allison","Mohammad Christensen","Nadia Macdonald","Naomi Snyder","Ned Lowe","Nettie Leonard","Olive Perkins","Ophelia Morrow","Oren Montes","Orlando Henderson","Owen Buchanan","Paul Norman","Rafael Barrett","Raymond Cochran","Reed Hooper","Reinaldo Houston","Renato Simmons","Rene Calhoun","Reva Hardin","Robert French","Robin Bender","Rodolfo Scott","Roland Blake","Roland Sullivan","Rolf Barnett","Ross Marquez","Ruthie Daugherty","Sandra Potts","Scott Stephenson","Scotty Gonzales","Sean Wiggins","Shana Gallagher","Sharron Montes","Sheryl Lindsey","Socorro Hayden","Solomon Andrade","Stacey Whitehead","Stevie Hale","Stuart Oliver","Stuart Riddle","Tammy Merritt","Theo Wiley","Theresa Murillo","Timothy Roberts","Tony Torres","Tracy Logan","Troy Hoover","Twila Rubio","Velma Everett","Vincent Mccormick","Vincenzo Stafford","Vito Clark","Waldo Spencer","Werner Lowe","Werner Shepard","Wesley Ford","Wm Cantu","Zelma Pierce"]
[null,null,null,null,null,"Jewel Lee",{"$f":"IF('Resulting List'!F81=\"\",\"\",'Resulting List'!F81)","v":""},null,{"$f":"TRANSPOSE(_xlfn._xlws.SORT(_xlfn.UNIQUE(_xlfn._xlws.FILTER(Customers[Names],ISNUMBER(SEARCH(Customers[[#This Row],[Search Criteria]],Customers[Names])),\"No data.\"))))","v":"Adriana Todd"},"Albert Ramirez","Alex Rubio","Amanda Beck","Amparo Orozco","Amy Todd","Angelina Roberson","April Fox","Arden Ayala","Arnoldo Pennington","Aubrey Giles","Bette Rivers","Brianna Alexander","Brianna Mora","Britt Vazquez","Broderick Gillespie","Brooke Roman","Calvin Buck","Carmela Mullins","Carol Stevenson","Carolina Russell","Carolyn Roberts","Chelsea Gilbert","Cheryl Williamson","Christa Frederick","Christian Armstrong","Christopher Stuart","Chung Krueger","Clare Whitney","Clarissa Archer","Claudio Lam","Cordell Mills","Craig Shepherd","Damien Kramer","Dane Burke","Danielle Stout","Darrel Liu","Darrin Mcneil","Darron Aguilar","Della Huber","Delores Krause","Dena Rosario","Dominick Johnston","Dona Herring","Dorothy Winters","Douglas Wiley","Doyle David","Earlene Hester","Earline Shepherd","Edwin Sparks","Eli Galvan","Elinor Kaufman","Elroy Porter","Elvin Flynn","Emmitt Porter","Erik Parsons","Ethel Forbes","Felicia Ware","Fidel Haynes","Francisco Valenzuela","Frank Hunt","Gabriela Moore","Gabrielle Patrick","Gale Fitzpatrick","Gayle Curtis","Genevieve Lucero","Gerry Oneal","Grady Ellis","Grover Escobar","Hans Patel","Horacio Black","Humberto Compton","Hunter Short","Ilene Mcguire","Imelda Lloyd","Ira Macdonald","Issac Allen","Jacques Velazquez","Janis Mullins","Janna Cowan","Javier Garner","Jayson Abbott","Jeannie Tapia","Jefferson Lee","Jeramy Keith","Jermaine Bradshaw","Jewel Lee","Jimmie Yang","Jodie Wood","John Cline","Josefina Dickerson","Josie Pineda","Judith Griffin","Julius Soto","Kelli Romero","Kerri Joseph","Kim Mccall","Lakeisha Velazquez","Latonya Logan","Lee Schmidt","Lela Atkins","Leland Robertson","Leonardo House","Leroy Mcintyre","Lesley Blevins","Lilia Berg","Lilly Stone","Lincoln Bond","Lindsay Hurst","Lionel Fuller","Lorene Hunter","Louis Kidd","Lucius Warren","Lucy Mejia","Lupe Ingram","Lynette Fuller","Lynnette Wright","Madge Copeland","Madge Tanner","Mae Sawyer","Malcolm Newman","Mamie Wong","Mandy Swanson","Marcella Everett","Marco Bright","Marcos Schaefer","Marcus Hays","Marina Walsh","Marion Savage","Marylou Bass","Marylou Mccarthy","Mathew Howard","Maurice Jacobson","Mauricio Bautista","Max Smith","Melanie Bridges","Melissa Brandt","Merlin Wu","Michel Simpson","Mickey Kennedy","Mike Sloan","Milton Walsh","Mohamed Allison","Mohammad Christensen","Nadia Macdonald","Naomi Snyder","Ned Lowe","Nettie Leonard","Olive Perkins","Ophelia Morrow","Oren Montes","Orlando Henderson","Owen Buchanan","Paul Norman","Rafael Barrett","Raymond Cochran","Reed Hooper","Reinaldo Houston","Renato Simmons","Rene Calhoun","Reva Hardin","Robert French","Robin Bender","Rodolfo Scott","Roland Blake","Roland Sullivan","Rolf Barnett","Ross Marquez","Ruthie Daugherty","Sandra Potts","Scott Stephenson","Scotty Gonzales","Sean Wiggins","Shana Gallagher","Sharron Montes","Sheryl Lindsey","Socorro Hayden","Solomon Andrade","Stacey Whitehead","Stevie Hale","Stuart Oliver","Stuart Riddle","Tammy Merritt","Theo Wiley","Theresa Murillo","Timothy Roberts","Tony Torres","Tracy Logan","Troy Hoover","Twila Rubio","Velma Everett","Vincent Mccormick","Vincenzo Stafford","Vito Clark","Waldo Spencer","Werner Lowe","Werner Shepard","Wesley Ford","Wm Cantu","Zelma Pierce"]
[null,null,null,null,null,"Della Huber",{"$f":"IF('Resulting List'!F82=\"\",\"\",'Resulting List'!F82)","v":""},null,{"$f":"TRANSPOSE(_xlfn._xlws.SORT(_xlfn.UNIQUE(_xlfn._xlws.FILTER(Customers[Names],ISNUMBER(SEARCH(Customers[[#This Row],[Search Criteria]],Customers[Names])),\"No data.\"))))","v":"Adriana Todd"},"Albert Ramirez","Alex Rubio","Amanda Beck","Amparo Orozco","Amy Todd","Angelina Roberson","April Fox","Arden Ayala","Arnoldo Pennington","Aubrey Giles","Bette Rivers","Brianna Alexander","Brianna Mora","Britt Vazquez","Broderick Gillespie","Brooke Roman","Calvin Buck","Carmela Mullins","Carol Stevenson","Carolina Russell","Carolyn Roberts","Chelsea Gilbert","Cheryl Williamson","Christa Frederick","Christian Armstrong","Christopher Stuart","Chung Krueger","Clare Whitney","Clarissa Archer","Claudio Lam","Cordell Mills","Craig Shepherd","Damien Kramer","Dane Burke","Danielle Stout","Darrel Liu","Darrin Mcneil","Darron Aguilar","Della Huber","Delores Krause","Dena Rosario","Dominick Johnston","Dona Herring","Dorothy Winters","Douglas Wiley","Doyle David","Earlene Hester","Earline Shepherd","Edwin Sparks","Eli Galvan","Elinor Kaufman","Elroy Porter","Elvin Flynn","Emmitt Porter","Erik Parsons","Ethel Forbes","Felicia Ware","Fidel Haynes","Francisco Valenzuela","Frank Hunt","Gabriela Moore","Gabrielle Patrick","Gale Fitzpatrick","Gayle Curtis","Genevieve Lucero","Gerry Oneal","Grady Ellis","Grover Escobar","Hans Patel","Horacio Black","Humberto Compton","Hunter Short","Ilene Mcguire","Imelda Lloyd","Ira Macdonald","Issac Allen","Jacques Velazquez","Janis Mullins","Janna Cowan","Javier Garner","Jayson Abbott","Jeannie Tapia","Jefferson Lee","Jeramy Keith","Jermaine Bradshaw","Jewel Lee","Jimmie Yang","Jodie Wood","John Cline","Josefina Dickerson","Josie Pineda","Judith Griffin","Julius Soto","Kelli Romero","Kerri Joseph","Kim Mccall","Lakeisha Velazquez","Latonya Logan","Lee Schmidt","Lela Atkins","Leland Robertson","Leonardo House","Leroy Mcintyre","Lesley Blevins","Lilia Berg","Lilly Stone","Lincoln Bond","Lindsay Hurst","Lionel Fuller","Lorene Hunter","Louis Kidd","Lucius Warren","Lucy Mejia","Lupe Ingram","Lynette Fuller","Lynnette Wright","Madge Copeland","Madge Tanner","Mae Sawyer","Malcolm Newman","Mamie Wong","Mandy Swanson","Marcella Everett","Marco Bright","Marcos Schaefer","Marcus Hays","Marina Walsh","Marion Savage","Marylou Bass","Marylou Mccarthy","Mathew Howard","Maurice Jacobson","Mauricio Bautista","Max Smith","Melanie Bridges","Melissa Brandt","Merlin Wu","Michel Simpson","Mickey Kennedy","Mike Sloan","Milton Walsh","Mohamed Allison","Mohammad Christensen","Nadia Macdonald","Naomi Snyder","Ned Lowe","Nettie Leonard","Olive Perkins","Ophelia Morrow","Oren Montes","Orlando Henderson","Owen Buchanan","Paul Norman","Rafael Barrett","Raymond Cochran","Reed Hooper","Reinaldo Houston","Renato Simmons","Rene Calhoun","Reva Hardin","Robert French","Robin Bender","Rodolfo Scott","Roland Blake","Roland Sullivan","Rolf Barnett","Ross Marquez","Ruthie Daugherty","Sandra Potts","Scott Stephenson","Scotty Gonzales","Sean Wiggins","Shana Gallagher","Sharron Montes","Sheryl Lindsey","Socorro Hayden","Solomon Andrade","Stacey Whitehead","Stevie Hale","Stuart Oliver","Stuart Riddle","Tammy Merritt","Theo Wiley","Theresa Murillo","Timothy Roberts","Tony Torres","Tracy Logan","Troy Hoover","Twila Rubio","Velma Everett","Vincent Mccormick","Vincenzo Stafford","Vito Clark","Waldo Spencer","Werner Lowe","Werner Shepard","Wesley Ford","Wm Cantu","Zelma Pierce"]
[null,null,null,null,null,"Velma Everett",{"$f":"IF('Resulting List'!F83=\"\",\"\",'Resulting List'!F83)","v":""},null,{"$f":"TRANSPOSE(_xlfn._xlws.SORT(_xlfn.UNIQUE(_xlfn._xlws.FILTER(Customers[Names],ISNUMBER(SEARCH(Customers[[#This Row],[Search Criteria]],Customers[Names])),\"No data.\"))))","v":"Adriana Todd"},"Albert Ramirez","Alex Rubio","Amanda Beck","Amparo Orozco","Amy Todd","Angelina Roberson","April Fox","Arden Ayala","Arnoldo Pennington","Aubrey Giles","Bette Rivers","Brianna Alexander","Brianna Mora","Britt Vazquez","Broderick Gillespie","Brooke Roman","Calvin Buck","Carmela Mullins","Carol Stevenson","Carolina Russell","Carolyn Roberts","Chelsea Gilbert","Cheryl Williamson","Christa Frederick","Christian Armstrong","Christopher Stuart","Chung Krueger","Clare Whitney","Clarissa Archer","Claudio Lam","Cordell Mills","Craig Shepherd","Damien Kramer","Dane Burke","Danielle Stout","Darrel Liu","Darrin Mcneil","Darron Aguilar","Della Huber","Delores Krause","Dena Rosario","Dominick Johnston","Dona Herring","Dorothy Winters","Douglas Wiley","Doyle David","Earlene Hester","Earline Shepherd","Edwin Sparks","Eli Galvan","Elinor Kaufman","Elroy Porter","Elvin Flynn","Emmitt Porter","Erik Parsons","Ethel Forbes","Felicia Ware","Fidel Haynes","Francisco Valenzuela","Frank Hunt","Gabriela Moore","Gabrielle Patrick","Gale Fitzpatrick","Gayle Curtis","Genevieve Lucero","Gerry Oneal","Grady Ellis","Grover Escobar","Hans Patel","Horacio Black","Humberto Compton","Hunter Short","Ilene Mcguire","Imelda Lloyd","Ira Macdonald","Issac Allen","Jacques Velazquez","Janis Mullins","Janna Cowan","Javier Garner","Jayson Abbott","Jeannie Tapia","Jefferson Lee","Jeramy Keith","Jermaine Bradshaw","Jewel Lee","Jimmie Yang","Jodie Wood","John Cline","Josefina Dickerson","Josie Pineda","Judith Griffin","Julius Soto","Kelli Romero","Kerri Joseph","Kim Mccall","Lakeisha Velazquez","Latonya Logan","Lee Schmidt","Lela Atkins","Leland Robertson","Leonardo House","Leroy Mcintyre","Lesley Blevins","Lilia Berg","Lilly Stone","Lincoln Bond","Lindsay Hurst","Lionel Fuller","Lorene Hunter","Louis Kidd","Lucius Warren","Lucy Mejia","Lupe Ingram","Lynette Fuller","Lynnette Wright","Madge Copeland","Madge Tanner","Mae Sawyer","Malcolm Newman","Mamie Wong","Mandy Swanson","Marcella Everett","Marco Bright","Marcos Schaefer","Marcus Hays","Marina Walsh","Marion Savage","Marylou Bass","Marylou Mccarthy","Mathew Howard","Maurice Jacobson","Mauricio Bautista","Max Smith","Melanie Bridges","Melissa Brandt","Merlin Wu","Michel Simpson","Mickey Kennedy","Mike Sloan","Milton Walsh","Mohamed Allison","Mohammad Christensen","Nadia Macdonald","Naomi Snyder","Ned Lowe","Nettie Leonard","Olive Perkins","Ophelia Morrow","Oren Montes","Orlando Henderson","Owen Buchanan","Paul Norman","Rafael Barrett","Raymond Cochran","Reed Hooper","Reinaldo Houston","Renato Simmons","Rene Calhoun","Reva Hardin","Robert French","Robin Bender","Rodolfo Scott","Roland Blake","Roland Sullivan","Rolf Barnett","Ross Marquez","Ruthie Daugherty","Sandra Potts","Scott Stephenson","Scotty Gonzales","Sean Wiggins","Shana Gallagher","Sharron Montes","Sheryl Lindsey","Socorro Hayden","Solomon Andrade","Stacey Whitehead","Stevie Hale","Stuart Oliver","Stuart Riddle","Tammy Merritt","Theo Wiley","Theresa Murillo","Timothy Roberts","Tony Torres","Tracy Logan","Troy Hoover","Twila Rubio","Velma Everett","Vincent Mccormick","Vincenzo Stafford","Vito Clark","Waldo Spencer","Werner Lowe","Werner Shepard","Wesley Ford","Wm Cantu","Zelma Pierce"]
[null,null,null,null,null,"Fidel Haynes",{"$f":"IF('Resulting List'!F84=\"\",\"\",'Resulting List'!F84)","v":""},null,{"$f":"TRANSPOSE(_xlfn._xlws.SORT(_xlfn.UNIQUE(_xlfn._xlws.FILTER(Customers[Names],ISNUMBER(SEARCH(Customers[[#This Row],[Search Criteria]],Customers[Names])),\"No data.\"))))","v":"Adriana Todd"},"Albert Ramirez","Alex Rubio","Amanda Beck","Amparo Orozco","Amy Todd","Angelina Roberson","April Fox","Arden Ayala","Arnoldo Pennington","Aubrey Giles","Bette Rivers","Brianna Alexander","Brianna Mora","Britt Vazquez","Broderick Gillespie","Brooke Roman","Calvin Buck","Carmela Mullins","Carol Stevenson","Carolina Russell","Carolyn Roberts","Chelsea Gilbert","Cheryl Williamson","Christa Frederick","Christian Armstrong","Christopher Stuart","Chung Krueger","Clare Whitney","Clarissa Archer","Claudio Lam","Cordell Mills","Craig Shepherd","Damien Kramer","Dane Burke","Danielle Stout","Darrel Liu","Darrin Mcneil","Darron Aguilar","Della Huber","Delores Krause","Dena Rosario","Dominick Johnston","Dona Herring","Dorothy Winters","Douglas Wiley","Doyle David","Earlene Hester","Earline Shepherd","Edwin Sparks","Eli Galvan","Elinor Kaufman","Elroy Porter","Elvin Flynn","Emmitt Porter","Erik Parsons","Ethel Forbes","Felicia Ware","Fidel Haynes","Francisco Valenzuela","Frank Hunt","Gabriela Moore","Gabrielle Patrick","Gale Fitzpatrick","Gayle Curtis","Genevieve Lucero","Gerry Oneal","Grady Ellis","Grover Escobar","Hans Patel","Horacio Black","Humberto Compton","Hunter Short","Ilene Mcguire","Imelda Lloyd","Ira Macdonald","Issac Allen","Jacques Velazquez","Janis Mullins","Janna Cowan","Javier Garner","Jayson Abbott","Jeannie Tapia","Jefferson Lee","Jeramy Keith","Jermaine Bradshaw","Jewel Lee","Jimmie Yang","Jodie Wood","John Cline","Josefina Dickerson","Josie Pineda","Judith Griffin","Julius Soto","Kelli Romero","Kerri Joseph","Kim Mccall","Lakeisha Velazquez","Latonya Logan","Lee Schmidt","Lela Atkins","Leland Robertson","Leonardo House","Leroy Mcintyre","Lesley Blevins","Lilia Berg","Lilly Stone","Lincoln Bond","Lindsay Hurst","Lionel Fuller","Lorene Hunter","Louis Kidd","Lucius Warren","Lucy Mejia","Lupe Ingram","Lynette Fuller","Lynnette Wright","Madge Copeland","Madge Tanner","Mae Sawyer","Malcolm Newman","Mamie Wong","Mandy Swanson","Marcella Everett","Marco Bright","Marcos Schaefer","Marcus Hays","Marina Walsh","Marion Savage","Marylou Bass","Marylou Mccarthy","Mathew Howard","Maurice Jacobson","Mauricio Bautista","Max Smith","Melanie Bridges","Melissa Brandt","Merlin Wu","Michel Simpson","Mickey Kennedy","Mike Sloan","Milton Walsh","Mohamed Allison","Mohammad Christensen","Nadia Macdonald","Naomi Snyder","Ned Lowe","Nettie Leonard","Olive Perkins","Ophelia Morrow","Oren Montes","Orlando Henderson","Owen Buchanan","Paul Norman","Rafael Barrett","Raymond Cochran","Reed Hooper","Reinaldo Houston","Renato Simmons","Rene Calhoun","Reva Hardin","Robert French","Robin Bender","Rodolfo Scott","Roland Blake","Roland Sullivan","Rolf Barnett","Ross Marquez","Ruthie Daugherty","Sandra Potts","Scott Stephenson","Scotty Gonzales","Sean Wiggins","Shana Gallagher","Sharron Montes","Sheryl Lindsey","Socorro Hayden","Solomon Andrade","Stacey Whitehead","Stevie Hale","Stuart Oliver","Stuart Riddle","Tammy Merritt","Theo Wiley","Theresa Murillo","Timothy Roberts","Tony Torres","Tracy Logan","Troy Hoover","Twila Rubio","Velma Everett","Vincent Mccormick","Vincenzo Stafford","Vito Clark","Waldo Spencer","Werner Lowe","Werner Shepard","Wesley Ford","Wm Cantu","Zelma Pierce"]
[null,null,null,null,null,"John Cline",{"$f":"IF('Resulting List'!F85=\"\",\"\",'Resulting List'!F85)","v":""},null,{"$f":"TRANSPOSE(_xlfn._xlws.SORT(_xlfn.UNIQUE(_xlfn._xlws.FILTER(Customers[Names],ISNUMBER(SEARCH(Customers[[#This Row],[Search Criteria]],Customers[Names])),\"No data.\"))))","v":"Adriana Todd"},"Albert Ramirez","Alex Rubio","Amanda Beck","Amparo Orozco","Amy Todd","Angelina Roberson","April Fox","Arden Ayala","Arnoldo Pennington","Aubrey Giles","Bette Rivers","Brianna Alexander","Brianna Mora","Britt Vazquez","Broderick Gillespie","Brooke Roman","Calvin Buck","Carmela Mullins","Carol Stevenson","Carolina Russell","Carolyn Roberts","Chelsea Gilbert","Cheryl Williamson","Christa Frederick","Christian Armstrong","Christopher Stuart","Chung Krueger","Clare Whitney","Clarissa Archer","Claudio Lam","Cordell Mills","Craig Shepherd","Damien Kramer","Dane Burke","Danielle Stout","Darrel Liu","Darrin Mcneil","Darron Aguilar","Della Huber","Delores Krause","Dena Rosario","Dominick Johnston","Dona Herring","Dorothy Winters","Douglas Wiley","Doyle David","Earlene Hester","Earline Shepherd","Edwin Sparks","Eli Galvan","Elinor Kaufman","Elroy Porter","Elvin Flynn","Emmitt Porter","Erik Parsons","Ethel Forbes","Felicia Ware","Fidel Haynes","Francisco Valenzuela","Frank Hunt","Gabriela Moore","Gabrielle Patrick","Gale Fitzpatrick","Gayle Curtis","Genevieve Lucero","Gerry Oneal","Grady Ellis","Grover Escobar","Hans Patel","Horacio Black","Humberto Compton","Hunter Short","Ilene Mcguire","Imelda Lloyd","Ira Macdonald","Issac Allen","Jacques Velazquez","Janis Mullins","Janna Cowan","Javier Garner","Jayson Abbott","Jeannie Tapia","Jefferson Lee","Jeramy Keith","Jermaine Bradshaw","Jewel Lee","Jimmie Yang","Jodie Wood","John Cline","Josefina Dickerson","Josie Pineda","Judith Griffin","Julius Soto","Kelli Romero","Kerri Joseph","Kim Mccall","Lakeisha Velazquez","Latonya Logan","Lee Schmidt","Lela Atkins","Leland Robertson","Leonardo House","Leroy Mcintyre","Lesley Blevins","Lilia Berg","Lilly Stone","Lincoln Bond","Lindsay Hurst","Lionel Fuller","Lorene Hunter","Louis Kidd","Lucius Warren","Lucy Mejia","Lupe Ingram","Lynette Fuller","Lynnette Wright","Madge Copeland","Madge Tanner","Mae Sawyer","Malcolm Newman","Mamie Wong","Mandy Swanson","Marcella Everett","Marco Bright","Marcos Schaefer","Marcus Hays","Marina Walsh","Marion Savage","Marylou Bass","Marylou Mccarthy","Mathew Howard","Maurice Jacobson","Mauricio Bautista","Max Smith","Melanie Bridges","Melissa Brandt","Merlin Wu","Michel Simpson","Mickey Kennedy","Mike Sloan","Milton Walsh","Mohamed Allison","Mohammad Christensen","Nadia Macdonald","Naomi Snyder","Ned Lowe","Nettie Leonard","Olive Perkins","Ophelia Morrow","Oren Montes","Orlando Henderson","Owen Buchanan","Paul Norman","Rafael Barrett","Raymond Cochran","Reed Hooper","Reinaldo Houston","Renato Simmons","Rene Calhoun","Reva Hardin","Robert French","Robin Bender","Rodolfo Scott","Roland Blake","Roland Sullivan","Rolf Barnett","Ross Marquez","Ruthie Daugherty","Sandra Potts","Scott Stephenson","Scotty Gonzales","Sean Wiggins","Shana Gallagher","Sharron Montes","Sheryl Lindsey","Socorro Hayden","Solomon Andrade","Stacey Whitehead","Stevie Hale","Stuart Oliver","Stuart Riddle","Tammy Merritt","Theo Wiley","Theresa Murillo","Timothy Roberts","Tony Torres","Tracy Logan","Troy Hoover","Twila Rubio","Velma Everett","Vincent Mccormick","Vincenzo Stafford","Vito Clark","Waldo Spencer","Werner Lowe","Werner Shepard","Wesley Ford","Wm Cantu","Zelma Pierce"]
[null,null,null,null,null,"Gayle Curtis",{"$f":"IF('Resulting List'!F86=\"\",\"\",'Resulting List'!F86)","v":""},null,{"$f":"TRANSPOSE(_xlfn._xlws.SORT(_xlfn.UNIQUE(_xlfn._xlws.FILTER(Customers[Names],ISNUMBER(SEARCH(Customers[[#This Row],[Search Criteria]],Customers[Names])),\"No data.\"))))","v":"Adriana Todd"},"Albert Ramirez","Alex Rubio","Amanda Beck","Amparo Orozco","Amy Todd","Angelina Roberson","April Fox","Arden Ayala","Arnoldo Pennington","Aubrey Giles","Bette Rivers","Brianna Alexander","Brianna Mora","Britt Vazquez","Broderick Gillespie","Brooke Roman","Calvin Buck","Carmela Mullins","Carol Stevenson","Carolina Russell","Carolyn Roberts","Chelsea Gilbert","Cheryl Williamson","Christa Frederick","Christian Armstrong","Christopher Stuart","Chung Krueger","Clare Whitney","Clarissa Archer","Claudio Lam","Cordell Mills","Craig Shepherd","Damien Kramer","Dane Burke","Danielle Stout","Darrel Liu","Darrin Mcneil","Darron Aguilar","Della Huber","Delores Krause","Dena Rosario","Dominick Johnston","Dona Herring","Dorothy Winters","Douglas Wiley","Doyle David","Earlene Hester","Earline Shepherd","Edwin Sparks","Eli Galvan","Elinor Kaufman","Elroy Porter","Elvin Flynn","Emmitt Porter","Erik Parsons","Ethel Forbes","Felicia Ware","Fidel Haynes","Francisco Valenzuela","Frank Hunt","Gabriela Moore","Gabrielle Patrick","Gale Fitzpatrick","Gayle Curtis","Genevieve Lucero","Gerry Oneal","Grady Ellis","Grover Escobar","Hans Patel","Horacio Black","Humberto Compton","Hunter Short","Ilene Mcguire","Imelda Lloyd","Ira Macdonald","Issac Allen","Jacques Velazquez","Janis Mullins","Janna Cowan","Javier Garner","Jayson Abbott","Jeannie Tapia","Jefferson Lee","Jeramy Keith","Jermaine Bradshaw","Jewel Lee","Jimmie Yang","Jodie Wood","John Cline","Josefina Dickerson","Josie Pineda","Judith Griffin","Julius Soto","Kelli Romero","Kerri Joseph","Kim Mccall","Lakeisha Velazquez","Latonya Logan","Lee Schmidt","Lela Atkins","Leland Robertson","Leonardo House","Leroy Mcintyre","Lesley Blevins","Lilia Berg","Lilly Stone","Lincoln Bond","Lindsay Hurst","Lionel Fuller","Lorene Hunter","Louis Kidd","Lucius Warren","Lucy Mejia","Lupe Ingram","Lynette Fuller","Lynnette Wright","Madge Copeland","Madge Tanner","Mae Sawyer","Malcolm Newman","Mamie Wong","Mandy Swanson","Marcella Everett","Marco Bright","Marcos Schaefer","Marcus Hays","Marina Walsh","Marion Savage","Marylou Bass","Marylou Mccarthy","Mathew Howard","Maurice Jacobson","Mauricio Bautista","Max Smith","Melanie Bridges","Melissa Brandt","Merlin Wu","Michel Simpson","Mickey Kennedy","Mike Sloan","Milton Walsh","Mohamed Allison","Mohammad Christensen","Nadia Macdonald","Naomi Snyder","Ned Lowe","Nettie Leonard","Olive Perkins","Ophelia Morrow","Oren Montes","Orlando Henderson","Owen Buchanan","Paul Norman","Rafael Barrett","Raymond Cochran","Reed Hooper","Reinaldo Houston","Renato Simmons","Rene Calhoun","Reva Hardin","Robert French","Robin Bender","Rodolfo Scott","Roland Blake","Roland Sullivan","Rolf Barnett","Ross Marquez","Ruthie Daugherty","Sandra Potts","Scott Stephenson","Scotty Gonzales","Sean Wiggins","Shana Gallagher","Sharron Montes","Sheryl Lindsey","Socorro Hayden","Solomon Andrade","Stacey Whitehead","Stevie Hale","Stuart Oliver","Stuart Riddle","Tammy Merritt","Theo Wiley","Theresa Murillo","Timothy Roberts","Tony Torres","Tracy Logan","Troy Hoover","Twila Rubio","Velma Everett","Vincent Mccormick","Vincenzo Stafford","Vito Clark","Waldo Spencer","Werner Lowe","Werner Shepard","Wesley Ford","Wm Cantu","Zelma Pierce"]
[null,null,null,null,null,"Roland Sullivan",{"$f":"IF('Resulting List'!F87=\"\",\"\",'Resulting List'!F87)","v":""},null,{"$f":"TRANSPOSE(_xlfn._xlws.SORT(_xlfn.UNIQUE(_xlfn._xlws.FILTER(Customers[Names],ISNUMBER(SEARCH(Customers[[#This Row],[Search Criteria]],Customers[Names])),\"No data.\"))))","v":"Adriana Todd"},"Albert Ramirez","Alex Rubio","Amanda Beck","Amparo Orozco","Amy Todd","Angelina Roberson","April Fox","Arden Ayala","Arnoldo Pennington","Aubrey Giles","Bette Rivers","Brianna Alexander","Brianna Mora","Britt Vazquez","Broderick Gillespie","Brooke Roman","Calvin Buck","Carmela Mullins","Carol Stevenson","Carolina Russell","Carolyn Roberts","Chelsea Gilbert","Cheryl Williamson","Christa Frederick","Christian Armstrong","Christopher Stuart","Chung Krueger","Clare Whitney","Clarissa Archer","Claudio Lam","Cordell Mills","Craig Shepherd","Damien Kramer","Dane Burke","Danielle Stout","Darrel Liu","Darrin Mcneil","Darron Aguilar","Della Huber","Delores Krause","Dena Rosario","Dominick Johnston","Dona Herring","Dorothy Winters","Douglas Wiley","Doyle David","Earlene Hester","Earline Shepherd","Edwin Sparks","Eli Galvan","Elinor Kaufman","Elroy Porter","Elvin Flynn","Emmitt Porter","Erik Parsons","Ethel Forbes","Felicia Ware","Fidel Haynes","Francisco Valenzuela","Frank Hunt","Gabriela Moore","Gabrielle Patrick","Gale Fitzpatrick","Gayle Curtis","Genevieve Lucero","Gerry Oneal","Grady Ellis","Grover Escobar","Hans Patel","Horacio Black","Humberto Compton","Hunter Short","Ilene Mcguire","Imelda Lloyd","Ira Macdonald","Issac Allen","Jacques Velazquez","Janis Mullins","Janna Cowan","Javier Garner","Jayson Abbott","Jeannie Tapia","Jefferson Lee","Jeramy Keith","Jermaine Bradshaw","Jewel Lee","Jimmie Yang","Jodie Wood","John Cline","Josefina Dickerson","Josie Pineda","Judith Griffin","Julius Soto","Kelli Romero","Kerri Joseph","Kim Mccall","Lakeisha Velazquez","Latonya Logan","Lee Schmidt","Lela Atkins","Leland Robertson","Leonardo House","Leroy Mcintyre","Lesley Blevins","Lilia Berg","Lilly Stone","Lincoln Bond","Lindsay Hurst","Lionel Fuller","Lorene Hunter","Louis Kidd","Lucius Warren","Lucy Mejia","Lupe Ingram","Lynette Fuller","Lynnette Wright","Madge Copeland","Madge Tanner","Mae Sawyer","Malcolm Newman","Mamie Wong","Mandy Swanson","Marcella Everett","Marco Bright","Marcos Schaefer","Marcus Hays","Marina Walsh","Marion Savage","Marylou Bass","Marylou Mccarthy","Mathew Howard","Maurice Jacobson","Mauricio Bautista","Max Smith","Melanie Bridges","Melissa Brandt","Merlin Wu","Michel Simpson","Mickey Kennedy","Mike Sloan","Milton Walsh","Mohamed Allison","Mohammad Christensen","Nadia Macdonald","Naomi Snyder","Ned Lowe","Nettie Leonard","Olive Perkins","Ophelia Morrow","Oren Montes","Orlando Henderson","Owen Buchanan","Paul Norman","Rafael Barrett","Raymond Cochran","Reed Hooper","Reinaldo Houston","Renato Simmons","Rene Calhoun","Reva Hardin","Robert French","Robin Bender","Rodolfo Scott","Roland Blake","Roland Sullivan","Rolf Barnett","Ross Marquez","Ruthie Daugherty","Sandra Potts","Scott Stephenson","Scotty Gonzales","Sean Wiggins","Shana Gallagher","Sharron Montes","Sheryl Lindsey","Socorro Hayden","Solomon Andrade","Stacey Whitehead","Stevie Hale","Stuart Oliver","Stuart Riddle","Tammy Merritt","Theo Wiley","Theresa Murillo","Timothy Roberts","Tony Torres","Tracy Logan","Troy Hoover","Twila Rubio","Velma Everett","Vincent Mccormick","Vincenzo Stafford","Vito Clark","Waldo Spencer","Werner Lowe","Werner Shepard","Wesley Ford","Wm Cantu","Zelma Pierce"]
[null,null,null,null,null,"Jimmie Yang",{"$f":"IF('Resulting List'!F88=\"\",\"\",'Resulting List'!F88)","v":""},null,{"$f":"TRANSPOSE(_xlfn._xlws.SORT(_xlfn.UNIQUE(_xlfn._xlws.FILTER(Customers[Names],ISNUMBER(SEARCH(Customers[[#This Row],[Search Criteria]],Customers[Names])),\"No data.\"))))","v":"Adriana Todd"},"Albert Ramirez","Alex Rubio","Amanda Beck","Amparo Orozco","Amy Todd","Angelina Roberson","April Fox","Arden Ayala","Arnoldo Pennington","Aubrey Giles","Bette Rivers","Brianna Alexander","Brianna Mora","Britt Vazquez","Broderick Gillespie","Brooke Roman","Calvin Buck","Carmela Mullins","Carol Stevenson","Carolina Russell","Carolyn Roberts","Chelsea Gilbert","Cheryl Williamson","Christa Frederick","Christian Armstrong","Christopher Stuart","Chung Krueger","Clare Whitney","Clarissa Archer","Claudio Lam","Cordell Mills","Craig Shepherd","Damien Kramer","Dane Burke","Danielle Stout","Darrel Liu","Darrin Mcneil","Darron Aguilar","Della Huber","Delores Krause","Dena Rosario","Dominick Johnston","Dona Herring","Dorothy Winters","Douglas Wiley","Doyle David","Earlene Hester","Earline Shepherd","Edwin Sparks","Eli Galvan","Elinor Kaufman","Elroy Porter","Elvin Flynn","Emmitt Porter","Erik Parsons","Ethel Forbes","Felicia Ware","Fidel Haynes","Francisco Valenzuela","Frank Hunt","Gabriela Moore","Gabrielle Patrick","Gale Fitzpatrick","Gayle Curtis","Genevieve Lucero","Gerry Oneal","Grady Ellis","Grover Escobar","Hans Patel","Horacio Black","Humberto Compton","Hunter Short","Ilene Mcguire","Imelda Lloyd","Ira Macdonald","Issac Allen","Jacques Velazquez","Janis Mullins","Janna Cowan","Javier Garner","Jayson Abbott","Jeannie Tapia","Jefferson Lee","Jeramy Keith","Jermaine Bradshaw","Jewel Lee","Jimmie Yang","Jodie Wood","John Cline","Josefina Dickerson","Josie Pineda","Judith Griffin","Julius Soto","Kelli Romero","Kerri Joseph","Kim Mccall","Lakeisha Velazquez","Latonya Logan","Lee Schmidt","Lela Atkins","Leland Robertson","Leonardo House","Leroy Mcintyre","Lesley Blevins","Lilia Berg","Lilly Stone","Lincoln Bond","Lindsay Hurst","Lionel Fuller","Lorene Hunter","Louis Kidd","Lucius Warren","Lucy Mejia","Lupe Ingram","Lynette Fuller","Lynnette Wright","Madge Copeland","Madge Tanner","Mae Sawyer","Malcolm Newman","Mamie Wong","Mandy Swanson","Marcella Everett","Marco Bright","Marcos Schaefer","Marcus Hays","Marina Walsh","Marion Savage","Marylou Bass","Marylou Mccarthy","Mathew Howard","Maurice Jacobson","Mauricio Bautista","Max Smith","Melanie Bridges","Melissa Brandt","Merlin Wu","Michel Simpson","Mickey Kennedy","Mike Sloan","Milton Walsh","Mohamed Allison","Mohammad Christensen","Nadia Macdonald","Naomi Snyder","Ned Lowe","Nettie Leonard","Olive Perkins","Ophelia Morrow","Oren Montes","Orlando Henderson","Owen Buchanan","Paul Norman","Rafael Barrett","Raymond Cochran","Reed Hooper","Reinaldo Houston","Renato Simmons","Rene Calhoun","Reva Hardin","Robert French","Robin Bender","Rodolfo Scott","Roland Blake","Roland Sullivan","Rolf Barnett","Ross Marquez","Ruthie Daugherty","Sandra Potts","Scott Stephenson","Scotty Gonzales","Sean Wiggins","Shana Gallagher","Sharron Montes","Sheryl Lindsey","Socorro Hayden","Solomon Andrade","Stacey Whitehead","Stevie Hale","Stuart Oliver","Stuart Riddle","Tammy Merritt","Theo Wiley","Theresa Murillo","Timothy Roberts","Tony Torres","Tracy Logan","Troy Hoover","Twila Rubio","Velma Everett","Vincent Mccormick","Vincenzo Stafford","Vito Clark","Waldo Spencer","Werner Lowe","Werner Shepard","Wesley Ford","Wm Cantu","Zelma Pierce"]
[null,null,null,null,null,"Darrel Liu",{"$f":"IF('Resulting List'!F89=\"\",\"\",'Resulting List'!F89)","v":""},null,{"$f":"TRANSPOSE(_xlfn._xlws.SORT(_xlfn.UNIQUE(_xlfn._xlws.FILTER(Customers[Names],ISNUMBER(SEARCH(Customers[[#This Row],[Search Criteria]],Customers[Names])),\"No data.\"))))","v":"Adriana Todd"},"Albert Ramirez","Alex Rubio","Amanda Beck","Amparo Orozco","Amy Todd","Angelina Roberson","April Fox","Arden Ayala","Arnoldo Pennington","Aubrey Giles","Bette Rivers","Brianna Alexander","Brianna Mora","Britt Vazquez","Broderick Gillespie","Brooke Roman","Calvin Buck","Carmela Mullins","Carol Stevenson","Carolina Russell","Carolyn Roberts","Chelsea Gilbert","Cheryl Williamson","Christa Frederick","Christian Armstrong","Christopher Stuart","Chung Krueger","Clare Whitney","Clarissa Archer","Claudio Lam","Cordell Mills","Craig Shepherd","Damien Kramer","Dane Burke","Danielle Stout","Darrel Liu","Darrin Mcneil","Darron Aguilar","Della Huber","Delores Krause","Dena Rosario","Dominick Johnston","Dona Herring","Dorothy Winters","Douglas Wiley","Doyle David","Earlene Hester","Earline Shepherd","Edwin Sparks","Eli Galvan","Elinor Kaufman","Elroy Porter","Elvin Flynn","Emmitt Porter","Erik Parsons","Ethel Forbes","Felicia Ware","Fidel Haynes","Francisco Valenzuela","Frank Hunt","Gabriela Moore","Gabrielle Patrick","Gale Fitzpatrick","Gayle Curtis","Genevieve Lucero","Gerry Oneal","Grady Ellis","Grover Escobar","Hans Patel","Horacio Black","Humberto Compton","Hunter Short","Ilene Mcguire","Imelda Lloyd","Ira Macdonald","Issac Allen","Jacques Velazquez","Janis Mullins","Janna Cowan","Javier Garner","Jayson Abbott","Jeannie Tapia","Jefferson Lee","Jeramy Keith","Jermaine Bradshaw","Jewel Lee","Jimmie Yang","Jodie Wood","John Cline","Josefina Dickerson","Josie Pineda","Judith Griffin","Julius Soto","Kelli Romero","Kerri Joseph","Kim Mccall","Lakeisha Velazquez","Latonya Logan","Lee Schmidt","Lela Atkins","Leland Robertson","Leonardo House","Leroy Mcintyre","Lesley Blevins","Lilia Berg","Lilly Stone","Lincoln Bond","Lindsay Hurst","Lionel Fuller","Lorene Hunter","Louis Kidd","Lucius Warren","Lucy Mejia","Lupe Ingram","Lynette Fuller","Lynnette Wright","Madge Copeland","Madge Tanner","Mae Sawyer","Malcolm Newman","Mamie Wong","Mandy Swanson","Marcella Everett","Marco Bright","Marcos Schaefer","Marcus Hays","Marina Walsh","Marion Savage","Marylou Bass","Marylou Mccarthy","Mathew Howard","Maurice Jacobson","Mauricio Bautista","Max Smith","Melanie Bridges","Melissa Brandt","Merlin Wu","Michel Simpson","Mickey Kennedy","Mike Sloan","Milton Walsh","Mohamed Allison","Mohammad Christensen","Nadia Macdonald","Naomi Snyder","Ned Lowe","Nettie Leonard","Olive Perkins","Ophelia Morrow","Oren Montes","Orlando Henderson","Owen Buchanan","Paul Norman","Rafael Barrett","Raymond Cochran","Reed Hooper","Reinaldo Houston","Renato Simmons","Rene Calhoun","Reva Hardin","Robert French","Robin Bender","Rodolfo Scott","Roland Blake","Roland Sullivan","Rolf Barnett","Ross Marquez","Ruthie Daugherty","Sandra Potts","Scott Stephenson","Scotty Gonzales","Sean Wiggins","Shana Gallagher","Sharron Montes","Sheryl Lindsey","Socorro Hayden","Solomon Andrade","Stacey Whitehead","Stevie Hale","Stuart Oliver","Stuart Riddle","Tammy Merritt","Theo Wiley","Theresa Murillo","Timothy Roberts","Tony Torres","Tracy Logan","Troy Hoover","Twila Rubio","Velma Everett","Vincent Mccormick","Vincenzo Stafford","Vito Clark","Waldo Spencer","Werner Lowe","Werner Shepard","Wesley Ford","Wm Cantu","Zelma Pierce"]
[null,null,null,null,null,"Cheryl Williamson",{"$f":"IF('Resulting List'!F90=\"\",\"\",'Resulting List'!F90)","v":""},null,{"$f":"TRANSPOSE(_xlfn._xlws.SORT(_xlfn.UNIQUE(_xlfn._xlws.FILTER(Customers[Names],ISNUMBER(SEARCH(Customers[[#This Row],[Search Criteria]],Customers[Names])),\"No data.\"))))","v":"Adriana Todd"},"Albert Ramirez","Alex Rubio","Amanda Beck","Amparo Orozco","Amy Todd","Angelina Roberson","April Fox","Arden Ayala","Arnoldo Pennington","Aubrey Giles","Bette Rivers","Brianna Alexander","Brianna Mora","Britt Vazquez","Broderick Gillespie","Brooke Roman","Calvin Buck","Carmela Mullins","Carol Stevenson","Carolina Russell","Carolyn Roberts","Chelsea Gilbert","Cheryl Williamson","Christa Frederick","Christian Armstrong","Christopher Stuart","Chung Krueger","Clare Whitney","Clarissa Archer","Claudio Lam","Cordell Mills","Craig Shepherd","Damien Kramer","Dane Burke","Danielle Stout","Darrel Liu","Darrin Mcneil","Darron Aguilar","Della Huber","Delores Krause","Dena Rosario","Dominick Johnston","Dona Herring","Dorothy Winters","Douglas Wiley","Doyle David","Earlene Hester","Earline Shepherd","Edwin Sparks","Eli Galvan","Elinor Kaufman","Elroy Porter","Elvin Flynn","Emmitt Porter","Erik Parsons","Ethel Forbes","Felicia Ware","Fidel Haynes","Francisco Valenzuela","Frank Hunt","Gabriela Moore","Gabrielle Patrick","Gale Fitzpatrick","Gayle Curtis","Genevieve Lucero","Gerry Oneal","Grady Ellis","Grover Escobar","Hans Patel","Horacio Black","Humberto Compton","Hunter Short","Ilene Mcguire","Imelda Lloyd","Ira Macdonald","Issac Allen","Jacques Velazquez","Janis Mullins","Janna Cowan","Javier Garner","Jayson Abbott","Jeannie Tapia","Jefferson Lee","Jeramy Keith","Jermaine Bradshaw","Jewel Lee","Jimmie Yang","Jodie Wood","John Cline","Josefina Dickerson","Josie Pineda","Judith Griffin","Julius Soto","Kelli Romero","Kerri Joseph","Kim Mccall","Lakeisha Velazquez","Latonya Logan","Lee Schmidt","Lela Atkins","Leland Robertson","Leonardo House","Leroy Mcintyre","Lesley Blevins","Lilia Berg","Lilly Stone","Lincoln Bond","Lindsay Hurst","Lionel Fuller","Lorene Hunter","Louis Kidd","Lucius Warren","Lucy Mejia","Lupe Ingram","Lynette Fuller","Lynnette Wright","Madge Copeland","Madge Tanner","Mae Sawyer","Malcolm Newman","Mamie Wong","Mandy Swanson","Marcella Everett","Marco Bright","Marcos Schaefer","Marcus Hays","Marina Walsh","Marion Savage","Marylou Bass","Marylou Mccarthy","Mathew Howard","Maurice Jacobson","Mauricio Bautista","Max Smith","Melanie Bridges","Melissa Brandt","Merlin Wu","Michel Simpson","Mickey Kennedy","Mike Sloan","Milton Walsh","Mohamed Allison","Mohammad Christensen","Nadia Macdonald","Naomi Snyder","Ned Lowe","Nettie Leonard","Olive Perkins","Ophelia Morrow","Oren Montes","Orlando Henderson","Owen Buchanan","Paul Norman","Rafael Barrett","Raymond Cochran","Reed Hooper","Reinaldo Houston","Renato Simmons","Rene Calhoun","Reva Hardin","Robert French","Robin Bender","Rodolfo Scott","Roland Blake","Roland Sullivan","Rolf Barnett","Ross Marquez","Ruthie Daugherty","Sandra Potts","Scott Stephenson","Scotty Gonzales","Sean Wiggins","Shana Gallagher","Sharron Montes","Sheryl Lindsey","Socorro Hayden","Solomon Andrade","Stacey Whitehead","Stevie Hale","Stuart Oliver","Stuart Riddle","Tammy Merritt","Theo Wiley","Theresa Murillo","Timothy Roberts","Tony Torres","Tracy Logan","Troy Hoover","Twila Rubio","Velma Everett","Vincent Mccormick","Vincenzo Stafford","Vito Clark","Waldo Spencer","Werner Lowe","Werner Shepard","Wesley Ford","Wm Cantu","Zelma Pierce"]
[null,null,null,null,null,"Scotty Gonzales",{"$f":"IF('Resulting List'!F91=\"\",\"\",'Resulting List'!F91)","v":""},null,{"$f":"TRANSPOSE(_xlfn._xlws.SORT(_xlfn.UNIQUE(_xlfn._xlws.FILTER(Customers[Names],ISNUMBER(SEARCH(Customers[[#This Row],[Search Criteria]],Customers[Names])),\"No data.\"))))","v":"Adriana Todd"},"Albert Ramirez","Alex Rubio","Amanda Beck","Amparo Orozco","Amy Todd","Angelina Roberson","April Fox","Arden Ayala","Arnoldo Pennington","Aubrey Giles","Bette Rivers","Brianna Alexander","Brianna Mora","Britt Vazquez","Broderick Gillespie","Brooke Roman","Calvin Buck","Carmela Mullins","Carol Stevenson","Carolina Russell","Carolyn Roberts","Chelsea Gilbert","Cheryl Williamson","Christa Frederick","Christian Armstrong","Christopher Stuart","Chung Krueger","Clare Whitney","Clarissa Archer","Claudio Lam","Cordell Mills","Craig Shepherd","Damien Kramer","Dane Burke","Danielle Stout","Darrel Liu","Darrin Mcneil","Darron Aguilar","Della Huber","Delores Krause","Dena Rosario","Dominick Johnston","Dona Herring","Dorothy Winters","Douglas Wiley","Doyle David","Earlene Hester","Earline Shepherd","Edwin Sparks","Eli Galvan","Elinor Kaufman","Elroy Porter","Elvin Flynn","Emmitt Porter","Erik Parsons","Ethel Forbes","Felicia Ware","Fidel Haynes","Francisco Valenzuela","Frank Hunt","Gabriela Moore","Gabrielle Patrick","Gale Fitzpatrick","Gayle Curtis","Genevieve Lucero","Gerry Oneal","Grady Ellis","Grover Escobar","Hans Patel","Horacio Black","Humberto Compton","Hunter Short","Ilene Mcguire","Imelda Lloyd","Ira Macdonald","Issac Allen","Jacques Velazquez","Janis Mullins","Janna Cowan","Javier Garner","Jayson Abbott","Jeannie Tapia","Jefferson Lee","Jeramy Keith","Jermaine Bradshaw","Jewel Lee","Jimmie Yang","Jodie Wood","John Cline","Josefina Dickerson","Josie Pineda","Judith Griffin","Julius Soto","Kelli Romero","Kerri Joseph","Kim Mccall","Lakeisha Velazquez","Latonya Logan","Lee Schmidt","Lela Atkins","Leland Robertson","Leonardo House","Leroy Mcintyre","Lesley Blevins","Lilia Berg","Lilly Stone","Lincoln Bond","Lindsay Hurst","Lionel Fuller","Lorene Hunter","Louis Kidd","Lucius Warren","Lucy Mejia","Lupe Ingram","Lynette Fuller","Lynnette Wright","Madge Copeland","Madge Tanner","Mae Sawyer","Malcolm Newman","Mamie Wong","Mandy Swanson","Marcella Everett","Marco Bright","Marcos Schaefer","Marcus Hays","Marina Walsh","Marion Savage","Marylou Bass","Marylou Mccarthy","Mathew Howard","Maurice Jacobson","Mauricio Bautista","Max Smith","Melanie Bridges","Melissa Brandt","Merlin Wu","Michel Simpson","Mickey Kennedy","Mike Sloan","Milton Walsh","Mohamed Allison","Mohammad Christensen","Nadia Macdonald","Naomi Snyder","Ned Lowe","Nettie Leonard","Olive Perkins","Ophelia Morrow","Oren Montes","Orlando Henderson","Owen Buchanan","Paul Norman","Rafael Barrett","Raymond Cochran","Reed Hooper","Reinaldo Houston","Renato Simmons","Rene Calhoun","Reva Hardin","Robert French","Robin Bender","Rodolfo Scott","Roland Blake","Roland Sullivan","Rolf Barnett","Ross Marquez","Ruthie Daugherty","Sandra Potts","Scott Stephenson","Scotty Gonzales","Sean Wiggins","Shana Gallagher","Sharron Montes","Sheryl Lindsey","Socorro Hayden","Solomon Andrade","Stacey Whitehead","Stevie Hale","Stuart Oliver","Stuart Riddle","Tammy Merritt","Theo Wiley","Theresa Murillo","Timothy Roberts","Tony Torres","Tracy Logan","Troy Hoover","Twila Rubio","Velma Everett","Vincent Mccormick","Vincenzo Stafford","Vito Clark","Waldo Spencer","Werner Lowe","Werner Shepard","Wesley Ford","Wm Cantu","Zelma Pierce"]
[null,null,null,null,null,"Dona Herring",{"$f":"IF('Resulting List'!F92=\"\",\"\",'Resulting List'!F92)","v":""},null,{"$f":"TRANSPOSE(_xlfn._xlws.SORT(_xlfn.UNIQUE(_xlfn._xlws.FILTER(Customers[Names],ISNUMBER(SEARCH(Customers[[#This Row],[Search Criteria]],Customers[Names])),\"No data.\"))))","v":"Adriana Todd"},"Albert Ramirez","Alex Rubio","Amanda Beck","Amparo Orozco","Amy Todd","Angelina Roberson","April Fox","Arden Ayala","Arnoldo Pennington","Aubrey Giles","Bette Rivers","Brianna Alexander","Brianna Mora","Britt Vazquez","Broderick Gillespie","Brooke Roman","Calvin Buck","Carmela Mullins","Carol Stevenson","Carolina Russell","Carolyn Roberts","Chelsea Gilbert","Cheryl Williamson","Christa Frederick","Christian Armstrong","Christopher Stuart","Chung Krueger","Clare Whitney","Clarissa Archer","Claudio Lam","Cordell Mills","Craig Shepherd","Damien Kramer","Dane Burke","Danielle Stout","Darrel Liu","Darrin Mcneil","Darron Aguilar","Della Huber","Delores Krause","Dena Rosario","Dominick Johnston","Dona Herring","Dorothy Winters","Douglas Wiley","Doyle David","Earlene Hester","Earline Shepherd","Edwin Sparks","Eli Galvan","Elinor Kaufman","Elroy Porter","Elvin Flynn","Emmitt Porter","Erik Parsons","Ethel Forbes","Felicia Ware","Fidel Haynes","Francisco Valenzuela","Frank Hunt","Gabriela Moore","Gabrielle Patrick","Gale Fitzpatrick","Gayle Curtis","Genevieve Lucero","Gerry Oneal","Grady Ellis","Grover Escobar","Hans Patel","Horacio Black","Humberto Compton","Hunter Short","Ilene Mcguire","Imelda Lloyd","Ira Macdonald","Issac Allen","Jacques Velazquez","Janis Mullins","Janna Cowan","Javier Garner","Jayson Abbott","Jeannie Tapia","Jefferson Lee","Jeramy Keith","Jermaine Bradshaw","Jewel Lee","Jimmie Yang","Jodie Wood","John Cline","Josefina Dickerson","Josie Pineda","Judith Griffin","Julius Soto","Kelli Romero","Kerri Joseph","Kim Mccall","Lakeisha Velazquez","Latonya Logan","Lee Schmidt","Lela Atkins","Leland Robertson","Leonardo House","Leroy Mcintyre","Lesley Blevins","Lilia Berg","Lilly Stone","Lincoln Bond","Lindsay Hurst","Lionel Fuller","Lorene Hunter","Louis Kidd","Lucius Warren","Lucy Mejia","Lupe Ingram","Lynette Fuller","Lynnette Wright","Madge Copeland","Madge Tanner","Mae Sawyer","Malcolm Newman","Mamie Wong","Mandy Swanson","Marcella Everett","Marco Bright","Marcos Schaefer","Marcus Hays","Marina Walsh","Marion Savage","Marylou Bass","Marylou Mccarthy","Mathew Howard","Maurice Jacobson","Mauricio Bautista","Max Smith","Melanie Bridges","Melissa Brandt","Merlin Wu","Michel Simpson","Mickey Kennedy","Mike Sloan","Milton Walsh","Mohamed Allison","Mohammad Christensen","Nadia Macdonald","Naomi Snyder","Ned Lowe","Nettie Leonard","Olive Perkins","Ophelia Morrow","Oren Montes","Orlando Henderson","Owen Buchanan","Paul Norman","Rafael Barrett","Raymond Cochran","Reed Hooper","Reinaldo Houston","Renato Simmons","Rene Calhoun","Reva Hardin","Robert French","Robin Bender","Rodolfo Scott","Roland Blake","Roland Sullivan","Rolf Barnett","Ross Marquez","Ruthie Daugherty","Sandra Potts","Scott Stephenson","Scotty Gonzales","Sean Wiggins","Shana Gallagher","Sharron Montes","Sheryl Lindsey","Socorro Hayden","Solomon Andrade","Stacey Whitehead","Stevie Hale","Stuart Oliver","Stuart Riddle","Tammy Merritt","Theo Wiley","Theresa Murillo","Timothy Roberts","Tony Torres","Tracy Logan","Troy Hoover","Twila Rubio","Velma Everett","Vincent Mccormick","Vincenzo Stafford","Vito Clark","Waldo Spencer","Werner Lowe","Werner Shepard","Wesley Ford","Wm Cantu","Zelma Pierce"]
[null,null,null,null,null,"April Fox",{"$f":"IF('Resulting List'!F93=\"\",\"\",'Resulting List'!F93)","v":""},null,{"$f":"TRANSPOSE(_xlfn._xlws.SORT(_xlfn.UNIQUE(_xlfn._xlws.FILTER(Customers[Names],ISNUMBER(SEARCH(Customers[[#This Row],[Search Criteria]],Customers[Names])),\"No data.\"))))","v":"Adriana Todd"},"Albert Ramirez","Alex Rubio","Amanda Beck","Amparo Orozco","Amy Todd","Angelina Roberson","April Fox","Arden Ayala","Arnoldo Pennington","Aubrey Giles","Bette Rivers","Brianna Alexander","Brianna Mora","Britt Vazquez","Broderick Gillespie","Brooke Roman","Calvin Buck","Carmela Mullins","Carol Stevenson","Carolina Russell","Carolyn Roberts","Chelsea Gilbert","Cheryl Williamson","Christa Frederick","Christian Armstrong","Christopher Stuart","Chung Krueger","Clare Whitney","Clarissa Archer","Claudio Lam","Cordell Mills","Craig Shepherd","Damien Kramer","Dane Burke","Danielle Stout","Darrel Liu","Darrin Mcneil","Darron Aguilar","Della Huber","Delores Krause","Dena Rosario","Dominick Johnston","Dona Herring","Dorothy Winters","Douglas Wiley","Doyle David","Earlene Hester","Earline Shepherd","Edwin Sparks","Eli Galvan","Elinor Kaufman","Elroy Porter","Elvin Flynn","Emmitt Porter","Erik Parsons","Ethel Forbes","Felicia Ware","Fidel Haynes","Francisco Valenzuela","Frank Hunt","Gabriela Moore","Gabrielle Patrick","Gale Fitzpatrick","Gayle Curtis","Genevieve Lucero","Gerry Oneal","Grady Ellis","Grover Escobar","Hans Patel","Horacio Black","Humberto Compton","Hunter Short","Ilene Mcguire","Imelda Lloyd","Ira Macdonald","Issac Allen","Jacques Velazquez","Janis Mullins","Janna Cowan","Javier Garner","Jayson Abbott","Jeannie Tapia","Jefferson Lee","Jeramy Keith","Jermaine Bradshaw","Jewel Lee","Jimmie Yang","Jodie Wood","John Cline","Josefina Dickerson","Josie Pineda","Judith Griffin","Julius Soto","Kelli Romero","Kerri Joseph","Kim Mccall","Lakeisha Velazquez","Latonya Logan","Lee Schmidt","Lela Atkins","Leland Robertson","Leonardo House","Leroy Mcintyre","Lesley Blevins","Lilia Berg","Lilly Stone","Lincoln Bond","Lindsay Hurst","Lionel Fuller","Lorene Hunter","Louis Kidd","Lucius Warren","Lucy Mejia","Lupe Ingram","Lynette Fuller","Lynnette Wright","Madge Copeland","Madge Tanner","Mae Sawyer","Malcolm Newman","Mamie Wong","Mandy Swanson","Marcella Everett","Marco Bright","Marcos Schaefer","Marcus Hays","Marina Walsh","Marion Savage","Marylou Bass","Marylou Mccarthy","Mathew Howard","Maurice Jacobson","Mauricio Bautista","Max Smith","Melanie Bridges","Melissa Brandt","Merlin Wu","Michel Simpson","Mickey Kennedy","Mike Sloan","Milton Walsh","Mohamed Allison","Mohammad Christensen","Nadia Macdonald","Naomi Snyder","Ned Lowe","Nettie Leonard","Olive Perkins","Ophelia Morrow","Oren Montes","Orlando Henderson","Owen Buchanan","Paul Norman","Rafael Barrett","Raymond Cochran","Reed Hooper","Reinaldo Houston","Renato Simmons","Rene Calhoun","Reva Hardin","Robert French","Robin Bender","Rodolfo Scott","Roland Blake","Roland Sullivan","Rolf Barnett","Ross Marquez","Ruthie Daugherty","Sandra Potts","Scott Stephenson","Scotty Gonzales","Sean Wiggins","Shana Gallagher","Sharron Montes","Sheryl Lindsey","Socorro Hayden","Solomon Andrade","Stacey Whitehead","Stevie Hale","Stuart Oliver","Stuart Riddle","Tammy Merritt","Theo Wiley","Theresa Murillo","Timothy Roberts","Tony Torres","Tracy Logan","Troy Hoover","Twila Rubio","Velma Everett","Vincent Mccormick","Vincenzo Stafford","Vito Clark","Waldo Spencer","Werner Lowe","Werner Shepard","Wesley Ford","Wm Cantu","Zelma Pierce"]
[null,null,null,null,null,"Judith Griffin",{"$f":"IF('Resulting List'!F94=\"\",\"\",'Resulting List'!F94)","v":""},null,{"$f":"TRANSPOSE(_xlfn._xlws.SORT(_xlfn.UNIQUE(_xlfn._xlws.FILTER(Customers[Names],ISNUMBER(SEARCH(Customers[[#This Row],[Search Criteria]],Customers[Names])),\"No data.\"))))","v":"Adriana Todd"},"Albert Ramirez","Alex Rubio","Amanda Beck","Amparo Orozco","Amy Todd","Angelina Roberson","April Fox","Arden Ayala","Arnoldo Pennington","Aubrey Giles","Bette Rivers","Brianna Alexander","Brianna Mora","Britt Vazquez","Broderick Gillespie","Brooke Roman","Calvin Buck","Carmela Mullins","Carol Stevenson","Carolina Russell","Carolyn Roberts","Chelsea Gilbert","Cheryl Williamson","Christa Frederick","Christian Armstrong","Christopher Stuart","Chung Krueger","Clare Whitney","Clarissa Archer","Claudio Lam","Cordell Mills","Craig Shepherd","Damien Kramer","Dane Burke","Danielle Stout","Darrel Liu","Darrin Mcneil","Darron Aguilar","Della Huber","Delores Krause","Dena Rosario","Dominick Johnston","Dona Herring","Dorothy Winters","Douglas Wiley","Doyle David","Earlene Hester","Earline Shepherd","Edwin Sparks","Eli Galvan","Elinor Kaufman","Elroy Porter","Elvin Flynn","Emmitt Porter","Erik Parsons","Ethel Forbes","Felicia Ware","Fidel Haynes","Francisco Valenzuela","Frank Hunt","Gabriela Moore","Gabrielle Patrick","Gale Fitzpatrick","Gayle Curtis","Genevieve Lucero","Gerry Oneal","Grady Ellis","Grover Escobar","Hans Patel","Horacio Black","Humberto Compton","Hunter Short","Ilene Mcguire","Imelda Lloyd","Ira Macdonald","Issac Allen","Jacques Velazquez","Janis Mullins","Janna Cowan","Javier Garner","Jayson Abbott","Jeannie Tapia","Jefferson Lee","Jeramy Keith","Jermaine Bradshaw","Jewel Lee","Jimmie Yang","Jodie Wood","John Cline","Josefina Dickerson","Josie Pineda","Judith Griffin","Julius Soto","Kelli Romero","Kerri Joseph","Kim Mccall","Lakeisha Velazquez","Latonya Logan","Lee Schmidt","Lela Atkins","Leland Robertson","Leonardo House","Leroy Mcintyre","Lesley Blevins","Lilia Berg","Lilly Stone","Lincoln Bond","Lindsay Hurst","Lionel Fuller","Lorene Hunter","Louis Kidd","Lucius Warren","Lucy Mejia","Lupe Ingram","Lynette Fuller","Lynnette Wright","Madge Copeland","Madge Tanner","Mae Sawyer","Malcolm Newman","Mamie Wong","Mandy Swanson","Marcella Everett","Marco Bright","Marcos Schaefer","Marcus Hays","Marina Walsh","Marion Savage","Marylou Bass","Marylou Mccarthy","Mathew Howard","Maurice Jacobson","Mauricio Bautista","Max Smith","Melanie Bridges","Melissa Brandt","Merlin Wu","Michel Simpson","Mickey Kennedy","Mike Sloan","Milton Walsh","Mohamed Allison","Mohammad Christensen","Nadia Macdonald","Naomi Snyder","Ned Lowe","Nettie Leonard","Olive Perkins","Ophelia Morrow","Oren Montes","Orlando Henderson","Owen Buchanan","Paul Norman","Rafael Barrett","Raymond Cochran","Reed Hooper","Reinaldo Houston","Renato Simmons","Rene Calhoun","Reva Hardin","Robert French","Robin Bender","Rodolfo Scott","Roland Blake","Roland Sullivan","Rolf Barnett","Ross Marquez","Ruthie Daugherty","Sandra Potts","Scott Stephenson","Scotty Gonzales","Sean Wiggins","Shana Gallagher","Sharron Montes","Sheryl Lindsey","Socorro Hayden","Solomon Andrade","Stacey Whitehead","Stevie Hale","Stuart Oliver","Stuart Riddle","Tammy Merritt","Theo Wiley","Theresa Murillo","Timothy Roberts","Tony Torres","Tracy Logan","Troy Hoover","Twila Rubio","Velma Everett","Vincent Mccormick","Vincenzo Stafford","Vito Clark","Waldo Spencer","Werner Lowe","Werner Shepard","Wesley Ford","Wm Cantu","Zelma Pierce"]
[null,null,null,null,null,"Darron Aguilar",{"$f":"IF('Resulting List'!F95=\"\",\"\",'Resulting List'!F95)","v":""},null,{"$f":"TRANSPOSE(_xlfn._xlws.SORT(_xlfn.UNIQUE(_xlfn._xlws.FILTER(Customers[Names],ISNUMBER(SEARCH(Customers[[#This Row],[Search Criteria]],Customers[Names])),\"No data.\"))))","v":"Adriana Todd"},"Albert Ramirez","Alex Rubio","Amanda Beck","Amparo Orozco","Amy Todd","Angelina Roberson","April Fox","Arden Ayala","Arnoldo Pennington","Aubrey Giles","Bette Rivers","Brianna Alexander","Brianna Mora","Britt Vazquez","Broderick Gillespie","Brooke Roman","Calvin Buck","Carmela Mullins","Carol Stevenson","Carolina Russell","Carolyn Roberts","Chelsea Gilbert","Cheryl Williamson","Christa Frederick","Christian Armstrong","Christopher Stuart","Chung Krueger","Clare Whitney","Clarissa Archer","Claudio Lam","Cordell Mills","Craig Shepherd","Damien Kramer","Dane Burke","Danielle Stout","Darrel Liu","Darrin Mcneil","Darron Aguilar","Della Huber","Delores Krause","Dena Rosario","Dominick Johnston","Dona Herring","Dorothy Winters","Douglas Wiley","Doyle David","Earlene Hester","Earline Shepherd","Edwin Sparks","Eli Galvan","Elinor Kaufman","Elroy Porter","Elvin Flynn","Emmitt Porter","Erik Parsons","Ethel Forbes","Felicia Ware","Fidel Haynes","Francisco Valenzuela","Frank Hunt","Gabriela Moore","Gabrielle Patrick","Gale Fitzpatrick","Gayle Curtis","Genevieve Lucero","Gerry Oneal","Grady Ellis","Grover Escobar","Hans Patel","Horacio Black","Humberto Compton","Hunter Short","Ilene Mcguire","Imelda Lloyd","Ira Macdonald","Issac Allen","Jacques Velazquez","Janis Mullins","Janna Cowan","Javier Garner","Jayson Abbott","Jeannie Tapia","Jefferson Lee","Jeramy Keith","Jermaine Bradshaw","Jewel Lee","Jimmie Yang","Jodie Wood","John Cline","Josefina Dickerson","Josie Pineda","Judith Griffin","Julius Soto","Kelli Romero","Kerri Joseph","Kim Mccall","Lakeisha Velazquez","Latonya Logan","Lee Schmidt","Lela Atkins","Leland Robertson","Leonardo House","Leroy Mcintyre","Lesley Blevins","Lilia Berg","Lilly Stone","Lincoln Bond","Lindsay Hurst","Lionel Fuller","Lorene Hunter","Louis Kidd","Lucius Warren","Lucy Mejia","Lupe Ingram","Lynette Fuller","Lynnette Wright","Madge Copeland","Madge Tanner","Mae Sawyer","Malcolm Newman","Mamie Wong","Mandy Swanson","Marcella Everett","Marco Bright","Marcos Schaefer","Marcus Hays","Marina Walsh","Marion Savage","Marylou Bass","Marylou Mccarthy","Mathew Howard","Maurice Jacobson","Mauricio Bautista","Max Smith","Melanie Bridges","Melissa Brandt","Merlin Wu","Michel Simpson","Mickey Kennedy","Mike Sloan","Milton Walsh","Mohamed Allison","Mohammad Christensen","Nadia Macdonald","Naomi Snyder","Ned Lowe","Nettie Leonard","Olive Perkins","Ophelia Morrow","Oren Montes","Orlando Henderson","Owen Buchanan","Paul Norman","Rafael Barrett","Raymond Cochran","Reed Hooper","Reinaldo Houston","Renato Simmons","Rene Calhoun","Reva Hardin","Robert French","Robin Bender","Rodolfo Scott","Roland Blake","Roland Sullivan","Rolf Barnett","Ross Marquez","Ruthie Daugherty","Sandra Potts","Scott Stephenson","Scotty Gonzales","Sean Wiggins","Shana Gallagher","Sharron Montes","Sheryl Lindsey","Socorro Hayden","Solomon Andrade","Stacey Whitehead","Stevie Hale","Stuart Oliver","Stuart Riddle","Tammy Merritt","Theo Wiley","Theresa Murillo","Timothy Roberts","Tony Torres","Tracy Logan","Troy Hoover","Twila Rubio","Velma Everett","Vincent Mccormick","Vincenzo Stafford","Vito Clark","Waldo Spencer","Werner Lowe","Werner Shepard","Wesley Ford","Wm Cantu","Zelma Pierce"]
[null,null,null,null,null,"Ethel Forbes",{"$f":"IF('Resulting List'!F96=\"\",\"\",'Resulting List'!F96)","v":""},null,{"$f":"TRANSPOSE(_xlfn._xlws.SORT(_xlfn.UNIQUE(_xlfn._xlws.FILTER(Customers[Names],ISNUMBER(SEARCH(Customers[[#This Row],[Search Criteria]],Customers[Names])),\"No data.\"))))","v":"Adriana Todd"},"Albert Ramirez","Alex Rubio","Amanda Beck","Amparo Orozco","Amy Todd","Angelina Roberson","April Fox","Arden Ayala","Arnoldo Pennington","Aubrey Giles","Bette Rivers","Brianna Alexander","Brianna Mora","Britt Vazquez","Broderick Gillespie","Brooke Roman","Calvin Buck","Carmela Mullins","Carol Stevenson","Carolina Russell","Carolyn Roberts","Chelsea Gilbert","Cheryl Williamson","Christa Frederick","Christian Armstrong","Christopher Stuart","Chung Krueger","Clare Whitney","Clarissa Archer","Claudio Lam","Cordell Mills","Craig Shepherd","Damien Kramer","Dane Burke","Danielle Stout","Darrel Liu","Darrin Mcneil","Darron Aguilar","Della Huber","Delores Krause","Dena Rosario","Dominick Johnston","Dona Herring","Dorothy Winters","Douglas Wiley","Doyle David","Earlene Hester","Earline Shepherd","Edwin Sparks","Eli Galvan","Elinor Kaufman","Elroy Porter","Elvin Flynn","Emmitt Porter","Erik Parsons","Ethel Forbes","Felicia Ware","Fidel Haynes","Francisco Valenzuela","Frank Hunt","Gabriela Moore","Gabrielle Patrick","Gale Fitzpatrick","Gayle Curtis","Genevieve Lucero","Gerry Oneal","Grady Ellis","Grover Escobar","Hans Patel","Horacio Black","Humberto Compton","Hunter Short","Ilene Mcguire","Imelda Lloyd","Ira Macdonald","Issac Allen","Jacques Velazquez","Janis Mullins","Janna Cowan","Javier Garner","Jayson Abbott","Jeannie Tapia","Jefferson Lee","Jeramy Keith","Jermaine Bradshaw","Jewel Lee","Jimmie Yang","Jodie Wood","John Cline","Josefina Dickerson","Josie Pineda","Judith Griffin","Julius Soto","Kelli Romero","Kerri Joseph","Kim Mccall","Lakeisha Velazquez","Latonya Logan","Lee Schmidt","Lela Atkins","Leland Robertson","Leonardo House","Leroy Mcintyre","Lesley Blevins","Lilia Berg","Lilly Stone","Lincoln Bond","Lindsay Hurst","Lionel Fuller","Lorene Hunter","Louis Kidd","Lucius Warren","Lucy Mejia","Lupe Ingram","Lynette Fuller","Lynnette Wright","Madge Copeland","Madge Tanner","Mae Sawyer","Malcolm Newman","Mamie Wong","Mandy Swanson","Marcella Everett","Marco Bright","Marcos Schaefer","Marcus Hays","Marina Walsh","Marion Savage","Marylou Bass","Marylou Mccarthy","Mathew Howard","Maurice Jacobson","Mauricio Bautista","Max Smith","Melanie Bridges","Melissa Brandt","Merlin Wu","Michel Simpson","Mickey Kennedy","Mike Sloan","Milton Walsh","Mohamed Allison","Mohammad Christensen","Nadia Macdonald","Naomi Snyder","Ned Lowe","Nettie Leonard","Olive Perkins","Ophelia Morrow","Oren Montes","Orlando Henderson","Owen Buchanan","Paul Norman","Rafael Barrett","Raymond Cochran","Reed Hooper","Reinaldo Houston","Renato Simmons","Rene Calhoun","Reva Hardin","Robert French","Robin Bender","Rodolfo Scott","Roland Blake","Roland Sullivan","Rolf Barnett","Ross Marquez","Ruthie Daugherty","Sandra Potts","Scott Stephenson","Scotty Gonzales","Sean Wiggins","Shana Gallagher","Sharron Montes","Sheryl Lindsey","Socorro Hayden","Solomon Andrade","Stacey Whitehead","Stevie Hale","Stuart Oliver","Stuart Riddle","Tammy Merritt","Theo Wiley","Theresa Murillo","Timothy Roberts","Tony Torres","Tracy Logan","Troy Hoover","Twila Rubio","Velma Everett","Vincent Mccormick","Vincenzo Stafford","Vito Clark","Waldo Spencer","Werner Lowe","Werner Shepard","Wesley Ford","Wm Cantu","Zelma Pierce"]
[null,null,null,null,null,"Lilly Stone",{"$f":"IF('Resulting List'!F97=\"\",\"\",'Resulting List'!F97)","v":""},null,{"$f":"TRANSPOSE(_xlfn._xlws.SORT(_xlfn.UNIQUE(_xlfn._xlws.FILTER(Customers[Names],ISNUMBER(SEARCH(Customers[[#This Row],[Search Criteria]],Customers[Names])),\"No data.\"))))","v":"Adriana Todd"},"Albert Ramirez","Alex Rubio","Amanda Beck","Amparo Orozco","Amy Todd","Angelina Roberson","April Fox","Arden Ayala","Arnoldo Pennington","Aubrey Giles","Bette Rivers","Brianna Alexander","Brianna Mora","Britt Vazquez","Broderick Gillespie","Brooke Roman","Calvin Buck","Carmela Mullins","Carol Stevenson","Carolina Russell","Carolyn Roberts","Chelsea Gilbert","Cheryl Williamson","Christa Frederick","Christian Armstrong","Christopher Stuart","Chung Krueger","Clare Whitney","Clarissa Archer","Claudio Lam","Cordell Mills","Craig Shepherd","Damien Kramer","Dane Burke","Danielle Stout","Darrel Liu","Darrin Mcneil","Darron Aguilar","Della Huber","Delores Krause","Dena Rosario","Dominick Johnston","Dona Herring","Dorothy Winters","Douglas Wiley","Doyle David","Earlene Hester","Earline Shepherd","Edwin Sparks","Eli Galvan","Elinor Kaufman","Elroy Porter","Elvin Flynn","Emmitt Porter","Erik Parsons","Ethel Forbes","Felicia Ware","Fidel Haynes","Francisco Valenzuela","Frank Hunt","Gabriela Moore","Gabrielle Patrick","Gale Fitzpatrick","Gayle Curtis","Genevieve Lucero","Gerry Oneal","Grady Ellis","Grover Escobar","Hans Patel","Horacio Black","Humberto Compton","Hunter Short","Ilene Mcguire","Imelda Lloyd","Ira Macdonald","Issac Allen","Jacques Velazquez","Janis Mullins","Janna Cowan","Javier Garner","Jayson Abbott","Jeannie Tapia","Jefferson Lee","Jeramy Keith","Jermaine Bradshaw","Jewel Lee","Jimmie Yang","Jodie Wood","John Cline","Josefina Dickerson","Josie Pineda","Judith Griffin","Julius Soto","Kelli Romero","Kerri Joseph","Kim Mccall","Lakeisha Velazquez","Latonya Logan","Lee Schmidt","Lela Atkins","Leland Robertson","Leonardo House","Leroy Mcintyre","Lesley Blevins","Lilia Berg","Lilly Stone","Lincoln Bond","Lindsay Hurst","Lionel Fuller","Lorene Hunter","Louis Kidd","Lucius Warren","Lucy Mejia","Lupe Ingram","Lynette Fuller","Lynnette Wright","Madge Copeland","Madge Tanner","Mae Sawyer","Malcolm Newman","Mamie Wong","Mandy Swanson","Marcella Everett","Marco Bright","Marcos Schaefer","Marcus Hays","Marina Walsh","Marion Savage","Marylou Bass","Marylou Mccarthy","Mathew Howard","Maurice Jacobson","Mauricio Bautista","Max Smith","Melanie Bridges","Melissa Brandt","Merlin Wu","Michel Simpson","Mickey Kennedy","Mike Sloan","Milton Walsh","Mohamed Allison","Mohammad Christensen","Nadia Macdonald","Naomi Snyder","Ned Lowe","Nettie Leonard","Olive Perkins","Ophelia Morrow","Oren Montes","Orlando Henderson","Owen Buchanan","Paul Norman","Rafael Barrett","Raymond Cochran","Reed Hooper","Reinaldo Houston","Renato Simmons","Rene Calhoun","Reva Hardin","Robert French","Robin Bender","Rodolfo Scott","Roland Blake","Roland Sullivan","Rolf Barnett","Ross Marquez","Ruthie Daugherty","Sandra Potts","Scott Stephenson","Scotty Gonzales","Sean Wiggins","Shana Gallagher","Sharron Montes","Sheryl Lindsey","Socorro Hayden","Solomon Andrade","Stacey Whitehead","Stevie Hale","Stuart Oliver","Stuart Riddle","Tammy Merritt","Theo Wiley","Theresa Murillo","Timothy Roberts","Tony Torres","Tracy Logan","Troy Hoover","Twila Rubio","Velma Everett","Vincent Mccormick","Vincenzo Stafford","Vito Clark","Waldo Spencer","Werner Lowe","Werner Shepard","Wesley Ford","Wm Cantu","Zelma Pierce"]
[null,null,null,null,null,"Marion Savage",{"$f":"IF('Resulting List'!F98=\"\",\"\",'Resulting List'!F98)","v":""},null,{"$f":"TRANSPOSE(_xlfn._xlws.SORT(_xlfn.UNIQUE(_xlfn._xlws.FILTER(Customers[Names],ISNUMBER(SEARCH(Customers[[#This Row],[Search Criteria]],Customers[Names])),\"No data.\"))))","v":"Adriana Todd"},"Albert Ramirez","Alex Rubio","Amanda Beck","Amparo Orozco","Amy Todd","Angelina Roberson","April Fox","Arden Ayala","Arnoldo Pennington","Aubrey Giles","Bette Rivers","Brianna Alexander","Brianna Mora","Britt Vazquez","Broderick Gillespie","Brooke Roman","Calvin Buck","Carmela Mullins","Carol Stevenson","Carolina Russell","Carolyn Roberts","Chelsea Gilbert","Cheryl Williamson","Christa Frederick","Christian Armstrong","Christopher Stuart","Chung Krueger","Clare Whitney","Clarissa Archer","Claudio Lam","Cordell Mills","Craig Shepherd","Damien Kramer","Dane Burke","Danielle Stout","Darrel Liu","Darrin Mcneil","Darron Aguilar","Della Huber","Delores Krause","Dena Rosario","Dominick Johnston","Dona Herring","Dorothy Winters","Douglas Wiley","Doyle David","Earlene Hester","Earline Shepherd","Edwin Sparks","Eli Galvan","Elinor Kaufman","Elroy Porter","Elvin Flynn","Emmitt Porter","Erik Parsons","Ethel Forbes","Felicia Ware","Fidel Haynes","Francisco Valenzuela","Frank Hunt","Gabriela Moore","Gabrielle Patrick","Gale Fitzpatrick","Gayle Curtis","Genevieve Lucero","Gerry Oneal","Grady Ellis","Grover Escobar","Hans Patel","Horacio Black","Humberto Compton","Hunter Short","Ilene Mcguire","Imelda Lloyd","Ira Macdonald","Issac Allen","Jacques Velazquez","Janis Mullins","Janna Cowan","Javier Garner","Jayson Abbott","Jeannie Tapia","Jefferson Lee","Jeramy Keith","Jermaine Bradshaw","Jewel Lee","Jimmie Yang","Jodie Wood","John Cline","Josefina Dickerson","Josie Pineda","Judith Griffin","Julius Soto","Kelli Romero","Kerri Joseph","Kim Mccall","Lakeisha Velazquez","Latonya Logan","Lee Schmidt","Lela Atkins","Leland Robertson","Leonardo House","Leroy Mcintyre","Lesley Blevins","Lilia Berg","Lilly Stone","Lincoln Bond","Lindsay Hurst","Lionel Fuller","Lorene Hunter","Louis Kidd","Lucius Warren","Lucy Mejia","Lupe Ingram","Lynette Fuller","Lynnette Wright","Madge Copeland","Madge Tanner","Mae Sawyer","Malcolm Newman","Mamie Wong","Mandy Swanson","Marcella Everett","Marco Bright","Marcos Schaefer","Marcus Hays","Marina Walsh","Marion Savage","Marylou Bass","Marylou Mccarthy","Mathew Howard","Maurice Jacobson","Mauricio Bautista","Max Smith","Melanie Bridges","Melissa Brandt","Merlin Wu","Michel Simpson","Mickey Kennedy","Mike Sloan","Milton Walsh","Mohamed Allison","Mohammad Christensen","Nadia Macdonald","Naomi Snyder","Ned Lowe","Nettie Leonard","Olive Perkins","Ophelia Morrow","Oren Montes","Orlando Henderson","Owen Buchanan","Paul Norman","Rafael Barrett","Raymond Cochran","Reed Hooper","Reinaldo Houston","Renato Simmons","Rene Calhoun","Reva Hardin","Robert French","Robin Bender","Rodolfo Scott","Roland Blake","Roland Sullivan","Rolf Barnett","Ross Marquez","Ruthie Daugherty","Sandra Potts","Scott Stephenson","Scotty Gonzales","Sean Wiggins","Shana Gallagher","Sharron Montes","Sheryl Lindsey","Socorro Hayden","Solomon Andrade","Stacey Whitehead","Stevie Hale","Stuart Oliver","Stuart Riddle","Tammy Merritt","Theo Wiley","Theresa Murillo","Timothy Roberts","Tony Torres","Tracy Logan","Troy Hoover","Twila Rubio","Velma Everett","Vincent Mccormick","Vincenzo Stafford","Vito Clark","Waldo Spencer","Werner Lowe","Werner Shepard","Wesley Ford","Wm Cantu","Zelma Pierce"]
[null,null,null,null,null,"Lucy Mejia",{"$f":"IF('Resulting List'!F99=\"\",\"\",'Resulting List'!F99)","v":""},null,{"$f":"TRANSPOSE(_xlfn._xlws.SORT(_xlfn.UNIQUE(_xlfn._xlws.FILTER(Customers[Names],ISNUMBER(SEARCH(Customers[[#This Row],[Search Criteria]],Customers[Names])),\"No data.\"))))","v":"Adriana Todd"},"Albert Ramirez","Alex Rubio","Amanda Beck","Amparo Orozco","Amy Todd","Angelina Roberson","April Fox","Arden Ayala","Arnoldo Pennington","Aubrey Giles","Bette Rivers","Brianna Alexander","Brianna Mora","Britt Vazquez","Broderick Gillespie","Brooke Roman","Calvin Buck","Carmela Mullins","Carol Stevenson","Carolina Russell","Carolyn Roberts","Chelsea Gilbert","Cheryl Williamson","Christa Frederick","Christian Armstrong","Christopher Stuart","Chung Krueger","Clare Whitney","Clarissa Archer","Claudio Lam","Cordell Mills","Craig Shepherd","Damien Kramer","Dane Burke","Danielle Stout","Darrel Liu","Darrin Mcneil","Darron Aguilar","Della Huber","Delores Krause","Dena Rosario","Dominick Johnston","Dona Herring","Dorothy Winters","Douglas Wiley","Doyle David","Earlene Hester","Earline Shepherd","Edwin Sparks","Eli Galvan","Elinor Kaufman","Elroy Porter","Elvin Flynn","Emmitt Porter","Erik Parsons","Ethel Forbes","Felicia Ware","Fidel Haynes","Francisco Valenzuela","Frank Hunt","Gabriela Moore","Gabrielle Patrick","Gale Fitzpatrick","Gayle Curtis","Genevieve Lucero","Gerry Oneal","Grady Ellis","Grover Escobar","Hans Patel","Horacio Black","Humberto Compton","Hunter Short","Ilene Mcguire","Imelda Lloyd","Ira Macdonald","Issac Allen","Jacques Velazquez","Janis Mullins","Janna Cowan","Javier Garner","Jayson Abbott","Jeannie Tapia","Jefferson Lee","Jeramy Keith","Jermaine Bradshaw","Jewel Lee","Jimmie Yang","Jodie Wood","John Cline","Josefina Dickerson","Josie Pineda","Judith Griffin","Julius Soto","Kelli Romero","Kerri Joseph","Kim Mccall","Lakeisha Velazquez","Latonya Logan","Lee Schmidt","Lela Atkins","Leland Robertson","Leonardo House","Leroy Mcintyre","Lesley Blevins","Lilia Berg","Lilly Stone","Lincoln Bond","Lindsay Hurst","Lionel Fuller","Lorene Hunter","Louis Kidd","Lucius Warren","Lucy Mejia","Lupe Ingram","Lynette Fuller","Lynnette Wright","Madge Copeland","Madge Tanner","Mae Sawyer","Malcolm Newman","Mamie Wong","Mandy Swanson","Marcella Everett","Marco Bright","Marcos Schaefer","Marcus Hays","Marina Walsh","Marion Savage","Marylou Bass","Marylou Mccarthy","Mathew Howard","Maurice Jacobson","Mauricio Bautista","Max Smith","Melanie Bridges","Melissa Brandt","Merlin Wu","Michel Simpson","Mickey Kennedy","Mike Sloan","Milton Walsh","Mohamed Allison","Mohammad Christensen","Nadia Macdonald","Naomi Snyder","Ned Lowe","Nettie Leonard","Olive Perkins","Ophelia Morrow","Oren Montes","Orlando Henderson","Owen Buchanan","Paul Norman","Rafael Barrett","Raymond Cochran","Reed Hooper","Reinaldo Houston","Renato Simmons","Rene Calhoun","Reva Hardin","Robert French","Robin Bender","Rodolfo Scott","Roland Blake","Roland Sullivan","Rolf Barnett","Ross Marquez","Ruthie Daugherty","Sandra Potts","Scott Stephenson","Scotty Gonzales","Sean Wiggins","Shana Gallagher","Sharron Montes","Sheryl Lindsey","Socorro Hayden","Solomon Andrade","Stacey Whitehead","Stevie Hale","Stuart Oliver","Stuart Riddle","Tammy Merritt","Theo Wiley","Theresa Murillo","Timothy Roberts","Tony Torres","Tracy Logan","Troy Hoover","Twila Rubio","Velma Everett","Vincent Mccormick","Vincenzo Stafford","Vito Clark","Waldo Spencer","Werner Lowe","Werner Shepard","Wesley Ford","Wm Cantu","Zelma Pierce"]
[null,null,null,null,null,"Marina Walsh",{"$f":"IF('Resulting List'!F100=\"\",\"\",'Resulting List'!F100)","v":""},null,{"$f":"TRANSPOSE(_xlfn._xlws.SORT(_xlfn.UNIQUE(_xlfn._xlws.FILTER(Customers[Names],ISNUMBER(SEARCH(Customers[[#This Row],[Search Criteria]],Customers[Names])),\"No data.\"))))","v":"Adriana Todd"},"Albert Ramirez","Alex Rubio","Amanda Beck","Amparo Orozco","Amy Todd","Angelina Roberson","April Fox","Arden Ayala","Arnoldo Pennington","Aubrey Giles","Bette Rivers","Brianna Alexander","Brianna Mora","Britt Vazquez","Broderick Gillespie","Brooke Roman","Calvin Buck","Carmela Mullins","Carol Stevenson","Carolina Russell","Carolyn Roberts","Chelsea Gilbert","Cheryl Williamson","Christa Frederick","Christian Armstrong","Christopher Stuart","Chung Krueger","Clare Whitney","Clarissa Archer","Claudio Lam","Cordell Mills","Craig Shepherd","Damien Kramer","Dane Burke","Danielle Stout","Darrel Liu","Darrin Mcneil","Darron Aguilar","Della Huber","Delores Krause","Dena Rosario","Dominick Johnston","Dona Herring","Dorothy Winters","Douglas Wiley","Doyle David","Earlene Hester","Earline Shepherd","Edwin Sparks","Eli Galvan","Elinor Kaufman","Elroy Porter","Elvin Flynn","Emmitt Porter","Erik Parsons","Ethel Forbes","Felicia Ware","Fidel Haynes","Francisco Valenzuela","Frank Hunt","Gabriela Moore","Gabrielle Patrick","Gale Fitzpatrick","Gayle Curtis","Genevieve Lucero","Gerry Oneal","Grady Ellis","Grover Escobar","Hans Patel","Horacio Black","Humberto Compton","Hunter Short","Ilene Mcguire","Imelda Lloyd","Ira Macdonald","Issac Allen","Jacques Velazquez","Janis Mullins","Janna Cowan","Javier Garner","Jayson Abbott","Jeannie Tapia","Jefferson Lee","Jeramy Keith","Jermaine Bradshaw","Jewel Lee","Jimmie Yang","Jodie Wood","John Cline","Josefina Dickerson","Josie Pineda","Judith Griffin","Julius Soto","Kelli Romero","Kerri Joseph","Kim Mccall","Lakeisha Velazquez","Latonya Logan","Lee Schmidt","Lela Atkins","Leland Robertson","Leonardo House","Leroy Mcintyre","Lesley Blevins","Lilia Berg","Lilly Stone","Lincoln Bond","Lindsay Hurst","Lionel Fuller","Lorene Hunter","Louis Kidd","Lucius Warren","Lucy Mejia","Lupe Ingram","Lynette Fuller","Lynnette Wright","Madge Copeland","Madge Tanner","Mae Sawyer","Malcolm Newman","Mamie Wong","Mandy Swanson","Marcella Everett","Marco Bright","Marcos Schaefer","Marcus Hays","Marina Walsh","Marion Savage","Marylou Bass","Marylou Mccarthy","Mathew Howard","Maurice Jacobson","Mauricio Bautista","Max Smith","Melanie Bridges","Melissa Brandt","Merlin Wu","Michel Simpson","Mickey Kennedy","Mike Sloan","Milton Walsh","Mohamed Allison","Mohammad Christensen","Nadia Macdonald","Naomi Snyder","Ned Lowe","Nettie Leonard","Olive Perkins","Ophelia Morrow","Oren Montes","Orlando Henderson","Owen Buchanan","Paul Norman","Rafael Barrett","Raymond Cochran","Reed Hooper","Reinaldo Houston","Renato Simmons","Rene Calhoun","Reva Hardin","Robert French","Robin Bender","Rodolfo Scott","Roland Blake","Roland Sullivan","Rolf Barnett","Ross Marquez","Ruthie Daugherty","Sandra Potts","Scott Stephenson","Scotty Gonzales","Sean Wiggins","Shana Gallagher","Sharron Montes","Sheryl Lindsey","Socorro Hayden","Solomon Andrade","Stacey Whitehead","Stevie Hale","Stuart Oliver","Stuart Riddle","Tammy Merritt","Theo Wiley","Theresa Murillo","Timothy Roberts","Tony Torres","Tracy Logan","Troy Hoover","Twila Rubio","Velma Everett","Vincent Mccormick","Vincenzo Stafford","Vito Clark","Waldo Spencer","Werner Lowe","Werner Shepard","Wesley Ford","Wm Cantu","Zelma Pierce"]
[null,null,null,null,null,"Doyle David",{"$f":"IF('Resulting List'!F101=\"\",\"\",'Resulting List'!F101)","v":""},null,{"$f":"TRANSPOSE(_xlfn._xlws.SORT(_xlfn.UNIQUE(_xlfn._xlws.FILTER(Customers[Names],ISNUMBER(SEARCH(Customers[[#This Row],[Search Criteria]],Customers[Names])),\"No data.\"))))","v":"Adriana Todd"},"Albert Ramirez","Alex Rubio","Amanda Beck","Amparo Orozco","Amy Todd","Angelina Roberson","April Fox","Arden Ayala","Arnoldo Pennington","Aubrey Giles","Bette Rivers","Brianna Alexander","Brianna Mora","Britt Vazquez","Broderick Gillespie","Brooke Roman","Calvin Buck","Carmela Mullins","Carol Stevenson","Carolina Russell","Carolyn Roberts","Chelsea Gilbert","Cheryl Williamson","Christa Frederick","Christian Armstrong","Christopher Stuart","Chung Krueger","Clare Whitney","Clarissa Archer","Claudio Lam","Cordell Mills","Craig Shepherd","Damien Kramer","Dane Burke","Danielle Stout","Darrel Liu","Darrin Mcneil","Darron Aguilar","Della Huber","Delores Krause","Dena Rosario","Dominick Johnston","Dona Herring","Dorothy Winters","Douglas Wiley","Doyle David","Earlene Hester","Earline Shepherd","Edwin Sparks","Eli Galvan","Elinor Kaufman","Elroy Porter","Elvin Flynn","Emmitt Porter","Erik Parsons","Ethel Forbes","Felicia Ware","Fidel Haynes","Francisco Valenzuela","Frank Hunt","Gabriela Moore","Gabrielle Patrick","Gale Fitzpatrick","Gayle Curtis","Genevieve Lucero","Gerry Oneal","Grady Ellis","Grover Escobar","Hans Patel","Horacio Black","Humberto Compton","Hunter Short","Ilene Mcguire","Imelda Lloyd","Ira Macdonald","Issac Allen","Jacques Velazquez","Janis Mullins","Janna Cowan","Javier Garner","Jayson Abbott","Jeannie Tapia","Jefferson Lee","Jeramy Keith","Jermaine Bradshaw","Jewel Lee","Jimmie Yang","Jodie Wood","John Cline","Josefina Dickerson","Josie Pineda","Judith Griffin","Julius Soto","Kelli Romero","Kerri Joseph","Kim Mccall","Lakeisha Velazquez","Latonya Logan","Lee Schmidt","Lela Atkins","Leland Robertson","Leonardo House","Leroy Mcintyre","Lesley Blevins","Lilia Berg","Lilly Stone","Lincoln Bond","Lindsay Hurst","Lionel Fuller","Lorene Hunter","Louis Kidd","Lucius Warren","Lucy Mejia","Lupe Ingram","Lynette Fuller","Lynnette Wright","Madge Copeland","Madge Tanner","Mae Sawyer","Malcolm Newman","Mamie Wong","Mandy Swanson","Marcella Everett","Marco Bright","Marcos Schaefer","Marcus Hays","Marina Walsh","Marion Savage","Marylou Bass","Marylou Mccarthy","Mathew Howard","Maurice Jacobson","Mauricio Bautista","Max Smith","Melanie Bridges","Melissa Brandt","Merlin Wu","Michel Simpson","Mickey Kennedy","Mike Sloan","Milton Walsh","Mohamed Allison","Mohammad Christensen","Nadia Macdonald","Naomi Snyder","Ned Lowe","Nettie Leonard","Olive Perkins","Ophelia Morrow","Oren Montes","Orlando Henderson","Owen Buchanan","Paul Norman","Rafael Barrett","Raymond Cochran","Reed Hooper","Reinaldo Houston","Renato Simmons","Rene Calhoun","Reva Hardin","Robert French","Robin Bender","Rodolfo Scott","Roland Blake","Roland Sullivan","Rolf Barnett","Ross Marquez","Ruthie Daugherty","Sandra Potts","Scott Stephenson","Scotty Gonzales","Sean Wiggins","Shana Gallagher","Sharron Montes","Sheryl Lindsey","Socorro Hayden","Solomon Andrade","Stacey Whitehead","Stevie Hale","Stuart Oliver","Stuart Riddle","Tammy Merritt","Theo Wiley","Theresa Murillo","Timothy Roberts","Tony Torres","Tracy Logan","Troy Hoover","Twila Rubio","Velma Everett","Vincent Mccormick","Vincenzo Stafford","Vito Clark","Waldo Spencer","Werner Lowe","Werner Shepard","Wesley Ford","Wm Cantu","Zelma Pierce"]
[null,null,null,null,null,"Melanie Bridges",{"$f":"IF('Resulting List'!F102=\"\",\"\",'Resulting List'!F102)","v":""},null,{"$f":"TRANSPOSE(_xlfn._xlws.SORT(_xlfn.UNIQUE(_xlfn._xlws.FILTER(Customers[Names],ISNUMBER(SEARCH(Customers[[#This Row],[Search Criteria]],Customers[Names])),\"No data.\"))))","v":"Adriana Todd"},"Albert Ramirez","Alex Rubio","Amanda Beck","Amparo Orozco","Amy Todd","Angelina Roberson","April Fox","Arden Ayala","Arnoldo Pennington","Aubrey Giles","Bette Rivers","Brianna Alexander","Brianna Mora","Britt Vazquez","Broderick Gillespie","Brooke Roman","Calvin Buck","Carmela Mullins","Carol Stevenson","Carolina Russell","Carolyn Roberts","Chelsea Gilbert","Cheryl Williamson","Christa Frederick","Christian Armstrong","Christopher Stuart","Chung Krueger","Clare Whitney","Clarissa Archer","Claudio Lam","Cordell Mills","Craig Shepherd","Damien Kramer","Dane Burke","Danielle Stout","Darrel Liu","Darrin Mcneil","Darron Aguilar","Della Huber","Delores Krause","Dena Rosario","Dominick Johnston","Dona Herring","Dorothy Winters","Douglas Wiley","Doyle David","Earlene Hester","Earline Shepherd","Edwin Sparks","Eli Galvan","Elinor Kaufman","Elroy Porter","Elvin Flynn","Emmitt Porter","Erik Parsons","Ethel Forbes","Felicia Ware","Fidel Haynes","Francisco Valenzuela","Frank Hunt","Gabriela Moore","Gabrielle Patrick","Gale Fitzpatrick","Gayle Curtis","Genevieve Lucero","Gerry Oneal","Grady Ellis","Grover Escobar","Hans Patel","Horacio Black","Humberto Compton","Hunter Short","Ilene Mcguire","Imelda Lloyd","Ira Macdonald","Issac Allen","Jacques Velazquez","Janis Mullins","Janna Cowan","Javier Garner","Jayson Abbott","Jeannie Tapia","Jefferson Lee","Jeramy Keith","Jermaine Bradshaw","Jewel Lee","Jimmie Yang","Jodie Wood","John Cline","Josefina Dickerson","Josie Pineda","Judith Griffin","Julius Soto","Kelli Romero","Kerri Joseph","Kim Mccall","Lakeisha Velazquez","Latonya Logan","Lee Schmidt","Lela Atkins","Leland Robertson","Leonardo House","Leroy Mcintyre","Lesley Blevins","Lilia Berg","Lilly Stone","Lincoln Bond","Lindsay Hurst","Lionel Fuller","Lorene Hunter","Louis Kidd","Lucius Warren","Lucy Mejia","Lupe Ingram","Lynette Fuller","Lynnette Wright","Madge Copeland","Madge Tanner","Mae Sawyer","Malcolm Newman","Mamie Wong","Mandy Swanson","Marcella Everett","Marco Bright","Marcos Schaefer","Marcus Hays","Marina Walsh","Marion Savage","Marylou Bass","Marylou Mccarthy","Mathew Howard","Maurice Jacobson","Mauricio Bautista","Max Smith","Melanie Bridges","Melissa Brandt","Merlin Wu","Michel Simpson","Mickey Kennedy","Mike Sloan","Milton Walsh","Mohamed Allison","Mohammad Christensen","Nadia Macdonald","Naomi Snyder","Ned Lowe","Nettie Leonard","Olive Perkins","Ophelia Morrow","Oren Montes","Orlando Henderson","Owen Buchanan","Paul Norman","Rafael Barrett","Raymond Cochran","Reed Hooper","Reinaldo Houston","Renato Simmons","Rene Calhoun","Reva Hardin","Robert French","Robin Bender","Rodolfo Scott","Roland Blake","Roland Sullivan","Rolf Barnett","Ross Marquez","Ruthie Daugherty","Sandra Potts","Scott Stephenson","Scotty Gonzales","Sean Wiggins","Shana Gallagher","Sharron Montes","Sheryl Lindsey","Socorro Hayden","Solomon Andrade","Stacey Whitehead","Stevie Hale","Stuart Oliver","Stuart Riddle","Tammy Merritt","Theo Wiley","Theresa Murillo","Timothy Roberts","Tony Torres","Tracy Logan","Troy Hoover","Twila Rubio","Velma Everett","Vincent Mccormick","Vincenzo Stafford","Vito Clark","Waldo Spencer","Werner Lowe","Werner Shepard","Wesley Ford","Wm Cantu","Zelma Pierce"]
[null,null,null,null,null,"Wm Cantu",{"$f":"IF('Resulting List'!F103=\"\",\"\",'Resulting List'!F103)","v":""},null,{"$f":"TRANSPOSE(_xlfn._xlws.SORT(_xlfn.UNIQUE(_xlfn._xlws.FILTER(Customers[Names],ISNUMBER(SEARCH(Customers[[#This Row],[Search Criteria]],Customers[Names])),\"No data.\"))))","v":"Adriana Todd"},"Albert Ramirez","Alex Rubio","Amanda Beck","Amparo Orozco","Amy Todd","Angelina Roberson","April Fox","Arden Ayala","Arnoldo Pennington","Aubrey Giles","Bette Rivers","Brianna Alexander","Brianna Mora","Britt Vazquez","Broderick Gillespie","Brooke Roman","Calvin Buck","Carmela Mullins","Carol Stevenson","Carolina Russell","Carolyn Roberts","Chelsea Gilbert","Cheryl Williamson","Christa Frederick","Christian Armstrong","Christopher Stuart","Chung Krueger","Clare Whitney","Clarissa Archer","Claudio Lam","Cordell Mills","Craig Shepherd","Damien Kramer","Dane Burke","Danielle Stout","Darrel Liu","Darrin Mcneil","Darron Aguilar","Della Huber","Delores Krause","Dena Rosario","Dominick Johnston","Dona Herring","Dorothy Winters","Douglas Wiley","Doyle David","Earlene Hester","Earline Shepherd","Edwin Sparks","Eli Galvan","Elinor Kaufman","Elroy Porter","Elvin Flynn","Emmitt Porter","Erik Parsons","Ethel Forbes","Felicia Ware","Fidel Haynes","Francisco Valenzuela","Frank Hunt","Gabriela Moore","Gabrielle Patrick","Gale Fitzpatrick","Gayle Curtis","Genevieve Lucero","Gerry Oneal","Grady Ellis","Grover Escobar","Hans Patel","Horacio Black","Humberto Compton","Hunter Short","Ilene Mcguire","Imelda Lloyd","Ira Macdonald","Issac Allen","Jacques Velazquez","Janis Mullins","Janna Cowan","Javier Garner","Jayson Abbott","Jeannie Tapia","Jefferson Lee","Jeramy Keith","Jermaine Bradshaw","Jewel Lee","Jimmie Yang","Jodie Wood","John Cline","Josefina Dickerson","Josie Pineda","Judith Griffin","Julius Soto","Kelli Romero","Kerri Joseph","Kim Mccall","Lakeisha Velazquez","Latonya Logan","Lee Schmidt","Lela Atkins","Leland Robertson","Leonardo House","Leroy Mcintyre","Lesley Blevins","Lilia Berg","Lilly Stone","Lincoln Bond","Lindsay Hurst","Lionel Fuller","Lorene Hunter","Louis Kidd","Lucius Warren","Lucy Mejia","Lupe Ingram","Lynette Fuller","Lynnette Wright","Madge Copeland","Madge Tanner","Mae Sawyer","Malcolm Newman","Mamie Wong","Mandy Swanson","Marcella Everett","Marco Bright","Marcos Schaefer","Marcus Hays","Marina Walsh","Marion Savage","Marylou Bass","Marylou Mccarthy","Mathew Howard","Maurice Jacobson","Mauricio Bautista","Max Smith","Melanie Bridges","Melissa Brandt","Merlin Wu","Michel Simpson","Mickey Kennedy","Mike Sloan","Milton Walsh","Mohamed Allison","Mohammad Christensen","Nadia Macdonald","Naomi Snyder","Ned Lowe","Nettie Leonard","Olive Perkins","Ophelia Morrow","Oren Montes","Orlando Henderson","Owen Buchanan","Paul Norman","Rafael Barrett","Raymond Cochran","Reed Hooper","Reinaldo Houston","Renato Simmons","Rene Calhoun","Reva Hardin","Robert French","Robin Bender","Rodolfo Scott","Roland Blake","Roland Sullivan","Rolf Barnett","Ross Marquez","Ruthie Daugherty","Sandra Potts","Scott Stephenson","Scotty Gonzales","Sean Wiggins","Shana Gallagher","Sharron Montes","Sheryl Lindsey","Socorro Hayden","Solomon Andrade","Stacey Whitehead","Stevie Hale","Stuart Oliver","Stuart Riddle","Tammy Merritt","Theo Wiley","Theresa Murillo","Timothy Roberts","Tony Torres","Tracy Logan","Troy Hoover","Twila Rubio","Velma Everett","Vincent Mccormick","Vincenzo Stafford","Vito Clark","Waldo Spencer","Werner Lowe","Werner Shepard","Wesley Ford","Wm Cantu","Zelma Pierce"]
[null,null,null,null,null,"Melissa Brandt",{"$f":"IF('Resulting List'!F104=\"\",\"\",'Resulting List'!F104)","v":""},null,{"$f":"TRANSPOSE(_xlfn._xlws.SORT(_xlfn.UNIQUE(_xlfn._xlws.FILTER(Customers[Names],ISNUMBER(SEARCH(Customers[[#This Row],[Search Criteria]],Customers[Names])),\"No data.\"))))","v":"Adriana Todd"},"Albert Ramirez","Alex Rubio","Amanda Beck","Amparo Orozco","Amy Todd","Angelina Roberson","April Fox","Arden Ayala","Arnoldo Pennington","Aubrey Giles","Bette Rivers","Brianna Alexander","Brianna Mora","Britt Vazquez","Broderick Gillespie","Brooke Roman","Calvin Buck","Carmela Mullins","Carol Stevenson","Carolina Russell","Carolyn Roberts","Chelsea Gilbert","Cheryl Williamson","Christa Frederick","Christian Armstrong","Christopher Stuart","Chung Krueger","Clare Whitney","Clarissa Archer","Claudio Lam","Cordell Mills","Craig Shepherd","Damien Kramer","Dane Burke","Danielle Stout","Darrel Liu","Darrin Mcneil","Darron Aguilar","Della Huber","Delores Krause","Dena Rosario","Dominick Johnston","Dona Herring","Dorothy Winters","Douglas Wiley","Doyle David","Earlene Hester","Earline Shepherd","Edwin Sparks","Eli Galvan","Elinor Kaufman","Elroy Porter","Elvin Flynn","Emmitt Porter","Erik Parsons","Ethel Forbes","Felicia Ware","Fidel Haynes","Francisco Valenzuela","Frank Hunt","Gabriela Moore","Gabrielle Patrick","Gale Fitzpatrick","Gayle Curtis","Genevieve Lucero","Gerry Oneal","Grady Ellis","Grover Escobar","Hans Patel","Horacio Black","Humberto Compton","Hunter Short","Ilene Mcguire","Imelda Lloyd","Ira Macdonald","Issac Allen","Jacques Velazquez","Janis Mullins","Janna Cowan","Javier Garner","Jayson Abbott","Jeannie Tapia","Jefferson Lee","Jeramy Keith","Jermaine Bradshaw","Jewel Lee","Jimmie Yang","Jodie Wood","John Cline","Josefina Dickerson","Josie Pineda","Judith Griffin","Julius Soto","Kelli Romero","Kerri Joseph","Kim Mccall","Lakeisha Velazquez","Latonya Logan","Lee Schmidt","Lela Atkins","Leland Robertson","Leonardo House","Leroy Mcintyre","Lesley Blevins","Lilia Berg","Lilly Stone","Lincoln Bond","Lindsay Hurst","Lionel Fuller","Lorene Hunter","Louis Kidd","Lucius Warren","Lucy Mejia","Lupe Ingram","Lynette Fuller","Lynnette Wright","Madge Copeland","Madge Tanner","Mae Sawyer","Malcolm Newman","Mamie Wong","Mandy Swanson","Marcella Everett","Marco Bright","Marcos Schaefer","Marcus Hays","Marina Walsh","Marion Savage","Marylou Bass","Marylou Mccarthy","Mathew Howard","Maurice Jacobson","Mauricio Bautista","Max Smith","Melanie Bridges","Melissa Brandt","Merlin Wu","Michel Simpson","Mickey Kennedy","Mike Sloan","Milton Walsh","Mohamed Allison","Mohammad Christensen","Nadia Macdonald","Naomi Snyder","Ned Lowe","Nettie Leonard","Olive Perkins","Ophelia Morrow","Oren Montes","Orlando Henderson","Owen Buchanan","Paul Norman","Rafael Barrett","Raymond Cochran","Reed Hooper","Reinaldo Houston","Renato Simmons","Rene Calhoun","Reva Hardin","Robert French","Robin Bender","Rodolfo Scott","Roland Blake","Roland Sullivan","Rolf Barnett","Ross Marquez","Ruthie Daugherty","Sandra Potts","Scott Stephenson","Scotty Gonzales","Sean Wiggins","Shana Gallagher","Sharron Montes","Sheryl Lindsey","Socorro Hayden","Solomon Andrade","Stacey Whitehead","Stevie Hale","Stuart Oliver","Stuart Riddle","Tammy Merritt","Theo Wiley","Theresa Murillo","Timothy Roberts","Tony Torres","Tracy Logan","Troy Hoover","Twila Rubio","Velma Everett","Vincent Mccormick","Vincenzo Stafford","Vito Clark","Waldo Spencer","Werner Lowe","Werner Shepard","Wesley Ford","Wm Cantu","Zelma Pierce"]
[null,null,null,null,null,"Olive Perkins",{"$f":"IF('Resulting List'!F105=\"\",\"\",'Resulting List'!F105)","v":""},null,{"$f":"TRANSPOSE(_xlfn._xlws.SORT(_xlfn.UNIQUE(_xlfn._xlws.FILTER(Customers[Names],ISNUMBER(SEARCH(Customers[[#This Row],[Search Criteria]],Customers[Names])),\"No data.\"))))","v":"Adriana Todd"},"Albert Ramirez","Alex Rubio","Amanda Beck","Amparo Orozco","Amy Todd","Angelina Roberson","April Fox","Arden Ayala","Arnoldo Pennington","Aubrey Giles","Bette Rivers","Brianna Alexander","Brianna Mora","Britt Vazquez","Broderick Gillespie","Brooke Roman","Calvin Buck","Carmela Mullins","Carol Stevenson","Carolina Russell","Carolyn Roberts","Chelsea Gilbert","Cheryl Williamson","Christa Frederick","Christian Armstrong","Christopher Stuart","Chung Krueger","Clare Whitney","Clarissa Archer","Claudio Lam","Cordell Mills","Craig Shepherd","Damien Kramer","Dane Burke","Danielle Stout","Darrel Liu","Darrin Mcneil","Darron Aguilar","Della Huber","Delores Krause","Dena Rosario","Dominick Johnston","Dona Herring","Dorothy Winters","Douglas Wiley","Doyle David","Earlene Hester","Earline Shepherd","Edwin Sparks","Eli Galvan","Elinor Kaufman","Elroy Porter","Elvin Flynn","Emmitt Porter","Erik Parsons","Ethel Forbes","Felicia Ware","Fidel Haynes","Francisco Valenzuela","Frank Hunt","Gabriela Moore","Gabrielle Patrick","Gale Fitzpatrick","Gayle Curtis","Genevieve Lucero","Gerry Oneal","Grady Ellis","Grover Escobar","Hans Patel","Horacio Black","Humberto Compton","Hunter Short","Ilene Mcguire","Imelda Lloyd","Ira Macdonald","Issac Allen","Jacques Velazquez","Janis Mullins","Janna Cowan","Javier Garner","Jayson Abbott","Jeannie Tapia","Jefferson Lee","Jeramy Keith","Jermaine Bradshaw","Jewel Lee","Jimmie Yang","Jodie Wood","John Cline","Josefina Dickerson","Josie Pineda","Judith Griffin","Julius Soto","Kelli Romero","Kerri Joseph","Kim Mccall","Lakeisha Velazquez","Latonya Logan","Lee Schmidt","Lela Atkins","Leland Robertson","Leonardo House","Leroy Mcintyre","Lesley Blevins","Lilia Berg","Lilly Stone","Lincoln Bond","Lindsay Hurst","Lionel Fuller","Lorene Hunter","Louis Kidd","Lucius Warren","Lucy Mejia","Lupe Ingram","Lynette Fuller","Lynnette Wright","Madge Copeland","Madge Tanner","Mae Sawyer","Malcolm Newman","Mamie Wong","Mandy Swanson","Marcella Everett","Marco Bright","Marcos Schaefer","Marcus Hays","Marina Walsh","Marion Savage","Marylou Bass","Marylou Mccarthy","Mathew Howard","Maurice Jacobson","Mauricio Bautista","Max Smith","Melanie Bridges","Melissa Brandt","Merlin Wu","Michel Simpson","Mickey Kennedy","Mike Sloan","Milton Walsh","Mohamed Allison","Mohammad Christensen","Nadia Macdonald","Naomi Snyder","Ned Lowe","Nettie Leonard","Olive Perkins","Ophelia Morrow","Oren Montes","Orlando Henderson","Owen Buchanan","Paul Norman","Rafael Barrett","Raymond Cochran","Reed Hooper","Reinaldo Houston","Renato Simmons","Rene Calhoun","Reva Hardin","Robert French","Robin Bender","Rodolfo Scott","Roland Blake","Roland Sullivan","Rolf Barnett","Ross Marquez","Ruthie Daugherty","Sandra Potts","Scott Stephenson","Scotty Gonzales","Sean Wiggins","Shana Gallagher","Sharron Montes","Sheryl Lindsey","Socorro Hayden","Solomon Andrade","Stacey Whitehead","Stevie Hale","Stuart Oliver","Stuart Riddle","Tammy Merritt","Theo Wiley","Theresa Murillo","Timothy Roberts","Tony Torres","Tracy Logan","Troy Hoover","Twila Rubio","Velma Everett","Vincent Mccormick","Vincenzo Stafford","Vito Clark","Waldo Spencer","Werner Lowe","Werner Shepard","Wesley Ford","Wm Cantu","Zelma Pierce"]
[null,null,null,null,null,"Aubrey Giles",{"$f":"IF('Resulting List'!F106=\"\",\"\",'Resulting List'!F106)","v":""},null,{"$f":"TRANSPOSE(_xlfn._xlws.SORT(_xlfn.UNIQUE(_xlfn._xlws.FILTER(Customers[Names],ISNUMBER(SEARCH(Customers[[#This Row],[Search Criteria]],Customers[Names])),\"No data.\"))))","v":"Adriana Todd"},"Albert Ramirez","Alex Rubio","Amanda Beck","Amparo Orozco","Amy Todd","Angelina Roberson","April Fox","Arden Ayala","Arnoldo Pennington","Aubrey Giles","Bette Rivers","Brianna Alexander","Brianna Mora","Britt Vazquez","Broderick Gillespie","Brooke Roman","Calvin Buck","Carmela Mullins","Carol Stevenson","Carolina Russell","Carolyn Roberts","Chelsea Gilbert","Cheryl Williamson","Christa Frederick","Christian Armstrong","Christopher Stuart","Chung Krueger","Clare Whitney","Clarissa Archer","Claudio Lam","Cordell Mills","Craig Shepherd","Damien Kramer","Dane Burke","Danielle Stout","Darrel Liu","Darrin Mcneil","Darron Aguilar","Della Huber","Delores Krause","Dena Rosario","Dominick Johnston","Dona Herring","Dorothy Winters","Douglas Wiley","Doyle David","Earlene Hester","Earline Shepherd","Edwin Sparks","Eli Galvan","Elinor Kaufman","Elroy Porter","Elvin Flynn","Emmitt Porter","Erik Parsons","Ethel Forbes","Felicia Ware","Fidel Haynes","Francisco Valenzuela","Frank Hunt","Gabriela Moore","Gabrielle Patrick","Gale Fitzpatrick","Gayle Curtis","Genevieve Lucero","Gerry Oneal","Grady Ellis","Grover Escobar","Hans Patel","Horacio Black","Humberto Compton","Hunter Short","Ilene Mcguire","Imelda Lloyd","Ira Macdonald","Issac Allen","Jacques Velazquez","Janis Mullins","Janna Cowan","Javier Garner","Jayson Abbott","Jeannie Tapia","Jefferson Lee","Jeramy Keith","Jermaine Bradshaw","Jewel Lee","Jimmie Yang","Jodie Wood","John Cline","Josefina Dickerson","Josie Pineda","Judith Griffin","Julius Soto","Kelli Romero","Kerri Joseph","Kim Mccall","Lakeisha Velazquez","Latonya Logan","Lee Schmidt","Lela Atkins","Leland Robertson","Leonardo House","Leroy Mcintyre","Lesley Blevins","Lilia Berg","Lilly Stone","Lincoln Bond","Lindsay Hurst","Lionel Fuller","Lorene Hunter","Louis Kidd","Lucius Warren","Lucy Mejia","Lupe Ingram","Lynette Fuller","Lynnette Wright","Madge Copeland","Madge Tanner","Mae Sawyer","Malcolm Newman","Mamie Wong","Mandy Swanson","Marcella Everett","Marco Bright","Marcos Schaefer","Marcus Hays","Marina Walsh","Marion Savage","Marylou Bass","Marylou Mccarthy","Mathew Howard","Maurice Jacobson","Mauricio Bautista","Max Smith","Melanie Bridges","Melissa Brandt","Merlin Wu","Michel Simpson","Mickey Kennedy","Mike Sloan","Milton Walsh","Mohamed Allison","Mohammad Christensen","Nadia Macdonald","Naomi Snyder","Ned Lowe","Nettie Leonard","Olive Perkins","Ophelia Morrow","Oren Montes","Orlando Henderson","Owen Buchanan","Paul Norman","Rafael Barrett","Raymond Cochran","Reed Hooper","Reinaldo Houston","Renato Simmons","Rene Calhoun","Reva Hardin","Robert French","Robin Bender","Rodolfo Scott","Roland Blake","Roland Sullivan","Rolf Barnett","Ross Marquez","Ruthie Daugherty","Sandra Potts","Scott Stephenson","Scotty Gonzales","Sean Wiggins","Shana Gallagher","Sharron Montes","Sheryl Lindsey","Socorro Hayden","Solomon Andrade","Stacey Whitehead","Stevie Hale","Stuart Oliver","Stuart Riddle","Tammy Merritt","Theo Wiley","Theresa Murillo","Timothy Roberts","Tony Torres","Tracy Logan","Troy Hoover","Twila Rubio","Velma Everett","Vincent Mccormick","Vincenzo Stafford","Vito Clark","Waldo Spencer","Werner Lowe","Werner Shepard","Wesley Ford","Wm Cantu","Zelma Pierce"]
[null,null,null,null,null,"Orlando Henderson",{"$f":"IF('Resulting List'!F107=\"\",\"\",'Resulting List'!F107)","v":""},null,{"$f":"TRANSPOSE(_xlfn._xlws.SORT(_xlfn.UNIQUE(_xlfn._xlws.FILTER(Customers[Names],ISNUMBER(SEARCH(Customers[[#This Row],[Search Criteria]],Customers[Names])),\"No data.\"))))","v":"Adriana Todd"},"Albert Ramirez","Alex Rubio","Amanda Beck","Amparo Orozco","Amy Todd","Angelina Roberson","April Fox","Arden Ayala","Arnoldo Pennington","Aubrey Giles","Bette Rivers","Brianna Alexander","Brianna Mora","Britt Vazquez","Broderick Gillespie","Brooke Roman","Calvin Buck","Carmela Mullins","Carol Stevenson","Carolina Russell","Carolyn Roberts","Chelsea Gilbert","Cheryl Williamson","Christa Frederick","Christian Armstrong","Christopher Stuart","Chung Krueger","Clare Whitney","Clarissa Archer","Claudio Lam","Cordell Mills","Craig Shepherd","Damien Kramer","Dane Burke","Danielle Stout","Darrel Liu","Darrin Mcneil","Darron Aguilar","Della Huber","Delores Krause","Dena Rosario","Dominick Johnston","Dona Herring","Dorothy Winters","Douglas Wiley","Doyle David","Earlene Hester","Earline Shepherd","Edwin Sparks","Eli Galvan","Elinor Kaufman","Elroy Porter","Elvin Flynn","Emmitt Porter","Erik Parsons","Ethel Forbes","Felicia Ware","Fidel Haynes","Francisco Valenzuela","Frank Hunt","Gabriela Moore","Gabrielle Patrick","Gale Fitzpatrick","Gayle Curtis","Genevieve Lucero","Gerry Oneal","Grady Ellis","Grover Escobar","Hans Patel","Horacio Black","Humberto Compton","Hunter Short","Ilene Mcguire","Imelda Lloyd","Ira Macdonald","Issac Allen","Jacques Velazquez","Janis Mullins","Janna Cowan","Javier Garner","Jayson Abbott","Jeannie Tapia","Jefferson Lee","Jeramy Keith","Jermaine Bradshaw","Jewel Lee","Jimmie Yang","Jodie Wood","John Cline","Josefina Dickerson","Josie Pineda","Judith Griffin","Julius Soto","Kelli Romero","Kerri Joseph","Kim Mccall","Lakeisha Velazquez","Latonya Logan","Lee Schmidt","Lela Atkins","Leland Robertson","Leonardo House","Leroy Mcintyre","Lesley Blevins","Lilia Berg","Lilly Stone","Lincoln Bond","Lindsay Hurst","Lionel Fuller","Lorene Hunter","Louis Kidd","Lucius Warren","Lucy Mejia","Lupe Ingram","Lynette Fuller","Lynnette Wright","Madge Copeland","Madge Tanner","Mae Sawyer","Malcolm Newman","Mamie Wong","Mandy Swanson","Marcella Everett","Marco Bright","Marcos Schaefer","Marcus Hays","Marina Walsh","Marion Savage","Marylou Bass","Marylou Mccarthy","Mathew Howard","Maurice Jacobson","Mauricio Bautista","Max Smith","Melanie Bridges","Melissa Brandt","Merlin Wu","Michel Simpson","Mickey Kennedy","Mike Sloan","Milton Walsh","Mohamed Allison","Mohammad Christensen","Nadia Macdonald","Naomi Snyder","Ned Lowe","Nettie Leonard","Olive Perkins","Ophelia Morrow","Oren Montes","Orlando Henderson","Owen Buchanan","Paul Norman","Rafael Barrett","Raymond Cochran","Reed Hooper","Reinaldo Houston","Renato Simmons","Rene Calhoun","Reva Hardin","Robert French","Robin Bender","Rodolfo Scott","Roland Blake","Roland Sullivan","Rolf Barnett","Ross Marquez","Ruthie Daugherty","Sandra Potts","Scott Stephenson","Scotty Gonzales","Sean Wiggins","Shana Gallagher","Sharron Montes","Sheryl Lindsey","Socorro Hayden","Solomon Andrade","Stacey Whitehead","Stevie Hale","Stuart Oliver","Stuart Riddle","Tammy Merritt","Theo Wiley","Theresa Murillo","Timothy Roberts","Tony Torres","Tracy Logan","Troy Hoover","Twila Rubio","Velma Everett","Vincent Mccormick","Vincenzo Stafford","Vito Clark","Waldo Spencer","Werner Lowe","Werner Shepard","Wesley Ford","Wm Cantu","Zelma Pierce"]
[null,null,null,null,null,"Janis Mullins",{"$f":"IF('Resulting List'!F108=\"\",\"\",'Resulting List'!F108)","v":""},null,{"$f":"TRANSPOSE(_xlfn._xlws.SORT(_xlfn.UNIQUE(_xlfn._xlws.FILTER(Customers[Names],ISNUMBER(SEARCH(Customers[[#This Row],[Search Criteria]],Customers[Names])),\"No data.\"))))","v":"Adriana Todd"},"Albert Ramirez","Alex Rubio","Amanda Beck","Amparo Orozco","Amy Todd","Angelina Roberson","April Fox","Arden Ayala","Arnoldo Pennington","Aubrey Giles","Bette Rivers","Brianna Alexander","Brianna Mora","Britt Vazquez","Broderick Gillespie","Brooke Roman","Calvin Buck","Carmela Mullins","Carol Stevenson","Carolina Russell","Carolyn Roberts","Chelsea Gilbert","Cheryl Williamson","Christa Frederick","Christian Armstrong","Christopher Stuart","Chung Krueger","Clare Whitney","Clarissa Archer","Claudio Lam","Cordell Mills","Craig Shepherd","Damien Kramer","Dane Burke","Danielle Stout","Darrel Liu","Darrin Mcneil","Darron Aguilar","Della Huber","Delores Krause","Dena Rosario","Dominick Johnston","Dona Herring","Dorothy Winters","Douglas Wiley","Doyle David","Earlene Hester","Earline Shepherd","Edwin Sparks","Eli Galvan","Elinor Kaufman","Elroy Porter","Elvin Flynn","Emmitt Porter","Erik Parsons","Ethel Forbes","Felicia Ware","Fidel Haynes","Francisco Valenzuela","Frank Hunt","Gabriela Moore","Gabrielle Patrick","Gale Fitzpatrick","Gayle Curtis","Genevieve Lucero","Gerry Oneal","Grady Ellis","Grover Escobar","Hans Patel","Horacio Black","Humberto Compton","Hunter Short","Ilene Mcguire","Imelda Lloyd","Ira Macdonald","Issac Allen","Jacques Velazquez","Janis Mullins","Janna Cowan","Javier Garner","Jayson Abbott","Jeannie Tapia","Jefferson Lee","Jeramy Keith","Jermaine Bradshaw","Jewel Lee","Jimmie Yang","Jodie Wood","John Cline","Josefina Dickerson","Josie Pineda","Judith Griffin","Julius Soto","Kelli Romero","Kerri Joseph","Kim Mccall","Lakeisha Velazquez","Latonya Logan","Lee Schmidt","Lela Atkins","Leland Robertson","Leonardo House","Leroy Mcintyre","Lesley Blevins","Lilia Berg","Lilly Stone","Lincoln Bond","Lindsay Hurst","Lionel Fuller","Lorene Hunter","Louis Kidd","Lucius Warren","Lucy Mejia","Lupe Ingram","Lynette Fuller","Lynnette Wright","Madge Copeland","Madge Tanner","Mae Sawyer","Malcolm Newman","Mamie Wong","Mandy Swanson","Marcella Everett","Marco Bright","Marcos Schaefer","Marcus Hays","Marina Walsh","Marion Savage","Marylou Bass","Marylou Mccarthy","Mathew Howard","Maurice Jacobson","Mauricio Bautista","Max Smith","Melanie Bridges","Melissa Brandt","Merlin Wu","Michel Simpson","Mickey Kennedy","Mike Sloan","Milton Walsh","Mohamed Allison","Mohammad Christensen","Nadia Macdonald","Naomi Snyder","Ned Lowe","Nettie Leonard","Olive Perkins","Ophelia Morrow","Oren Montes","Orlando Henderson","Owen Buchanan","Paul Norman","Rafael Barrett","Raymond Cochran","Reed Hooper","Reinaldo Houston","Renato Simmons","Rene Calhoun","Reva Hardin","Robert French","Robin Bender","Rodolfo Scott","Roland Blake","Roland Sullivan","Rolf Barnett","Ross Marquez","Ruthie Daugherty","Sandra Potts","Scott Stephenson","Scotty Gonzales","Sean Wiggins","Shana Gallagher","Sharron Montes","Sheryl Lindsey","Socorro Hayden","Solomon Andrade","Stacey Whitehead","Stevie Hale","Stuart Oliver","Stuart Riddle","Tammy Merritt","Theo Wiley","Theresa Murillo","Timothy Roberts","Tony Torres","Tracy Logan","Troy Hoover","Twila Rubio","Velma Everett","Vincent Mccormick","Vincenzo Stafford","Vito Clark","Waldo Spencer","Werner Lowe","Werner Shepard","Wesley Ford","Wm Cantu","Zelma Pierce"]
[null,null,null,null,null,"Theresa Murillo",{"$f":"IF('Resulting List'!F109=\"\",\"\",'Resulting List'!F109)","v":""},null,{"$f":"TRANSPOSE(_xlfn._xlws.SORT(_xlfn.UNIQUE(_xlfn._xlws.FILTER(Customers[Names],ISNUMBER(SEARCH(Customers[[#This Row],[Search Criteria]],Customers[Names])),\"No data.\"))))","v":"Adriana Todd"},"Albert Ramirez","Alex Rubio","Amanda Beck","Amparo Orozco","Amy Todd","Angelina Roberson","April Fox","Arden Ayala","Arnoldo Pennington","Aubrey Giles","Bette Rivers","Brianna Alexander","Brianna Mora","Britt Vazquez","Broderick Gillespie","Brooke Roman","Calvin Buck","Carmela Mullins","Carol Stevenson","Carolina Russell","Carolyn Roberts","Chelsea Gilbert","Cheryl Williamson","Christa Frederick","Christian Armstrong","Christopher Stuart","Chung Krueger","Clare Whitney","Clarissa Archer","Claudio Lam","Cordell Mills","Craig Shepherd","Damien Kramer","Dane Burke","Danielle Stout","Darrel Liu","Darrin Mcneil","Darron Aguilar","Della Huber","Delores Krause","Dena Rosario","Dominick Johnston","Dona Herring","Dorothy Winters","Douglas Wiley","Doyle David","Earlene Hester","Earline Shepherd","Edwin Sparks","Eli Galvan","Elinor Kaufman","Elroy Porter","Elvin Flynn","Emmitt Porter","Erik Parsons","Ethel Forbes","Felicia Ware","Fidel Haynes","Francisco Valenzuela","Frank Hunt","Gabriela Moore","Gabrielle Patrick","Gale Fitzpatrick","Gayle Curtis","Genevieve Lucero","Gerry Oneal","Grady Ellis","Grover Escobar","Hans Patel","Horacio Black","Humberto Compton","Hunter Short","Ilene Mcguire","Imelda Lloyd","Ira Macdonald","Issac Allen","Jacques Velazquez","Janis Mullins","Janna Cowan","Javier Garner","Jayson Abbott","Jeannie Tapia","Jefferson Lee","Jeramy Keith","Jermaine Bradshaw","Jewel Lee","Jimmie Yang","Jodie Wood","John Cline","Josefina Dickerson","Josie Pineda","Judith Griffin","Julius Soto","Kelli Romero","Kerri Joseph","Kim Mccall","Lakeisha Velazquez","Latonya Logan","Lee Schmidt","Lela Atkins","Leland Robertson","Leonardo House","Leroy Mcintyre","Lesley Blevins","Lilia Berg","Lilly Stone","Lincoln Bond","Lindsay Hurst","Lionel Fuller","Lorene Hunter","Louis Kidd","Lucius Warren","Lucy Mejia","Lupe Ingram","Lynette Fuller","Lynnette Wright","Madge Copeland","Madge Tanner","Mae Sawyer","Malcolm Newman","Mamie Wong","Mandy Swanson","Marcella Everett","Marco Bright","Marcos Schaefer","Marcus Hays","Marina Walsh","Marion Savage","Marylou Bass","Marylou Mccarthy","Mathew Howard","Maurice Jacobson","Mauricio Bautista","Max Smith","Melanie Bridges","Melissa Brandt","Merlin Wu","Michel Simpson","Mickey Kennedy","Mike Sloan","Milton Walsh","Mohamed Allison","Mohammad Christensen","Nadia Macdonald","Naomi Snyder","Ned Lowe","Nettie Leonard","Olive Perkins","Ophelia Morrow","Oren Montes","Orlando Henderson","Owen Buchanan","Paul Norman","Rafael Barrett","Raymond Cochran","Reed Hooper","Reinaldo Houston","Renato Simmons","Rene Calhoun","Reva Hardin","Robert French","Robin Bender","Rodolfo Scott","Roland Blake","Roland Sullivan","Rolf Barnett","Ross Marquez","Ruthie Daugherty","Sandra Potts","Scott Stephenson","Scotty Gonzales","Sean Wiggins","Shana Gallagher","Sharron Montes","Sheryl Lindsey","Socorro Hayden","Solomon Andrade","Stacey Whitehead","Stevie Hale","Stuart Oliver","Stuart Riddle","Tammy Merritt","Theo Wiley","Theresa Murillo","Timothy Roberts","Tony Torres","Tracy Logan","Troy Hoover","Twila Rubio","Velma Everett","Vincent Mccormick","Vincenzo Stafford","Vito Clark","Waldo Spencer","Werner Lowe","Werner Shepard","Wesley Ford","Wm Cantu","Zelma Pierce"]
[null,null,null,null,null,"Marcos Schaefer",{"$f":"IF('Resulting List'!F110=\"\",\"\",'Resulting List'!F110)","v":""},null,{"$f":"TRANSPOSE(_xlfn._xlws.SORT(_xlfn.UNIQUE(_xlfn._xlws.FILTER(Customers[Names],ISNUMBER(SEARCH(Customers[[#This Row],[Search Criteria]],Customers[Names])),\"No data.\"))))","v":"Adriana Todd"},"Albert Ramirez","Alex Rubio","Amanda Beck","Amparo Orozco","Amy Todd","Angelina Roberson","April Fox","Arden Ayala","Arnoldo Pennington","Aubrey Giles","Bette Rivers","Brianna Alexander","Brianna Mora","Britt Vazquez","Broderick Gillespie","Brooke Roman","Calvin Buck","Carmela Mullins","Carol Stevenson","Carolina Russell","Carolyn Roberts","Chelsea Gilbert","Cheryl Williamson","Christa Frederick","Christian Armstrong","Christopher Stuart","Chung Krueger","Clare Whitney","Clarissa Archer","Claudio Lam","Cordell Mills","Craig Shepherd","Damien Kramer","Dane Burke","Danielle Stout","Darrel Liu","Darrin Mcneil","Darron Aguilar","Della Huber","Delores Krause","Dena Rosario","Dominick Johnston","Dona Herring","Dorothy Winters","Douglas Wiley","Doyle David","Earlene Hester","Earline Shepherd","Edwin Sparks","Eli Galvan","Elinor Kaufman","Elroy Porter","Elvin Flynn","Emmitt Porter","Erik Parsons","Ethel Forbes","Felicia Ware","Fidel Haynes","Francisco Valenzuela","Frank Hunt","Gabriela Moore","Gabrielle Patrick","Gale Fitzpatrick","Gayle Curtis","Genevieve Lucero","Gerry Oneal","Grady Ellis","Grover Escobar","Hans Patel","Horacio Black","Humberto Compton","Hunter Short","Ilene Mcguire","Imelda Lloyd","Ira Macdonald","Issac Allen","Jacques Velazquez","Janis Mullins","Janna Cowan","Javier Garner","Jayson Abbott","Jeannie Tapia","Jefferson Lee","Jeramy Keith","Jermaine Bradshaw","Jewel Lee","Jimmie Yang","Jodie Wood","John Cline","Josefina Dickerson","Josie Pineda","Judith Griffin","Julius Soto","Kelli Romero","Kerri Joseph","Kim Mccall","Lakeisha Velazquez","Latonya Logan","Lee Schmidt","Lela Atkins","Leland Robertson","Leonardo House","Leroy Mcintyre","Lesley Blevins","Lilia Berg","Lilly Stone","Lincoln Bond","Lindsay Hurst","Lionel Fuller","Lorene Hunter","Louis Kidd","Lucius Warren","Lucy Mejia","Lupe Ingram","Lynette Fuller","Lynnette Wright","Madge Copeland","Madge Tanner","Mae Sawyer","Malcolm Newman","Mamie Wong","Mandy Swanson","Marcella Everett","Marco Bright","Marcos Schaefer","Marcus Hays","Marina Walsh","Marion Savage","Marylou Bass","Marylou Mccarthy","Mathew Howard","Maurice Jacobson","Mauricio Bautista","Max Smith","Melanie Bridges","Melissa Brandt","Merlin Wu","Michel Simpson","Mickey Kennedy","Mike Sloan","Milton Walsh","Mohamed Allison","Mohammad Christensen","Nadia Macdonald","Naomi Snyder","Ned Lowe","Nettie Leonard","Olive Perkins","Ophelia Morrow","Oren Montes","Orlando Henderson","Owen Buchanan","Paul Norman","Rafael Barrett","Raymond Cochran","Reed Hooper","Reinaldo Houston","Renato Simmons","Rene Calhoun","Reva Hardin","Robert French","Robin Bender","Rodolfo Scott","Roland Blake","Roland Sullivan","Rolf Barnett","Ross Marquez","Ruthie Daugherty","Sandra Potts","Scott Stephenson","Scotty Gonzales","Sean Wiggins","Shana Gallagher","Sharron Montes","Sheryl Lindsey","Socorro Hayden","Solomon Andrade","Stacey Whitehead","Stevie Hale","Stuart Oliver","Stuart Riddle","Tammy Merritt","Theo Wiley","Theresa Murillo","Timothy Roberts","Tony Torres","Tracy Logan","Troy Hoover","Twila Rubio","Velma Everett","Vincent Mccormick","Vincenzo Stafford","Vito Clark","Waldo Spencer","Werner Lowe","Werner Shepard","Wesley Ford","Wm Cantu","Zelma Pierce"]
[null,null,null,null,null,"Tracy Logan",{"$f":"IF('Resulting List'!F111=\"\",\"\",'Resulting List'!F111)","v":""},null,{"$f":"TRANSPOSE(_xlfn._xlws.SORT(_xlfn.UNIQUE(_xlfn._xlws.FILTER(Customers[Names],ISNUMBER(SEARCH(Customers[[#This Row],[Search Criteria]],Customers[Names])),\"No data.\"))))","v":"Adriana Todd"},"Albert Ramirez","Alex Rubio","Amanda Beck","Amparo Orozco","Amy Todd","Angelina Roberson","April Fox","Arden Ayala","Arnoldo Pennington","Aubrey Giles","Bette Rivers","Brianna Alexander","Brianna Mora","Britt Vazquez","Broderick Gillespie","Brooke Roman","Calvin Buck","Carmela Mullins","Carol Stevenson","Carolina Russell","Carolyn Roberts","Chelsea Gilbert","Cheryl Williamson","Christa Frederick","Christian Armstrong","Christopher Stuart","Chung Krueger","Clare Whitney","Clarissa Archer","Claudio Lam","Cordell Mills","Craig Shepherd","Damien Kramer","Dane Burke","Danielle Stout","Darrel Liu","Darrin Mcneil","Darron Aguilar","Della Huber","Delores Krause","Dena Rosario","Dominick Johnston","Dona Herring","Dorothy Winters","Douglas Wiley","Doyle David","Earlene Hester","Earline Shepherd","Edwin Sparks","Eli Galvan","Elinor Kaufman","Elroy Porter","Elvin Flynn","Emmitt Porter","Erik Parsons","Ethel Forbes","Felicia Ware","Fidel Haynes","Francisco Valenzuela","Frank Hunt","Gabriela Moore","Gabrielle Patrick","Gale Fitzpatrick","Gayle Curtis","Genevieve Lucero","Gerry Oneal","Grady Ellis","Grover Escobar","Hans Patel","Horacio Black","Humberto Compton","Hunter Short","Ilene Mcguire","Imelda Lloyd","Ira Macdonald","Issac Allen","Jacques Velazquez","Janis Mullins","Janna Cowan","Javier Garner","Jayson Abbott","Jeannie Tapia","Jefferson Lee","Jeramy Keith","Jermaine Bradshaw","Jewel Lee","Jimmie Yang","Jodie Wood","John Cline","Josefina Dickerson","Josie Pineda","Judith Griffin","Julius Soto","Kelli Romero","Kerri Joseph","Kim Mccall","Lakeisha Velazquez","Latonya Logan","Lee Schmidt","Lela Atkins","Leland Robertson","Leonardo House","Leroy Mcintyre","Lesley Blevins","Lilia Berg","Lilly Stone","Lincoln Bond","Lindsay Hurst","Lionel Fuller","Lorene Hunter","Louis Kidd","Lucius Warren","Lucy Mejia","Lupe Ingram","Lynette Fuller","Lynnette Wright","Madge Copeland","Madge Tanner","Mae Sawyer","Malcolm Newman","Mamie Wong","Mandy Swanson","Marcella Everett","Marco Bright","Marcos Schaefer","Marcus Hays","Marina Walsh","Marion Savage","Marylou Bass","Marylou Mccarthy","Mathew Howard","Maurice Jacobson","Mauricio Bautista","Max Smith","Melanie Bridges","Melissa Brandt","Merlin Wu","Michel Simpson","Mickey Kennedy","Mike Sloan","Milton Walsh","Mohamed Allison","Mohammad Christensen","Nadia Macdonald","Naomi Snyder","Ned Lowe","Nettie Leonard","Olive Perkins","Ophelia Morrow","Oren Montes","Orlando Henderson","Owen Buchanan","Paul Norman","Rafael Barrett","Raymond Cochran","Reed Hooper","Reinaldo Houston","Renato Simmons","Rene Calhoun","Reva Hardin","Robert French","Robin Bender","Rodolfo Scott","Roland Blake","Roland Sullivan","Rolf Barnett","Ross Marquez","Ruthie Daugherty","Sandra Potts","Scott Stephenson","Scotty Gonzales","Sean Wiggins","Shana Gallagher","Sharron Montes","Sheryl Lindsey","Socorro Hayden","Solomon Andrade","Stacey Whitehead","Stevie Hale","Stuart Oliver","Stuart Riddle","Tammy Merritt","Theo Wiley","Theresa Murillo","Timothy Roberts","Tony Torres","Tracy Logan","Troy Hoover","Twila Rubio","Velma Everett","Vincent Mccormick","Vincenzo Stafford","Vito Clark","Waldo Spencer","Werner Lowe","Werner Shepard","Wesley Ford","Wm Cantu","Zelma Pierce"]
[null,null,null,null,null,"Christa Frederick",{"$f":"IF('Resulting List'!F112=\"\",\"\",'Resulting List'!F112)","v":""},null,{"$f":"TRANSPOSE(_xlfn._xlws.SORT(_xlfn.UNIQUE(_xlfn._xlws.FILTER(Customers[Names],ISNUMBER(SEARCH(Customers[[#This Row],[Search Criteria]],Customers[Names])),\"No data.\"))))","v":"Adriana Todd"},"Albert Ramirez","Alex Rubio","Amanda Beck","Amparo Orozco","Amy Todd","Angelina Roberson","April Fox","Arden Ayala","Arnoldo Pennington","Aubrey Giles","Bette Rivers","Brianna Alexander","Brianna Mora","Britt Vazquez","Broderick Gillespie","Brooke Roman","Calvin Buck","Carmela Mullins","Carol Stevenson","Carolina Russell","Carolyn Roberts","Chelsea Gilbert","Cheryl Williamson","Christa Frederick","Christian Armstrong","Christopher Stuart","Chung Krueger","Clare Whitney","Clarissa Archer","Claudio Lam","Cordell Mills","Craig Shepherd","Damien Kramer","Dane Burke","Danielle Stout","Darrel Liu","Darrin Mcneil","Darron Aguilar","Della Huber","Delores Krause","Dena Rosario","Dominick Johnston","Dona Herring","Dorothy Winters","Douglas Wiley","Doyle David","Earlene Hester","Earline Shepherd","Edwin Sparks","Eli Galvan","Elinor Kaufman","Elroy Porter","Elvin Flynn","Emmitt Porter","Erik Parsons","Ethel Forbes","Felicia Ware","Fidel Haynes","Francisco Valenzuela","Frank Hunt","Gabriela Moore","Gabrielle Patrick","Gale Fitzpatrick","Gayle Curtis","Genevieve Lucero","Gerry Oneal","Grady Ellis","Grover Escobar","Hans Patel","Horacio Black","Humberto Compton","Hunter Short","Ilene Mcguire","Imelda Lloyd","Ira Macdonald","Issac Allen","Jacques Velazquez","Janis Mullins","Janna Cowan","Javier Garner","Jayson Abbott","Jeannie Tapia","Jefferson Lee","Jeramy Keith","Jermaine Bradshaw","Jewel Lee","Jimmie Yang","Jodie Wood","John Cline","Josefina Dickerson","Josie Pineda","Judith Griffin","Julius Soto","Kelli Romero","Kerri Joseph","Kim Mccall","Lakeisha Velazquez","Latonya Logan","Lee Schmidt","Lela Atkins","Leland Robertson","Leonardo House","Leroy Mcintyre","Lesley Blevins","Lilia Berg","Lilly Stone","Lincoln Bond","Lindsay Hurst","Lionel Fuller","Lorene Hunter","Louis Kidd","Lucius Warren","Lucy Mejia","Lupe Ingram","Lynette Fuller","Lynnette Wright","Madge Copeland","Madge Tanner","Mae Sawyer","Malcolm Newman","Mamie Wong","Mandy Swanson","Marcella Everett","Marco Bright","Marcos Schaefer","Marcus Hays","Marina Walsh","Marion Savage","Marylou Bass","Marylou Mccarthy","Mathew Howard","Maurice Jacobson","Mauricio Bautista","Max Smith","Melanie Bridges","Melissa Brandt","Merlin Wu","Michel Simpson","Mickey Kennedy","Mike Sloan","Milton Walsh","Mohamed Allison","Mohammad Christensen","Nadia Macdonald","Naomi Snyder","Ned Lowe","Nettie Leonard","Olive Perkins","Ophelia Morrow","Oren Montes","Orlando Henderson","Owen Buchanan","Paul Norman","Rafael Barrett","Raymond Cochran","Reed Hooper","Reinaldo Houston","Renato Simmons","Rene Calhoun","Reva Hardin","Robert French","Robin Bender","Rodolfo Scott","Roland Blake","Roland Sullivan","Rolf Barnett","Ross Marquez","Ruthie Daugherty","Sandra Potts","Scott Stephenson","Scotty Gonzales","Sean Wiggins","Shana Gallagher","Sharron Montes","Sheryl Lindsey","Socorro Hayden","Solomon Andrade","Stacey Whitehead","Stevie Hale","Stuart Oliver","Stuart Riddle","Tammy Merritt","Theo Wiley","Theresa Murillo","Timothy Roberts","Tony Torres","Tracy Logan","Troy Hoover","Twila Rubio","Velma Everett","Vincent Mccormick","Vincenzo Stafford","Vito Clark","Waldo Spencer","Werner Lowe","Werner Shepard","Wesley Ford","Wm Cantu","Zelma Pierce"]
[null,null,null,null,null,"Christopher Stuart",{"$f":"IF('Resulting List'!F113=\"\",\"\",'Resulting List'!F113)","v":""},null,{"$f":"TRANSPOSE(_xlfn._xlws.SORT(_xlfn.UNIQUE(_xlfn._xlws.FILTER(Customers[Names],ISNUMBER(SEARCH(Customers[[#This Row],[Search Criteria]],Customers[Names])),\"No data.\"))))","v":"Adriana Todd"},"Albert Ramirez","Alex Rubio","Amanda Beck","Amparo Orozco","Amy Todd","Angelina Roberson","April Fox","Arden Ayala","Arnoldo Pennington","Aubrey Giles","Bette Rivers","Brianna Alexander","Brianna Mora","Britt Vazquez","Broderick Gillespie","Brooke Roman","Calvin Buck","Carmela Mullins","Carol Stevenson","Carolina Russell","Carolyn Roberts","Chelsea Gilbert","Cheryl Williamson","Christa Frederick","Christian Armstrong","Christopher Stuart","Chung Krueger","Clare Whitney","Clarissa Archer","Claudio Lam","Cordell Mills","Craig Shepherd","Damien Kramer","Dane Burke","Danielle Stout","Darrel Liu","Darrin Mcneil","Darron Aguilar","Della Huber","Delores Krause","Dena Rosario","Dominick Johnston","Dona Herring","Dorothy Winters","Douglas Wiley","Doyle David","Earlene Hester","Earline Shepherd","Edwin Sparks","Eli Galvan","Elinor Kaufman","Elroy Porter","Elvin Flynn","Emmitt Porter","Erik Parsons","Ethel Forbes","Felicia Ware","Fidel Haynes","Francisco Valenzuela","Frank Hunt","Gabriela Moore","Gabrielle Patrick","Gale Fitzpatrick","Gayle Curtis","Genevieve Lucero","Gerry Oneal","Grady Ellis","Grover Escobar","Hans Patel","Horacio Black","Humberto Compton","Hunter Short","Ilene Mcguire","Imelda Lloyd","Ira Macdonald","Issac Allen","Jacques Velazquez","Janis Mullins","Janna Cowan","Javier Garner","Jayson Abbott","Jeannie Tapia","Jefferson Lee","Jeramy Keith","Jermaine Bradshaw","Jewel Lee","Jimmie Yang","Jodie Wood","John Cline","Josefina Dickerson","Josie Pineda","Judith Griffin","Julius Soto","Kelli Romero","Kerri Joseph","Kim Mccall","Lakeisha Velazquez","Latonya Logan","Lee Schmidt","Lela Atkins","Leland Robertson","Leonardo House","Leroy Mcintyre","Lesley Blevins","Lilia Berg","Lilly Stone","Lincoln Bond","Lindsay Hurst","Lionel Fuller","Lorene Hunter","Louis Kidd","Lucius Warren","Lucy Mejia","Lupe Ingram","Lynette Fuller","Lynnette Wright","Madge Copeland","Madge Tanner","Mae Sawyer","Malcolm Newman","Mamie Wong","Mandy Swanson","Marcella Everett","Marco Bright","Marcos Schaefer","Marcus Hays","Marina Walsh","Marion Savage","Marylou Bass","Marylou Mccarthy","Mathew Howard","Maurice Jacobson","Mauricio Bautista","Max Smith","Melanie Bridges","Melissa Brandt","Merlin Wu","Michel Simpson","Mickey Kennedy","Mike Sloan","Milton Walsh","Mohamed Allison","Mohammad Christensen","Nadia Macdonald","Naomi Snyder","Ned Lowe","Nettie Leonard","Olive Perkins","Ophelia Morrow","Oren Montes","Orlando Henderson","Owen Buchanan","Paul Norman","Rafael Barrett","Raymond Cochran","Reed Hooper","Reinaldo Houston","Renato Simmons","Rene Calhoun","Reva Hardin","Robert French","Robin Bender","Rodolfo Scott","Roland Blake","Roland Sullivan","Rolf Barnett","Ross Marquez","Ruthie Daugherty","Sandra Potts","Scott Stephenson","Scotty Gonzales","Sean Wiggins","Shana Gallagher","Sharron Montes","Sheryl Lindsey","Socorro Hayden","Solomon Andrade","Stacey Whitehead","Stevie Hale","Stuart Oliver","Stuart Riddle","Tammy Merritt","Theo Wiley","Theresa Murillo","Timothy Roberts","Tony Torres","Tracy Logan","Troy Hoover","Twila Rubio","Velma Everett","Vincent Mccormick","Vincenzo Stafford","Vito Clark","Waldo Spencer","Werner Lowe","Werner Shepard","Wesley Ford","Wm Cantu","Zelma Pierce"]
[null,null,null,null,null,"Stacey Whitehead",{"$f":"IF('Resulting List'!F114=\"\",\"\",'Resulting List'!F114)","v":""},null,{"$f":"TRANSPOSE(_xlfn._xlws.SORT(_xlfn.UNIQUE(_xlfn._xlws.FILTER(Customers[Names],ISNUMBER(SEARCH(Customers[[#This Row],[Search Criteria]],Customers[Names])),\"No data.\"))))","v":"Adriana Todd"},"Albert Ramirez","Alex Rubio","Amanda Beck","Amparo Orozco","Amy Todd","Angelina Roberson","April Fox","Arden Ayala","Arnoldo Pennington","Aubrey Giles","Bette Rivers","Brianna Alexander","Brianna Mora","Britt Vazquez","Broderick Gillespie","Brooke Roman","Calvin Buck","Carmela Mullins","Carol Stevenson","Carolina Russell","Carolyn Roberts","Chelsea Gilbert","Cheryl Williamson","Christa Frederick","Christian Armstrong","Christopher Stuart","Chung Krueger","Clare Whitney","Clarissa Archer","Claudio Lam","Cordell Mills","Craig Shepherd","Damien Kramer","Dane Burke","Danielle Stout","Darrel Liu","Darrin Mcneil","Darron Aguilar","Della Huber","Delores Krause","Dena Rosario","Dominick Johnston","Dona Herring","Dorothy Winters","Douglas Wiley","Doyle David","Earlene Hester","Earline Shepherd","Edwin Sparks","Eli Galvan","Elinor Kaufman","Elroy Porter","Elvin Flynn","Emmitt Porter","Erik Parsons","Ethel Forbes","Felicia Ware","Fidel Haynes","Francisco Valenzuela","Frank Hunt","Gabriela Moore","Gabrielle Patrick","Gale Fitzpatrick","Gayle Curtis","Genevieve Lucero","Gerry Oneal","Grady Ellis","Grover Escobar","Hans Patel","Horacio Black","Humberto Compton","Hunter Short","Ilene Mcguire","Imelda Lloyd","Ira Macdonald","Issac Allen","Jacques Velazquez","Janis Mullins","Janna Cowan","Javier Garner","Jayson Abbott","Jeannie Tapia","Jefferson Lee","Jeramy Keith","Jermaine Bradshaw","Jewel Lee","Jimmie Yang","Jodie Wood","John Cline","Josefina Dickerson","Josie Pineda","Judith Griffin","Julius Soto","Kelli Romero","Kerri Joseph","Kim Mccall","Lakeisha Velazquez","Latonya Logan","Lee Schmidt","Lela Atkins","Leland Robertson","Leonardo House","Leroy Mcintyre","Lesley Blevins","Lilia Berg","Lilly Stone","Lincoln Bond","Lindsay Hurst","Lionel Fuller","Lorene Hunter","Louis Kidd","Lucius Warren","Lucy Mejia","Lupe Ingram","Lynette Fuller","Lynnette Wright","Madge Copeland","Madge Tanner","Mae Sawyer","Malcolm Newman","Mamie Wong","Mandy Swanson","Marcella Everett","Marco Bright","Marcos Schaefer","Marcus Hays","Marina Walsh","Marion Savage","Marylou Bass","Marylou Mccarthy","Mathew Howard","Maurice Jacobson","Mauricio Bautista","Max Smith","Melanie Bridges","Melissa Brandt","Merlin Wu","Michel Simpson","Mickey Kennedy","Mike Sloan","Milton Walsh","Mohamed Allison","Mohammad Christensen","Nadia Macdonald","Naomi Snyder","Ned Lowe","Nettie Leonard","Olive Perkins","Ophelia Morrow","Oren Montes","Orlando Henderson","Owen Buchanan","Paul Norman","Rafael Barrett","Raymond Cochran","Reed Hooper","Reinaldo Houston","Renato Simmons","Rene Calhoun","Reva Hardin","Robert French","Robin Bender","Rodolfo Scott","Roland Blake","Roland Sullivan","Rolf Barnett","Ross Marquez","Ruthie Daugherty","Sandra Potts","Scott Stephenson","Scotty Gonzales","Sean Wiggins","Shana Gallagher","Sharron Montes","Sheryl Lindsey","Socorro Hayden","Solomon Andrade","Stacey Whitehead","Stevie Hale","Stuart Oliver","Stuart Riddle","Tammy Merritt","Theo Wiley","Theresa Murillo","Timothy Roberts","Tony Torres","Tracy Logan","Troy Hoover","Twila Rubio","Velma Everett","Vincent Mccormick","Vincenzo Stafford","Vito Clark","Waldo Spencer","Werner Lowe","Werner Shepard","Wesley Ford","Wm Cantu","Zelma Pierce"]
[null,null,null,null,null,"Damien Kramer",{"$f":"IF('Resulting List'!F115=\"\",\"\",'Resulting List'!F115)","v":""},null,{"$f":"TRANSPOSE(_xlfn._xlws.SORT(_xlfn.UNIQUE(_xlfn._xlws.FILTER(Customers[Names],ISNUMBER(SEARCH(Customers[[#This Row],[Search Criteria]],Customers[Names])),\"No data.\"))))","v":"Adriana Todd"},"Albert Ramirez","Alex Rubio","Amanda Beck","Amparo Orozco","Amy Todd","Angelina Roberson","April Fox","Arden Ayala","Arnoldo Pennington","Aubrey Giles","Bette Rivers","Brianna Alexander","Brianna Mora","Britt Vazquez","Broderick Gillespie","Brooke Roman","Calvin Buck","Carmela Mullins","Carol Stevenson","Carolina Russell","Carolyn Roberts","Chelsea Gilbert","Cheryl Williamson","Christa Frederick","Christian Armstrong","Christopher Stuart","Chung Krueger","Clare Whitney","Clarissa Archer","Claudio Lam","Cordell Mills","Craig Shepherd","Damien Kramer","Dane Burke","Danielle Stout","Darrel Liu","Darrin Mcneil","Darron Aguilar","Della Huber","Delores Krause","Dena Rosario","Dominick Johnston","Dona Herring","Dorothy Winters","Douglas Wiley","Doyle David","Earlene Hester","Earline Shepherd","Edwin Sparks","Eli Galvan","Elinor Kaufman","Elroy Porter","Elvin Flynn","Emmitt Porter","Erik Parsons","Ethel Forbes","Felicia Ware","Fidel Haynes","Francisco Valenzuela","Frank Hunt","Gabriela Moore","Gabrielle Patrick","Gale Fitzpatrick","Gayle Curtis","Genevieve Lucero","Gerry Oneal","Grady Ellis","Grover Escobar","Hans Patel","Horacio Black","Humberto Compton","Hunter Short","Ilene Mcguire","Imelda Lloyd","Ira Macdonald","Issac Allen","Jacques Velazquez","Janis Mullins","Janna Cowan","Javier Garner","Jayson Abbott","Jeannie Tapia","Jefferson Lee","Jeramy Keith","Jermaine Bradshaw","Jewel Lee","Jimmie Yang","Jodie Wood","John Cline","Josefina Dickerson","Josie Pineda","Judith Griffin","Julius Soto","Kelli Romero","Kerri Joseph","Kim Mccall","Lakeisha Velazquez","Latonya Logan","Lee Schmidt","Lela Atkins","Leland Robertson","Leonardo House","Leroy Mcintyre","Lesley Blevins","Lilia Berg","Lilly Stone","Lincoln Bond","Lindsay Hurst","Lionel Fuller","Lorene Hunter","Louis Kidd","Lucius Warren","Lucy Mejia","Lupe Ingram","Lynette Fuller","Lynnette Wright","Madge Copeland","Madge Tanner","Mae Sawyer","Malcolm Newman","Mamie Wong","Mandy Swanson","Marcella Everett","Marco Bright","Marcos Schaefer","Marcus Hays","Marina Walsh","Marion Savage","Marylou Bass","Marylou Mccarthy","Mathew Howard","Maurice Jacobson","Mauricio Bautista","Max Smith","Melanie Bridges","Melissa Brandt","Merlin Wu","Michel Simpson","Mickey Kennedy","Mike Sloan","Milton Walsh","Mohamed Allison","Mohammad Christensen","Nadia Macdonald","Naomi Snyder","Ned Lowe","Nettie Leonard","Olive Perkins","Ophelia Morrow","Oren Montes","Orlando Henderson","Owen Buchanan","Paul Norman","Rafael Barrett","Raymond Cochran","Reed Hooper","Reinaldo Houston","Renato Simmons","Rene Calhoun","Reva Hardin","Robert French","Robin Bender","Rodolfo Scott","Roland Blake","Roland Sullivan","Rolf Barnett","Ross Marquez","Ruthie Daugherty","Sandra Potts","Scott Stephenson","Scotty Gonzales","Sean Wiggins","Shana Gallagher","Sharron Montes","Sheryl Lindsey","Socorro Hayden","Solomon Andrade","Stacey Whitehead","Stevie Hale","Stuart Oliver","Stuart Riddle","Tammy Merritt","Theo Wiley","Theresa Murillo","Timothy Roberts","Tony Torres","Tracy Logan","Troy Hoover","Twila Rubio","Velma Everett","Vincent Mccormick","Vincenzo Stafford","Vito Clark","Waldo Spencer","Werner Lowe","Werner Shepard","Wesley Ford","Wm Cantu","Zelma Pierce"]
[null,null,null,null,null,"Nadia Macdonald",{"$f":"IF('Resulting List'!F116=\"\",\"\",'Resulting List'!F116)","v":""},null,{"$f":"TRANSPOSE(_xlfn._xlws.SORT(_xlfn.UNIQUE(_xlfn._xlws.FILTER(Customers[Names],ISNUMBER(SEARCH(Customers[[#This Row],[Search Criteria]],Customers[Names])),\"No data.\"))))","v":"Adriana Todd"},"Albert Ramirez","Alex Rubio","Amanda Beck","Amparo Orozco","Amy Todd","Angelina Roberson","April Fox","Arden Ayala","Arnoldo Pennington","Aubrey Giles","Bette Rivers","Brianna Alexander","Brianna Mora","Britt Vazquez","Broderick Gillespie","Brooke Roman","Calvin Buck","Carmela Mullins","Carol Stevenson","Carolina Russell","Carolyn Roberts","Chelsea Gilbert","Cheryl Williamson","Christa Frederick","Christian Armstrong","Christopher Stuart","Chung Krueger","Clare Whitney","Clarissa Archer","Claudio Lam","Cordell Mills","Craig Shepherd","Damien Kramer","Dane Burke","Danielle Stout","Darrel Liu","Darrin Mcneil","Darron Aguilar","Della Huber","Delores Krause","Dena Rosario","Dominick Johnston","Dona Herring","Dorothy Winters","Douglas Wiley","Doyle David","Earlene Hester","Earline Shepherd","Edwin Sparks","Eli Galvan","Elinor Kaufman","Elroy Porter","Elvin Flynn","Emmitt Porter","Erik Parsons","Ethel Forbes","Felicia Ware","Fidel Haynes","Francisco Valenzuela","Frank Hunt","Gabriela Moore","Gabrielle Patrick","Gale Fitzpatrick","Gayle Curtis","Genevieve Lucero","Gerry Oneal","Grady Ellis","Grover Escobar","Hans Patel","Horacio Black","Humberto Compton","Hunter Short","Ilene Mcguire","Imelda Lloyd","Ira Macdonald","Issac Allen","Jacques Velazquez","Janis Mullins","Janna Cowan","Javier Garner","Jayson Abbott","Jeannie Tapia","Jefferson Lee","Jeramy Keith","Jermaine Bradshaw","Jewel Lee","Jimmie Yang","Jodie Wood","John Cline","Josefina Dickerson","Josie Pineda","Judith Griffin","Julius Soto","Kelli Romero","Kerri Joseph","Kim Mccall","Lakeisha Velazquez","Latonya Logan","Lee Schmidt","Lela Atkins","Leland Robertson","Leonardo House","Leroy Mcintyre","Lesley Blevins","Lilia Berg","Lilly Stone","Lincoln Bond","Lindsay Hurst","Lionel Fuller","Lorene Hunter","Louis Kidd","Lucius Warren","Lucy Mejia","Lupe Ingram","Lynette Fuller","Lynnette Wright","Madge Copeland","Madge Tanner","Mae Sawyer","Malcolm Newman","Mamie Wong","Mandy Swanson","Marcella Everett","Marco Bright","Marcos Schaefer","Marcus Hays","Marina Walsh","Marion Savage","Marylou Bass","Marylou Mccarthy","Mathew Howard","Maurice Jacobson","Mauricio Bautista","Max Smith","Melanie Bridges","Melissa Brandt","Merlin Wu","Michel Simpson","Mickey Kennedy","Mike Sloan","Milton Walsh","Mohamed Allison","Mohammad Christensen","Nadia Macdonald","Naomi Snyder","Ned Lowe","Nettie Leonard","Olive Perkins","Ophelia Morrow","Oren Montes","Orlando Henderson","Owen Buchanan","Paul Norman","Rafael Barrett","Raymond Cochran","Reed Hooper","Reinaldo Houston","Renato Simmons","Rene Calhoun","Reva Hardin","Robert French","Robin Bender","Rodolfo Scott","Roland Blake","Roland Sullivan","Rolf Barnett","Ross Marquez","Ruthie Daugherty","Sandra Potts","Scott Stephenson","Scotty Gonzales","Sean Wiggins","Shana Gallagher","Sharron Montes","Sheryl Lindsey","Socorro Hayden","Solomon Andrade","Stacey Whitehead","Stevie Hale","Stuart Oliver","Stuart Riddle","Tammy Merritt","Theo Wiley","Theresa Murillo","Timothy Roberts","Tony Torres","Tracy Logan","Troy Hoover","Twila Rubio","Velma Everett","Vincent Mccormick","Vincenzo Stafford","Vito Clark","Waldo Spencer","Werner Lowe","Werner Shepard","Wesley Ford","Wm Cantu","Zelma Pierce"]
[null,null,null,null,null,"Jacques Velazquez",{"$f":"IF('Resulting List'!F117=\"\",\"\",'Resulting List'!F117)","v":""},null,{"$f":"TRANSPOSE(_xlfn._xlws.SORT(_xlfn.UNIQUE(_xlfn._xlws.FILTER(Customers[Names],ISNUMBER(SEARCH(Customers[[#This Row],[Search Criteria]],Customers[Names])),\"No data.\"))))","v":"Adriana Todd"},"Albert Ramirez","Alex Rubio","Amanda Beck","Amparo Orozco","Amy Todd","Angelina Roberson","April Fox","Arden Ayala","Arnoldo Pennington","Aubrey Giles","Bette Rivers","Brianna Alexander","Brianna Mora","Britt Vazquez","Broderick Gillespie","Brooke Roman","Calvin Buck","Carmela Mullins","Carol Stevenson","Carolina Russell","Carolyn Roberts","Chelsea Gilbert","Cheryl Williamson","Christa Frederick","Christian Armstrong","Christopher Stuart","Chung Krueger","Clare Whitney","Clarissa Archer","Claudio Lam","Cordell Mills","Craig Shepherd","Damien Kramer","Dane Burke","Danielle Stout","Darrel Liu","Darrin Mcneil","Darron Aguilar","Della Huber","Delores Krause","Dena Rosario","Dominick Johnston","Dona Herring","Dorothy Winters","Douglas Wiley","Doyle David","Earlene Hester","Earline Shepherd","Edwin Sparks","Eli Galvan","Elinor Kaufman","Elroy Porter","Elvin Flynn","Emmitt Porter","Erik Parsons","Ethel Forbes","Felicia Ware","Fidel Haynes","Francisco Valenzuela","Frank Hunt","Gabriela Moore","Gabrielle Patrick","Gale Fitzpatrick","Gayle Curtis","Genevieve Lucero","Gerry Oneal","Grady Ellis","Grover Escobar","Hans Patel","Horacio Black","Humberto Compton","Hunter Short","Ilene Mcguire","Imelda Lloyd","Ira Macdonald","Issac Allen","Jacques Velazquez","Janis Mullins","Janna Cowan","Javier Garner","Jayson Abbott","Jeannie Tapia","Jefferson Lee","Jeramy Keith","Jermaine Bradshaw","Jewel Lee","Jimmie Yang","Jodie Wood","John Cline","Josefina Dickerson","Josie Pineda","Judith Griffin","Julius Soto","Kelli Romero","Kerri Joseph","Kim Mccall","Lakeisha Velazquez","Latonya Logan","Lee Schmidt","Lela Atkins","Leland Robertson","Leonardo House","Leroy Mcintyre","Lesley Blevins","Lilia Berg","Lilly Stone","Lincoln Bond","Lindsay Hurst","Lionel Fuller","Lorene Hunter","Louis Kidd","Lucius Warren","Lucy Mejia","Lupe Ingram","Lynette Fuller","Lynnette Wright","Madge Copeland","Madge Tanner","Mae Sawyer","Malcolm Newman","Mamie Wong","Mandy Swanson","Marcella Everett","Marco Bright","Marcos Schaefer","Marcus Hays","Marina Walsh","Marion Savage","Marylou Bass","Marylou Mccarthy","Mathew Howard","Maurice Jacobson","Mauricio Bautista","Max Smith","Melanie Bridges","Melissa Brandt","Merlin Wu","Michel Simpson","Mickey Kennedy","Mike Sloan","Milton Walsh","Mohamed Allison","Mohammad Christensen","Nadia Macdonald","Naomi Snyder","Ned Lowe","Nettie Leonard","Olive Perkins","Ophelia Morrow","Oren Montes","Orlando Henderson","Owen Buchanan","Paul Norman","Rafael Barrett","Raymond Cochran","Reed Hooper","Reinaldo Houston","Renato Simmons","Rene Calhoun","Reva Hardin","Robert French","Robin Bender","Rodolfo Scott","Roland Blake","Roland Sullivan","Rolf Barnett","Ross Marquez","Ruthie Daugherty","Sandra Potts","Scott Stephenson","Scotty Gonzales","Sean Wiggins","Shana Gallagher","Sharron Montes","Sheryl Lindsey","Socorro Hayden","Solomon Andrade","Stacey Whitehead","Stevie Hale","Stuart Oliver","Stuart Riddle","Tammy Merritt","Theo Wiley","Theresa Murillo","Timothy Roberts","Tony Torres","Tracy Logan","Troy Hoover","Twila Rubio","Velma Everett","Vincent Mccormick","Vincenzo Stafford","Vito Clark","Waldo Spencer","Werner Lowe","Werner Shepard","Wesley Ford","Wm Cantu","Zelma Pierce"]
[null,null,null,null,null,"Adriana Todd",{"$f":"IF('Resulting List'!F118=\"\",\"\",'Resulting List'!F118)","v":""},null,{"$f":"TRANSPOSE(_xlfn._xlws.SORT(_xlfn.UNIQUE(_xlfn._xlws.FILTER(Customers[Names],ISNUMBER(SEARCH(Customers[[#This Row],[Search Criteria]],Customers[Names])),\"No data.\"))))","v":"Adriana Todd"},"Albert Ramirez","Alex Rubio","Amanda Beck","Amparo Orozco","Amy Todd","Angelina Roberson","April Fox","Arden Ayala","Arnoldo Pennington","Aubrey Giles","Bette Rivers","Brianna Alexander","Brianna Mora","Britt Vazquez","Broderick Gillespie","Brooke Roman","Calvin Buck","Carmela Mullins","Carol Stevenson","Carolina Russell","Carolyn Roberts","Chelsea Gilbert","Cheryl Williamson","Christa Frederick","Christian Armstrong","Christopher Stuart","Chung Krueger","Clare Whitney","Clarissa Archer","Claudio Lam","Cordell Mills","Craig Shepherd","Damien Kramer","Dane Burke","Danielle Stout","Darrel Liu","Darrin Mcneil","Darron Aguilar","Della Huber","Delores Krause","Dena Rosario","Dominick Johnston","Dona Herring","Dorothy Winters","Douglas Wiley","Doyle David","Earlene Hester","Earline Shepherd","Edwin Sparks","Eli Galvan","Elinor Kaufman","Elroy Porter","Elvin Flynn","Emmitt Porter","Erik Parsons","Ethel Forbes","Felicia Ware","Fidel Haynes","Francisco Valenzuela","Frank Hunt","Gabriela Moore","Gabrielle Patrick","Gale Fitzpatrick","Gayle Curtis","Genevieve Lucero","Gerry Oneal","Grady Ellis","Grover Escobar","Hans Patel","Horacio Black","Humberto Compton","Hunter Short","Ilene Mcguire","Imelda Lloyd","Ira Macdonald","Issac Allen","Jacques Velazquez","Janis Mullins","Janna Cowan","Javier Garner","Jayson Abbott","Jeannie Tapia","Jefferson Lee","Jeramy Keith","Jermaine Bradshaw","Jewel Lee","Jimmie Yang","Jodie Wood","John Cline","Josefina Dickerson","Josie Pineda","Judith Griffin","Julius Soto","Kelli Romero","Kerri Joseph","Kim Mccall","Lakeisha Velazquez","Latonya Logan","Lee Schmidt","Lela Atkins","Leland Robertson","Leonardo House","Leroy Mcintyre","Lesley Blevins","Lilia Berg","Lilly Stone","Lincoln Bond","Lindsay Hurst","Lionel Fuller","Lorene Hunter","Louis Kidd","Lucius Warren","Lucy Mejia","Lupe Ingram","Lynette Fuller","Lynnette Wright","Madge Copeland","Madge Tanner","Mae Sawyer","Malcolm Newman","Mamie Wong","Mandy Swanson","Marcella Everett","Marco Bright","Marcos Schaefer","Marcus Hays","Marina Walsh","Marion Savage","Marylou Bass","Marylou Mccarthy","Mathew Howard","Maurice Jacobson","Mauricio Bautista","Max Smith","Melanie Bridges","Melissa Brandt","Merlin Wu","Michel Simpson","Mickey Kennedy","Mike Sloan","Milton Walsh","Mohamed Allison","Mohammad Christensen","Nadia Macdonald","Naomi Snyder","Ned Lowe","Nettie Leonard","Olive Perkins","Ophelia Morrow","Oren Montes","Orlando Henderson","Owen Buchanan","Paul Norman","Rafael Barrett","Raymond Cochran","Reed Hooper","Reinaldo Houston","Renato Simmons","Rene Calhoun","Reva Hardin","Robert French","Robin Bender","Rodolfo Scott","Roland Blake","Roland Sullivan","Rolf Barnett","Ross Marquez","Ruthie Daugherty","Sandra Potts","Scott Stephenson","Scotty Gonzales","Sean Wiggins","Shana Gallagher","Sharron Montes","Sheryl Lindsey","Socorro Hayden","Solomon Andrade","Stacey Whitehead","Stevie Hale","Stuart Oliver","Stuart Riddle","Tammy Merritt","Theo Wiley","Theresa Murillo","Timothy Roberts","Tony Torres","Tracy Logan","Troy Hoover","Twila Rubio","Velma Everett","Vincent Mccormick","Vincenzo Stafford","Vito Clark","Waldo Spencer","Werner Lowe","Werner Shepard","Wesley Ford","Wm Cantu","Zelma Pierce"]
[null,null,null,null,null,"Darrin Mcneil",{"$f":"IF('Resulting List'!F119=\"\",\"\",'Resulting List'!F119)","v":""},null,{"$f":"TRANSPOSE(_xlfn._xlws.SORT(_xlfn.UNIQUE(_xlfn._xlws.FILTER(Customers[Names],ISNUMBER(SEARCH(Customers[[#This Row],[Search Criteria]],Customers[Names])),\"No data.\"))))","v":"Adriana Todd"},"Albert Ramirez","Alex Rubio","Amanda Beck","Amparo Orozco","Amy Todd","Angelina Roberson","April Fox","Arden Ayala","Arnoldo Pennington","Aubrey Giles","Bette Rivers","Brianna Alexander","Brianna Mora","Britt Vazquez","Broderick Gillespie","Brooke Roman","Calvin Buck","Carmela Mullins","Carol Stevenson","Carolina Russell","Carolyn Roberts","Chelsea Gilbert","Cheryl Williamson","Christa Frederick","Christian Armstrong","Christopher Stuart","Chung Krueger","Clare Whitney","Clarissa Archer","Claudio Lam","Cordell Mills","Craig Shepherd","Damien Kramer","Dane Burke","Danielle Stout","Darrel Liu","Darrin Mcneil","Darron Aguilar","Della Huber","Delores Krause","Dena Rosario","Dominick Johnston","Dona Herring","Dorothy Winters","Douglas Wiley","Doyle David","Earlene Hester","Earline Shepherd","Edwin Sparks","Eli Galvan","Elinor Kaufman","Elroy Porter","Elvin Flynn","Emmitt Porter","Erik Parsons","Ethel Forbes","Felicia Ware","Fidel Haynes","Francisco Valenzuela","Frank Hunt","Gabriela Moore","Gabrielle Patrick","Gale Fitzpatrick","Gayle Curtis","Genevieve Lucero","Gerry Oneal","Grady Ellis","Grover Escobar","Hans Patel","Horacio Black","Humberto Compton","Hunter Short","Ilene Mcguire","Imelda Lloyd","Ira Macdonald","Issac Allen","Jacques Velazquez","Janis Mullins","Janna Cowan","Javier Garner","Jayson Abbott","Jeannie Tapia","Jefferson Lee","Jeramy Keith","Jermaine Bradshaw","Jewel Lee","Jimmie Yang","Jodie Wood","John Cline","Josefina Dickerson","Josie Pineda","Judith Griffin","Julius Soto","Kelli Romero","Kerri Joseph","Kim Mccall","Lakeisha Velazquez","Latonya Logan","Lee Schmidt","Lela Atkins","Leland Robertson","Leonardo House","Leroy Mcintyre","Lesley Blevins","Lilia Berg","Lilly Stone","Lincoln Bond","Lindsay Hurst","Lionel Fuller","Lorene Hunter","Louis Kidd","Lucius Warren","Lucy Mejia","Lupe Ingram","Lynette Fuller","Lynnette Wright","Madge Copeland","Madge Tanner","Mae Sawyer","Malcolm Newman","Mamie Wong","Mandy Swanson","Marcella Everett","Marco Bright","Marcos Schaefer","Marcus Hays","Marina Walsh","Marion Savage","Marylou Bass","Marylou Mccarthy","Mathew Howard","Maurice Jacobson","Mauricio Bautista","Max Smith","Melanie Bridges","Melissa Brandt","Merlin Wu","Michel Simpson","Mickey Kennedy","Mike Sloan","Milton Walsh","Mohamed Allison","Mohammad Christensen","Nadia Macdonald","Naomi Snyder","Ned Lowe","Nettie Leonard","Olive Perkins","Ophelia Morrow","Oren Montes","Orlando Henderson","Owen Buchanan","Paul Norman","Rafael Barrett","Raymond Cochran","Reed Hooper","Reinaldo Houston","Renato Simmons","Rene Calhoun","Reva Hardin","Robert French","Robin Bender","Rodolfo Scott","Roland Blake","Roland Sullivan","Rolf Barnett","Ross Marquez","Ruthie Daugherty","Sandra Potts","Scott Stephenson","Scotty Gonzales","Sean Wiggins","Shana Gallagher","Sharron Montes","Sheryl Lindsey","Socorro Hayden","Solomon Andrade","Stacey Whitehead","Stevie Hale","Stuart Oliver","Stuart Riddle","Tammy Merritt","Theo Wiley","Theresa Murillo","Timothy Roberts","Tony Torres","Tracy Logan","Troy Hoover","Twila Rubio","Velma Everett","Vincent Mccormick","Vincenzo Stafford","Vito Clark","Waldo Spencer","Werner Lowe","Werner Shepard","Wesley Ford","Wm Cantu","Zelma Pierce"]
[null,null,null,null,null,"Madge Tanner",{"$f":"IF('Resulting List'!F120=\"\",\"\",'Resulting List'!F120)","v":""},null,{"$f":"TRANSPOSE(_xlfn._xlws.SORT(_xlfn.UNIQUE(_xlfn._xlws.FILTER(Customers[Names],ISNUMBER(SEARCH(Customers[[#This Row],[Search Criteria]],Customers[Names])),\"No data.\"))))","v":"Adriana Todd"},"Albert Ramirez","Alex Rubio","Amanda Beck","Amparo Orozco","Amy Todd","Angelina Roberson","April Fox","Arden Ayala","Arnoldo Pennington","Aubrey Giles","Bette Rivers","Brianna Alexander","Brianna Mora","Britt Vazquez","Broderick Gillespie","Brooke Roman","Calvin Buck","Carmela Mullins","Carol Stevenson","Carolina Russell","Carolyn Roberts","Chelsea Gilbert","Cheryl Williamson","Christa Frederick","Christian Armstrong","Christopher Stuart","Chung Krueger","Clare Whitney","Clarissa Archer","Claudio Lam","Cordell Mills","Craig Shepherd","Damien Kramer","Dane Burke","Danielle Stout","Darrel Liu","Darrin Mcneil","Darron Aguilar","Della Huber","Delores Krause","Dena Rosario","Dominick Johnston","Dona Herring","Dorothy Winters","Douglas Wiley","Doyle David","Earlene Hester","Earline Shepherd","Edwin Sparks","Eli Galvan","Elinor Kaufman","Elroy Porter","Elvin Flynn","Emmitt Porter","Erik Parsons","Ethel Forbes","Felicia Ware","Fidel Haynes","Francisco Valenzuela","Frank Hunt","Gabriela Moore","Gabrielle Patrick","Gale Fitzpatrick","Gayle Curtis","Genevieve Lucero","Gerry Oneal","Grady Ellis","Grover Escobar","Hans Patel","Horacio Black","Humberto Compton","Hunter Short","Ilene Mcguire","Imelda Lloyd","Ira Macdonald","Issac Allen","Jacques Velazquez","Janis Mullins","Janna Cowan","Javier Garner","Jayson Abbott","Jeannie Tapia","Jefferson Lee","Jeramy Keith","Jermaine Bradshaw","Jewel Lee","Jimmie Yang","Jodie Wood","John Cline","Josefina Dickerson","Josie Pineda","Judith Griffin","Julius Soto","Kelli Romero","Kerri Joseph","Kim Mccall","Lakeisha Velazquez","Latonya Logan","Lee Schmidt","Lela Atkins","Leland Robertson","Leonardo House","Leroy Mcintyre","Lesley Blevins","Lilia Berg","Lilly Stone","Lincoln Bond","Lindsay Hurst","Lionel Fuller","Lorene Hunter","Louis Kidd","Lucius Warren","Lucy Mejia","Lupe Ingram","Lynette Fuller","Lynnette Wright","Madge Copeland","Madge Tanner","Mae Sawyer","Malcolm Newman","Mamie Wong","Mandy Swanson","Marcella Everett","Marco Bright","Marcos Schaefer","Marcus Hays","Marina Walsh","Marion Savage","Marylou Bass","Marylou Mccarthy","Mathew Howard","Maurice Jacobson","Mauricio Bautista","Max Smith","Melanie Bridges","Melissa Brandt","Merlin Wu","Michel Simpson","Mickey Kennedy","Mike Sloan","Milton Walsh","Mohamed Allison","Mohammad Christensen","Nadia Macdonald","Naomi Snyder","Ned Lowe","Nettie Leonard","Olive Perkins","Ophelia Morrow","Oren Montes","Orlando Henderson","Owen Buchanan","Paul Norman","Rafael Barrett","Raymond Cochran","Reed Hooper","Reinaldo Houston","Renato Simmons","Rene Calhoun","Reva Hardin","Robert French","Robin Bender","Rodolfo Scott","Roland Blake","Roland Sullivan","Rolf Barnett","Ross Marquez","Ruthie Daugherty","Sandra Potts","Scott Stephenson","Scotty Gonzales","Sean Wiggins","Shana Gallagher","Sharron Montes","Sheryl Lindsey","Socorro Hayden","Solomon Andrade","Stacey Whitehead","Stevie Hale","Stuart Oliver","Stuart Riddle","Tammy Merritt","Theo Wiley","Theresa Murillo","Timothy Roberts","Tony Torres","Tracy Logan","Troy Hoover","Twila Rubio","Velma Everett","Vincent Mccormick","Vincenzo Stafford","Vito Clark","Waldo Spencer","Werner Lowe","Werner Shepard","Wesley Ford","Wm Cantu","Zelma Pierce"]
[null,null,null,null,null,"Dorothy Winters",{"$f":"IF('Resulting List'!F121=\"\",\"\",'Resulting List'!F121)","v":""},null,{"$f":"TRANSPOSE(_xlfn._xlws.SORT(_xlfn.UNIQUE(_xlfn._xlws.FILTER(Customers[Names],ISNUMBER(SEARCH(Customers[[#This Row],[Search Criteria]],Customers[Names])),\"No data.\"))))","v":"Adriana Todd"},"Albert Ramirez","Alex Rubio","Amanda Beck","Amparo Orozco","Amy Todd","Angelina Roberson","April Fox","Arden Ayala","Arnoldo Pennington","Aubrey Giles","Bette Rivers","Brianna Alexander","Brianna Mora","Britt Vazquez","Broderick Gillespie","Brooke Roman","Calvin Buck","Carmela Mullins","Carol Stevenson","Carolina Russell","Carolyn Roberts","Chelsea Gilbert","Cheryl Williamson","Christa Frederick","Christian Armstrong","Christopher Stuart","Chung Krueger","Clare Whitney","Clarissa Archer","Claudio Lam","Cordell Mills","Craig Shepherd","Damien Kramer","Dane Burke","Danielle Stout","Darrel Liu","Darrin Mcneil","Darron Aguilar","Della Huber","Delores Krause","Dena Rosario","Dominick Johnston","Dona Herring","Dorothy Winters","Douglas Wiley","Doyle David","Earlene Hester","Earline Shepherd","Edwin Sparks","Eli Galvan","Elinor Kaufman","Elroy Porter","Elvin Flynn","Emmitt Porter","Erik Parsons","Ethel Forbes","Felicia Ware","Fidel Haynes","Francisco Valenzuela","Frank Hunt","Gabriela Moore","Gabrielle Patrick","Gale Fitzpatrick","Gayle Curtis","Genevieve Lucero","Gerry Oneal","Grady Ellis","Grover Escobar","Hans Patel","Horacio Black","Humberto Compton","Hunter Short","Ilene Mcguire","Imelda Lloyd","Ira Macdonald","Issac Allen","Jacques Velazquez","Janis Mullins","Janna Cowan","Javier Garner","Jayson Abbott","Jeannie Tapia","Jefferson Lee","Jeramy Keith","Jermaine Bradshaw","Jewel Lee","Jimmie Yang","Jodie Wood","John Cline","Josefina Dickerson","Josie Pineda","Judith Griffin","Julius Soto","Kelli Romero","Kerri Joseph","Kim Mccall","Lakeisha Velazquez","Latonya Logan","Lee Schmidt","Lela Atkins","Leland Robertson","Leonardo House","Leroy Mcintyre","Lesley Blevins","Lilia Berg","Lilly Stone","Lincoln Bond","Lindsay Hurst","Lionel Fuller","Lorene Hunter","Louis Kidd","Lucius Warren","Lucy Mejia","Lupe Ingram","Lynette Fuller","Lynnette Wright","Madge Copeland","Madge Tanner","Mae Sawyer","Malcolm Newman","Mamie Wong","Mandy Swanson","Marcella Everett","Marco Bright","Marcos Schaefer","Marcus Hays","Marina Walsh","Marion Savage","Marylou Bass","Marylou Mccarthy","Mathew Howard","Maurice Jacobson","Mauricio Bautista","Max Smith","Melanie Bridges","Melissa Brandt","Merlin Wu","Michel Simpson","Mickey Kennedy","Mike Sloan","Milton Walsh","Mohamed Allison","Mohammad Christensen","Nadia Macdonald","Naomi Snyder","Ned Lowe","Nettie Leonard","Olive Perkins","Ophelia Morrow","Oren Montes","Orlando Henderson","Owen Buchanan","Paul Norman","Rafael Barrett","Raymond Cochran","Reed Hooper","Reinaldo Houston","Renato Simmons","Rene Calhoun","Reva Hardin","Robert French","Robin Bender","Rodolfo Scott","Roland Blake","Roland Sullivan","Rolf Barnett","Ross Marquez","Ruthie Daugherty","Sandra Potts","Scott Stephenson","Scotty Gonzales","Sean Wiggins","Shana Gallagher","Sharron Montes","Sheryl Lindsey","Socorro Hayden","Solomon Andrade","Stacey Whitehead","Stevie Hale","Stuart Oliver","Stuart Riddle","Tammy Merritt","Theo Wiley","Theresa Murillo","Timothy Roberts","Tony Torres","Tracy Logan","Troy Hoover","Twila Rubio","Velma Everett","Vincent Mccormick","Vincenzo Stafford","Vito Clark","Waldo Spencer","Werner Lowe","Werner Shepard","Wesley Ford","Wm Cantu","Zelma Pierce"]
[null,null,null,null,null,"Carolyn Roberts",{"$f":"IF('Resulting List'!F122=\"\",\"\",'Resulting List'!F122)","v":""},null,{"$f":"TRANSPOSE(_xlfn._xlws.SORT(_xlfn.UNIQUE(_xlfn._xlws.FILTER(Customers[Names],ISNUMBER(SEARCH(Customers[[#This Row],[Search Criteria]],Customers[Names])),\"No data.\"))))","v":"Adriana Todd"},"Albert Ramirez","Alex Rubio","Amanda Beck","Amparo Orozco","Amy Todd","Angelina Roberson","April Fox","Arden Ayala","Arnoldo Pennington","Aubrey Giles","Bette Rivers","Brianna Alexander","Brianna Mora","Britt Vazquez","Broderick Gillespie","Brooke Roman","Calvin Buck","Carmela Mullins","Carol Stevenson","Carolina Russell","Carolyn Roberts","Chelsea Gilbert","Cheryl Williamson","Christa Frederick","Christian Armstrong","Christopher Stuart","Chung Krueger","Clare Whitney","Clarissa Archer","Claudio Lam","Cordell Mills","Craig Shepherd","Damien Kramer","Dane Burke","Danielle Stout","Darrel Liu","Darrin Mcneil","Darron Aguilar","Della Huber","Delores Krause","Dena Rosario","Dominick Johnston","Dona Herring","Dorothy Winters","Douglas Wiley","Doyle David","Earlene Hester","Earline Shepherd","Edwin Sparks","Eli Galvan","Elinor Kaufman","Elroy Porter","Elvin Flynn","Emmitt Porter","Erik Parsons","Ethel Forbes","Felicia Ware","Fidel Haynes","Francisco Valenzuela","Frank Hunt","Gabriela Moore","Gabrielle Patrick","Gale Fitzpatrick","Gayle Curtis","Genevieve Lucero","Gerry Oneal","Grady Ellis","Grover Escobar","Hans Patel","Horacio Black","Humberto Compton","Hunter Short","Ilene Mcguire","Imelda Lloyd","Ira Macdonald","Issac Allen","Jacques Velazquez","Janis Mullins","Janna Cowan","Javier Garner","Jayson Abbott","Jeannie Tapia","Jefferson Lee","Jeramy Keith","Jermaine Bradshaw","Jewel Lee","Jimmie Yang","Jodie Wood","John Cline","Josefina Dickerson","Josie Pineda","Judith Griffin","Julius Soto","Kelli Romero","Kerri Joseph","Kim Mccall","Lakeisha Velazquez","Latonya Logan","Lee Schmidt","Lela Atkins","Leland Robertson","Leonardo House","Leroy Mcintyre","Lesley Blevins","Lilia Berg","Lilly Stone","Lincoln Bond","Lindsay Hurst","Lionel Fuller","Lorene Hunter","Louis Kidd","Lucius Warren","Lucy Mejia","Lupe Ingram","Lynette Fuller","Lynnette Wright","Madge Copeland","Madge Tanner","Mae Sawyer","Malcolm Newman","Mamie Wong","Mandy Swanson","Marcella Everett","Marco Bright","Marcos Schaefer","Marcus Hays","Marina Walsh","Marion Savage","Marylou Bass","Marylou Mccarthy","Mathew Howard","Maurice Jacobson","Mauricio Bautista","Max Smith","Melanie Bridges","Melissa Brandt","Merlin Wu","Michel Simpson","Mickey Kennedy","Mike Sloan","Milton Walsh","Mohamed Allison","Mohammad Christensen","Nadia Macdonald","Naomi Snyder","Ned Lowe","Nettie Leonard","Olive Perkins","Ophelia Morrow","Oren Montes","Orlando Henderson","Owen Buchanan","Paul Norman","Rafael Barrett","Raymond Cochran","Reed Hooper","Reinaldo Houston","Renato Simmons","Rene Calhoun","Reva Hardin","Robert French","Robin Bender","Rodolfo Scott","Roland Blake","Roland Sullivan","Rolf Barnett","Ross Marquez","Ruthie Daugherty","Sandra Potts","Scott Stephenson","Scotty Gonzales","Sean Wiggins","Shana Gallagher","Sharron Montes","Sheryl Lindsey","Socorro Hayden","Solomon Andrade","Stacey Whitehead","Stevie Hale","Stuart Oliver","Stuart Riddle","Tammy Merritt","Theo Wiley","Theresa Murillo","Timothy Roberts","Tony Torres","Tracy Logan","Troy Hoover","Twila Rubio","Velma Everett","Vincent Mccormick","Vincenzo Stafford","Vito Clark","Waldo Spencer","Werner Lowe","Werner Shepard","Wesley Ford","Wm Cantu","Zelma Pierce"]
[null,null,null,null,null,"Kelli Romero",{"$f":"IF('Resulting List'!F123=\"\",\"\",'Resulting List'!F123)","v":""},null,{"$f":"TRANSPOSE(_xlfn._xlws.SORT(_xlfn.UNIQUE(_xlfn._xlws.FILTER(Customers[Names],ISNUMBER(SEARCH(Customers[[#This Row],[Search Criteria]],Customers[Names])),\"No data.\"))))","v":"Adriana Todd"},"Albert Ramirez","Alex Rubio","Amanda Beck","Amparo Orozco","Amy Todd","Angelina Roberson","April Fox","Arden Ayala","Arnoldo Pennington","Aubrey Giles","Bette Rivers","Brianna Alexander","Brianna Mora","Britt Vazquez","Broderick Gillespie","Brooke Roman","Calvin Buck","Carmela Mullins","Carol Stevenson","Carolina Russell","Carolyn Roberts","Chelsea Gilbert","Cheryl Williamson","Christa Frederick","Christian Armstrong","Christopher Stuart","Chung Krueger","Clare Whitney","Clarissa Archer","Claudio Lam","Cordell Mills","Craig Shepherd","Damien Kramer","Dane Burke","Danielle Stout","Darrel Liu","Darrin Mcneil","Darron Aguilar","Della Huber","Delores Krause","Dena Rosario","Dominick Johnston","Dona Herring","Dorothy Winters","Douglas Wiley","Doyle David","Earlene Hester","Earline Shepherd","Edwin Sparks","Eli Galvan","Elinor Kaufman","Elroy Porter","Elvin Flynn","Emmitt Porter","Erik Parsons","Ethel Forbes","Felicia Ware","Fidel Haynes","Francisco Valenzuela","Frank Hunt","Gabriela Moore","Gabrielle Patrick","Gale Fitzpatrick","Gayle Curtis","Genevieve Lucero","Gerry Oneal","Grady Ellis","Grover Escobar","Hans Patel","Horacio Black","Humberto Compton","Hunter Short","Ilene Mcguire","Imelda Lloyd","Ira Macdonald","Issac Allen","Jacques Velazquez","Janis Mullins","Janna Cowan","Javier Garner","Jayson Abbott","Jeannie Tapia","Jefferson Lee","Jeramy Keith","Jermaine Bradshaw","Jewel Lee","Jimmie Yang","Jodie Wood","John Cline","Josefina Dickerson","Josie Pineda","Judith Griffin","Julius Soto","Kelli Romero","Kerri Joseph","Kim Mccall","Lakeisha Velazquez","Latonya Logan","Lee Schmidt","Lela Atkins","Leland Robertson","Leonardo House","Leroy Mcintyre","Lesley Blevins","Lilia Berg","Lilly Stone","Lincoln Bond","Lindsay Hurst","Lionel Fuller","Lorene Hunter","Louis Kidd","Lucius Warren","Lucy Mejia","Lupe Ingram","Lynette Fuller","Lynnette Wright","Madge Copeland","Madge Tanner","Mae Sawyer","Malcolm Newman","Mamie Wong","Mandy Swanson","Marcella Everett","Marco Bright","Marcos Schaefer","Marcus Hays","Marina Walsh","Marion Savage","Marylou Bass","Marylou Mccarthy","Mathew Howard","Maurice Jacobson","Mauricio Bautista","Max Smith","Melanie Bridges","Melissa Brandt","Merlin Wu","Michel Simpson","Mickey Kennedy","Mike Sloan","Milton Walsh","Mohamed Allison","Mohammad Christensen","Nadia Macdonald","Naomi Snyder","Ned Lowe","Nettie Leonard","Olive Perkins","Ophelia Morrow","Oren Montes","Orlando Henderson","Owen Buchanan","Paul Norman","Rafael Barrett","Raymond Cochran","Reed Hooper","Reinaldo Houston","Renato Simmons","Rene Calhoun","Reva Hardin","Robert French","Robin Bender","Rodolfo Scott","Roland Blake","Roland Sullivan","Rolf Barnett","Ross Marquez","Ruthie Daugherty","Sandra Potts","Scott Stephenson","Scotty Gonzales","Sean Wiggins","Shana Gallagher","Sharron Montes","Sheryl Lindsey","Socorro Hayden","Solomon Andrade","Stacey Whitehead","Stevie Hale","Stuart Oliver","Stuart Riddle","Tammy Merritt","Theo Wiley","Theresa Murillo","Timothy Roberts","Tony Torres","Tracy Logan","Troy Hoover","Twila Rubio","Velma Everett","Vincent Mccormick","Vincenzo Stafford","Vito Clark","Waldo Spencer","Werner Lowe","Werner Shepard","Wesley Ford","Wm Cantu","Zelma Pierce"]
[null,null,null,null,null,"Mandy Swanson",{"$f":"IF('Resulting List'!F124=\"\",\"\",'Resulting List'!F124)","v":""},null,{"$f":"TRANSPOSE(_xlfn._xlws.SORT(_xlfn.UNIQUE(_xlfn._xlws.FILTER(Customers[Names],ISNUMBER(SEARCH(Customers[[#This Row],[Search Criteria]],Customers[Names])),\"No data.\"))))","v":"Adriana Todd"},"Albert Ramirez","Alex Rubio","Amanda Beck","Amparo Orozco","Amy Todd","Angelina Roberson","April Fox","Arden Ayala","Arnoldo Pennington","Aubrey Giles","Bette Rivers","Brianna Alexander","Brianna Mora","Britt Vazquez","Broderick Gillespie","Brooke Roman","Calvin Buck","Carmela Mullins","Carol Stevenson","Carolina Russell","Carolyn Roberts","Chelsea Gilbert","Cheryl Williamson","Christa Frederick","Christian Armstrong","Christopher Stuart","Chung Krueger","Clare Whitney","Clarissa Archer","Claudio Lam","Cordell Mills","Craig Shepherd","Damien Kramer","Dane Burke","Danielle Stout","Darrel Liu","Darrin Mcneil","Darron Aguilar","Della Huber","Delores Krause","Dena Rosario","Dominick Johnston","Dona Herring","Dorothy Winters","Douglas Wiley","Doyle David","Earlene Hester","Earline Shepherd","Edwin Sparks","Eli Galvan","Elinor Kaufman","Elroy Porter","Elvin Flynn","Emmitt Porter","Erik Parsons","Ethel Forbes","Felicia Ware","Fidel Haynes","Francisco Valenzuela","Frank Hunt","Gabriela Moore","Gabrielle Patrick","Gale Fitzpatrick","Gayle Curtis","Genevieve Lucero","Gerry Oneal","Grady Ellis","Grover Escobar","Hans Patel","Horacio Black","Humberto Compton","Hunter Short","Ilene Mcguire","Imelda Lloyd","Ira Macdonald","Issac Allen","Jacques Velazquez","Janis Mullins","Janna Cowan","Javier Garner","Jayson Abbott","Jeannie Tapia","Jefferson Lee","Jeramy Keith","Jermaine Bradshaw","Jewel Lee","Jimmie Yang","Jodie Wood","John Cline","Josefina Dickerson","Josie Pineda","Judith Griffin","Julius Soto","Kelli Romero","Kerri Joseph","Kim Mccall","Lakeisha Velazquez","Latonya Logan","Lee Schmidt","Lela Atkins","Leland Robertson","Leonardo House","Leroy Mcintyre","Lesley Blevins","Lilia Berg","Lilly Stone","Lincoln Bond","Lindsay Hurst","Lionel Fuller","Lorene Hunter","Louis Kidd","Lucius Warren","Lucy Mejia","Lupe Ingram","Lynette Fuller","Lynnette Wright","Madge Copeland","Madge Tanner","Mae Sawyer","Malcolm Newman","Mamie Wong","Mandy Swanson","Marcella Everett","Marco Bright","Marcos Schaefer","Marcus Hays","Marina Walsh","Marion Savage","Marylou Bass","Marylou Mccarthy","Mathew Howard","Maurice Jacobson","Mauricio Bautista","Max Smith","Melanie Bridges","Melissa Brandt","Merlin Wu","Michel Simpson","Mickey Kennedy","Mike Sloan","Milton Walsh","Mohamed Allison","Mohammad Christensen","Nadia Macdonald","Naomi Snyder","Ned Lowe","Nettie Leonard","Olive Perkins","Ophelia Morrow","Oren Montes","Orlando Henderson","Owen Buchanan","Paul Norman","Rafael Barrett","Raymond Cochran","Reed Hooper","Reinaldo Houston","Renato Simmons","Rene Calhoun","Reva Hardin","Robert French","Robin Bender","Rodolfo Scott","Roland Blake","Roland Sullivan","Rolf Barnett","Ross Marquez","Ruthie Daugherty","Sandra Potts","Scott Stephenson","Scotty Gonzales","Sean Wiggins","Shana Gallagher","Sharron Montes","Sheryl Lindsey","Socorro Hayden","Solomon Andrade","Stacey Whitehead","Stevie Hale","Stuart Oliver","Stuart Riddle","Tammy Merritt","Theo Wiley","Theresa Murillo","Timothy Roberts","Tony Torres","Tracy Logan","Troy Hoover","Twila Rubio","Velma Everett","Vincent Mccormick","Vincenzo Stafford","Vito Clark","Waldo Spencer","Werner Lowe","Werner Shepard","Wesley Ford","Wm Cantu","Zelma Pierce"]
[null,null,null,null,null,"Rolf Barnett",{"$f":"IF('Resulting List'!F125=\"\",\"\",'Resulting List'!F125)","v":""},null,{"$f":"TRANSPOSE(_xlfn._xlws.SORT(_xlfn.UNIQUE(_xlfn._xlws.FILTER(Customers[Names],ISNUMBER(SEARCH(Customers[[#This Row],[Search Criteria]],Customers[Names])),\"No data.\"))))","v":"Adriana Todd"},"Albert Ramirez","Alex Rubio","Amanda Beck","Amparo Orozco","Amy Todd","Angelina Roberson","April Fox","Arden Ayala","Arnoldo Pennington","Aubrey Giles","Bette Rivers","Brianna Alexander","Brianna Mora","Britt Vazquez","Broderick Gillespie","Brooke Roman","Calvin Buck","Carmela Mullins","Carol Stevenson","Carolina Russell","Carolyn Roberts","Chelsea Gilbert","Cheryl Williamson","Christa Frederick","Christian Armstrong","Christopher Stuart","Chung Krueger","Clare Whitney","Clarissa Archer","Claudio Lam","Cordell Mills","Craig Shepherd","Damien Kramer","Dane Burke","Danielle Stout","Darrel Liu","Darrin Mcneil","Darron Aguilar","Della Huber","Delores Krause","Dena Rosario","Dominick Johnston","Dona Herring","Dorothy Winters","Douglas Wiley","Doyle David","Earlene Hester","Earline Shepherd","Edwin Sparks","Eli Galvan","Elinor Kaufman","Elroy Porter","Elvin Flynn","Emmitt Porter","Erik Parsons","Ethel Forbes","Felicia Ware","Fidel Haynes","Francisco Valenzuela","Frank Hunt","Gabriela Moore","Gabrielle Patrick","Gale Fitzpatrick","Gayle Curtis","Genevieve Lucero","Gerry Oneal","Grady Ellis","Grover Escobar","Hans Patel","Horacio Black","Humberto Compton","Hunter Short","Ilene Mcguire","Imelda Lloyd","Ira Macdonald","Issac Allen","Jacques Velazquez","Janis Mullins","Janna Cowan","Javier Garner","Jayson Abbott","Jeannie Tapia","Jefferson Lee","Jeramy Keith","Jermaine Bradshaw","Jewel Lee","Jimmie Yang","Jodie Wood","John Cline","Josefina Dickerson","Josie Pineda","Judith Griffin","Julius Soto","Kelli Romero","Kerri Joseph","Kim Mccall","Lakeisha Velazquez","Latonya Logan","Lee Schmidt","Lela Atkins","Leland Robertson","Leonardo House","Leroy Mcintyre","Lesley Blevins","Lilia Berg","Lilly Stone","Lincoln Bond","Lindsay Hurst","Lionel Fuller","Lorene Hunter","Louis Kidd","Lucius Warren","Lucy Mejia","Lupe Ingram","Lynette Fuller","Lynnette Wright","Madge Copeland","Madge Tanner","Mae Sawyer","Malcolm Newman","Mamie Wong","Mandy Swanson","Marcella Everett","Marco Bright","Marcos Schaefer","Marcus Hays","Marina Walsh","Marion Savage","Marylou Bass","Marylou Mccarthy","Mathew Howard","Maurice Jacobson","Mauricio Bautista","Max Smith","Melanie Bridges","Melissa Brandt","Merlin Wu","Michel Simpson","Mickey Kennedy","Mike Sloan","Milton Walsh","Mohamed Allison","Mohammad Christensen","Nadia Macdonald","Naomi Snyder","Ned Lowe","Nettie Leonard","Olive Perkins","Ophelia Morrow","Oren Montes","Orlando Henderson","Owen Buchanan","Paul Norman","Rafael Barrett","Raymond Cochran","Reed Hooper","Reinaldo Houston","Renato Simmons","Rene Calhoun","Reva Hardin","Robert French","Robin Bender","Rodolfo Scott","Roland Blake","Roland Sullivan","Rolf Barnett","Ross Marquez","Ruthie Daugherty","Sandra Potts","Scott Stephenson","Scotty Gonzales","Sean Wiggins","Shana Gallagher","Sharron Montes","Sheryl Lindsey","Socorro Hayden","Solomon Andrade","Stacey Whitehead","Stevie Hale","Stuart Oliver","Stuart Riddle","Tammy Merritt","Theo Wiley","Theresa Murillo","Timothy Roberts","Tony Torres","Tracy Logan","Troy Hoover","Twila Rubio","Velma Everett","Vincent Mccormick","Vincenzo Stafford","Vito Clark","Waldo Spencer","Werner Lowe","Werner Shepard","Wesley Ford","Wm Cantu","Zelma Pierce"]
[null,null,null,null,null,"Alex Rubio",{"$f":"IF('Resulting List'!F126=\"\",\"\",'Resulting List'!F126)","v":""},null,{"$f":"TRANSPOSE(_xlfn._xlws.SORT(_xlfn.UNIQUE(_xlfn._xlws.FILTER(Customers[Names],ISNUMBER(SEARCH(Customers[[#This Row],[Search Criteria]],Customers[Names])),\"No data.\"))))","v":"Adriana Todd"},"Albert Ramirez","Alex Rubio","Amanda Beck","Amparo Orozco","Amy Todd","Angelina Roberson","April Fox","Arden Ayala","Arnoldo Pennington","Aubrey Giles","Bette Rivers","Brianna Alexander","Brianna Mora","Britt Vazquez","Broderick Gillespie","Brooke Roman","Calvin Buck","Carmela Mullins","Carol Stevenson","Carolina Russell","Carolyn Roberts","Chelsea Gilbert","Cheryl Williamson","Christa Frederick","Christian Armstrong","Christopher Stuart","Chung Krueger","Clare Whitney","Clarissa Archer","Claudio Lam","Cordell Mills","Craig Shepherd","Damien Kramer","Dane Burke","Danielle Stout","Darrel Liu","Darrin Mcneil","Darron Aguilar","Della Huber","Delores Krause","Dena Rosario","Dominick Johnston","Dona Herring","Dorothy Winters","Douglas Wiley","Doyle David","Earlene Hester","Earline Shepherd","Edwin Sparks","Eli Galvan","Elinor Kaufman","Elroy Porter","Elvin Flynn","Emmitt Porter","Erik Parsons","Ethel Forbes","Felicia Ware","Fidel Haynes","Francisco Valenzuela","Frank Hunt","Gabriela Moore","Gabrielle Patrick","Gale Fitzpatrick","Gayle Curtis","Genevieve Lucero","Gerry Oneal","Grady Ellis","Grover Escobar","Hans Patel","Horacio Black","Humberto Compton","Hunter Short","Ilene Mcguire","Imelda Lloyd","Ira Macdonald","Issac Allen","Jacques Velazquez","Janis Mullins","Janna Cowan","Javier Garner","Jayson Abbott","Jeannie Tapia","Jefferson Lee","Jeramy Keith","Jermaine Bradshaw","Jewel Lee","Jimmie Yang","Jodie Wood","John Cline","Josefina Dickerson","Josie Pineda","Judith Griffin","Julius Soto","Kelli Romero","Kerri Joseph","Kim Mccall","Lakeisha Velazquez","Latonya Logan","Lee Schmidt","Lela Atkins","Leland Robertson","Leonardo House","Leroy Mcintyre","Lesley Blevins","Lilia Berg","Lilly Stone","Lincoln Bond","Lindsay Hurst","Lionel Fuller","Lorene Hunter","Louis Kidd","Lucius Warren","Lucy Mejia","Lupe Ingram","Lynette Fuller","Lynnette Wright","Madge Copeland","Madge Tanner","Mae Sawyer","Malcolm Newman","Mamie Wong","Mandy Swanson","Marcella Everett","Marco Bright","Marcos Schaefer","Marcus Hays","Marina Walsh","Marion Savage","Marylou Bass","Marylou Mccarthy","Mathew Howard","Maurice Jacobson","Mauricio Bautista","Max Smith","Melanie Bridges","Melissa Brandt","Merlin Wu","Michel Simpson","Mickey Kennedy","Mike Sloan","Milton Walsh","Mohamed Allison","Mohammad Christensen","Nadia Macdonald","Naomi Snyder","Ned Lowe","Nettie Leonard","Olive Perkins","Ophelia Morrow","Oren Montes","Orlando Henderson","Owen Buchanan","Paul Norman","Rafael Barrett","Raymond Cochran","Reed Hooper","Reinaldo Houston","Renato Simmons","Rene Calhoun","Reva Hardin","Robert French","Robin Bender","Rodolfo Scott","Roland Blake","Roland Sullivan","Rolf Barnett","Ross Marquez","Ruthie Daugherty","Sandra Potts","Scott Stephenson","Scotty Gonzales","Sean Wiggins","Shana Gallagher","Sharron Montes","Sheryl Lindsey","Socorro Hayden","Solomon Andrade","Stacey Whitehead","Stevie Hale","Stuart Oliver","Stuart Riddle","Tammy Merritt","Theo Wiley","Theresa Murillo","Timothy Roberts","Tony Torres","Tracy Logan","Troy Hoover","Twila Rubio","Velma Everett","Vincent Mccormick","Vincenzo Stafford","Vito Clark","Waldo Spencer","Werner Lowe","Werner Shepard","Wesley Ford","Wm Cantu","Zelma Pierce"]
[null,null,null,null,null,"Marcus Hays",{"$f":"IF('Resulting List'!F127=\"\",\"\",'Resulting List'!F127)","v":""},null,{"$f":"TRANSPOSE(_xlfn._xlws.SORT(_xlfn.UNIQUE(_xlfn._xlws.FILTER(Customers[Names],ISNUMBER(SEARCH(Customers[[#This Row],[Search Criteria]],Customers[Names])),\"No data.\"))))","v":"Adriana Todd"},"Albert Ramirez","Alex Rubio","Amanda Beck","Amparo Orozco","Amy Todd","Angelina Roberson","April Fox","Arden Ayala","Arnoldo Pennington","Aubrey Giles","Bette Rivers","Brianna Alexander","Brianna Mora","Britt Vazquez","Broderick Gillespie","Brooke Roman","Calvin Buck","Carmela Mullins","Carol Stevenson","Carolina Russell","Carolyn Roberts","Chelsea Gilbert","Cheryl Williamson","Christa Frederick","Christian Armstrong","Christopher Stuart","Chung Krueger","Clare Whitney","Clarissa Archer","Claudio Lam","Cordell Mills","Craig Shepherd","Damien Kramer","Dane Burke","Danielle Stout","Darrel Liu","Darrin Mcneil","Darron Aguilar","Della Huber","Delores Krause","Dena Rosario","Dominick Johnston","Dona Herring","Dorothy Winters","Douglas Wiley","Doyle David","Earlene Hester","Earline Shepherd","Edwin Sparks","Eli Galvan","Elinor Kaufman","Elroy Porter","Elvin Flynn","Emmitt Porter","Erik Parsons","Ethel Forbes","Felicia Ware","Fidel Haynes","Francisco Valenzuela","Frank Hunt","Gabriela Moore","Gabrielle Patrick","Gale Fitzpatrick","Gayle Curtis","Genevieve Lucero","Gerry Oneal","Grady Ellis","Grover Escobar","Hans Patel","Horacio Black","Humberto Compton","Hunter Short","Ilene Mcguire","Imelda Lloyd","Ira Macdonald","Issac Allen","Jacques Velazquez","Janis Mullins","Janna Cowan","Javier Garner","Jayson Abbott","Jeannie Tapia","Jefferson Lee","Jeramy Keith","Jermaine Bradshaw","Jewel Lee","Jimmie Yang","Jodie Wood","John Cline","Josefina Dickerson","Josie Pineda","Judith Griffin","Julius Soto","Kelli Romero","Kerri Joseph","Kim Mccall","Lakeisha Velazquez","Latonya Logan","Lee Schmidt","Lela Atkins","Leland Robertson","Leonardo House","Leroy Mcintyre","Lesley Blevins","Lilia Berg","Lilly Stone","Lincoln Bond","Lindsay Hurst","Lionel Fuller","Lorene Hunter","Louis Kidd","Lucius Warren","Lucy Mejia","Lupe Ingram","Lynette Fuller","Lynnette Wright","Madge Copeland","Madge Tanner","Mae Sawyer","Malcolm Newman","Mamie Wong","Mandy Swanson","Marcella Everett","Marco Bright","Marcos Schaefer","Marcus Hays","Marina Walsh","Marion Savage","Marylou Bass","Marylou Mccarthy","Mathew Howard","Maurice Jacobson","Mauricio Bautista","Max Smith","Melanie Bridges","Melissa Brandt","Merlin Wu","Michel Simpson","Mickey Kennedy","Mike Sloan","Milton Walsh","Mohamed Allison","Mohammad Christensen","Nadia Macdonald","Naomi Snyder","Ned Lowe","Nettie Leonard","Olive Perkins","Ophelia Morrow","Oren Montes","Orlando Henderson","Owen Buchanan","Paul Norman","Rafael Barrett","Raymond Cochran","Reed Hooper","Reinaldo Houston","Renato Simmons","Rene Calhoun","Reva Hardin","Robert French","Robin Bender","Rodolfo Scott","Roland Blake","Roland Sullivan","Rolf Barnett","Ross Marquez","Ruthie Daugherty","Sandra Potts","Scott Stephenson","Scotty Gonzales","Sean Wiggins","Shana Gallagher","Sharron Montes","Sheryl Lindsey","Socorro Hayden","Solomon Andrade","Stacey Whitehead","Stevie Hale","Stuart Oliver","Stuart Riddle","Tammy Merritt","Theo Wiley","Theresa Murillo","Timothy Roberts","Tony Torres","Tracy Logan","Troy Hoover","Twila Rubio","Velma Everett","Vincent Mccormick","Vincenzo Stafford","Vito Clark","Waldo Spencer","Werner Lowe","Werner Shepard","Wesley Ford","Wm Cantu","Zelma Pierce"]
[null,null,null,null,null,"Lindsay Hurst",{"$f":"IF('Resulting List'!F128=\"\",\"\",'Resulting List'!F128)","v":""},null,{"$f":"TRANSPOSE(_xlfn._xlws.SORT(_xlfn.UNIQUE(_xlfn._xlws.FILTER(Customers[Names],ISNUMBER(SEARCH(Customers[[#This Row],[Search Criteria]],Customers[Names])),\"No data.\"))))","v":"Adriana Todd"},"Albert Ramirez","Alex Rubio","Amanda Beck","Amparo Orozco","Amy Todd","Angelina Roberson","April Fox","Arden Ayala","Arnoldo Pennington","Aubrey Giles","Bette Rivers","Brianna Alexander","Brianna Mora","Britt Vazquez","Broderick Gillespie","Brooke Roman","Calvin Buck","Carmela Mullins","Carol Stevenson","Carolina Russell","Carolyn Roberts","Chelsea Gilbert","Cheryl Williamson","Christa Frederick","Christian Armstrong","Christopher Stuart","Chung Krueger","Clare Whitney","Clarissa Archer","Claudio Lam","Cordell Mills","Craig Shepherd","Damien Kramer","Dane Burke","Danielle Stout","Darrel Liu","Darrin Mcneil","Darron Aguilar","Della Huber","Delores Krause","Dena Rosario","Dominick Johnston","Dona Herring","Dorothy Winters","Douglas Wiley","Doyle David","Earlene Hester","Earline Shepherd","Edwin Sparks","Eli Galvan","Elinor Kaufman","Elroy Porter","Elvin Flynn","Emmitt Porter","Erik Parsons","Ethel Forbes","Felicia Ware","Fidel Haynes","Francisco Valenzuela","Frank Hunt","Gabriela Moore","Gabrielle Patrick","Gale Fitzpatrick","Gayle Curtis","Genevieve Lucero","Gerry Oneal","Grady Ellis","Grover Escobar","Hans Patel","Horacio Black","Humberto Compton","Hunter Short","Ilene Mcguire","Imelda Lloyd","Ira Macdonald","Issac Allen","Jacques Velazquez","Janis Mullins","Janna Cowan","Javier Garner","Jayson Abbott","Jeannie Tapia","Jefferson Lee","Jeramy Keith","Jermaine Bradshaw","Jewel Lee","Jimmie Yang","Jodie Wood","John Cline","Josefina Dickerson","Josie Pineda","Judith Griffin","Julius Soto","Kelli Romero","Kerri Joseph","Kim Mccall","Lakeisha Velazquez","Latonya Logan","Lee Schmidt","Lela Atkins","Leland Robertson","Leonardo House","Leroy Mcintyre","Lesley Blevins","Lilia Berg","Lilly Stone","Lincoln Bond","Lindsay Hurst","Lionel Fuller","Lorene Hunter","Louis Kidd","Lucius Warren","Lucy Mejia","Lupe Ingram","Lynette Fuller","Lynnette Wright","Madge Copeland","Madge Tanner","Mae Sawyer","Malcolm Newman","Mamie Wong","Mandy Swanson","Marcella Everett","Marco Bright","Marcos Schaefer","Marcus Hays","Marina Walsh","Marion Savage","Marylou Bass","Marylou Mccarthy","Mathew Howard","Maurice Jacobson","Mauricio Bautista","Max Smith","Melanie Bridges","Melissa Brandt","Merlin Wu","Michel Simpson","Mickey Kennedy","Mike Sloan","Milton Walsh","Mohamed Allison","Mohammad Christensen","Nadia Macdonald","Naomi Snyder","Ned Lowe","Nettie Leonard","Olive Perkins","Ophelia Morrow","Oren Montes","Orlando Henderson","Owen Buchanan","Paul Norman","Rafael Barrett","Raymond Cochran","Reed Hooper","Reinaldo Houston","Renato Simmons","Rene Calhoun","Reva Hardin","Robert French","Robin Bender","Rodolfo Scott","Roland Blake","Roland Sullivan","Rolf Barnett","Ross Marquez","Ruthie Daugherty","Sandra Potts","Scott Stephenson","Scotty Gonzales","Sean Wiggins","Shana Gallagher","Sharron Montes","Sheryl Lindsey","Socorro Hayden","Solomon Andrade","Stacey Whitehead","Stevie Hale","Stuart Oliver","Stuart Riddle","Tammy Merritt","Theo Wiley","Theresa Murillo","Timothy Roberts","Tony Torres","Tracy Logan","Troy Hoover","Twila Rubio","Velma Everett","Vincent Mccormick","Vincenzo Stafford","Vito Clark","Waldo Spencer","Werner Lowe","Werner Shepard","Wesley Ford","Wm Cantu","Zelma Pierce"]
[null,null,null,null,null,"Latonya Logan",{"$f":"IF('Resulting List'!F129=\"\",\"\",'Resulting List'!F129)","v":""},null,{"$f":"TRANSPOSE(_xlfn._xlws.SORT(_xlfn.UNIQUE(_xlfn._xlws.FILTER(Customers[Names],ISNUMBER(SEARCH(Customers[[#This Row],[Search Criteria]],Customers[Names])),\"No data.\"))))","v":"Adriana Todd"},"Albert Ramirez","Alex Rubio","Amanda Beck","Amparo Orozco","Amy Todd","Angelina Roberson","April Fox","Arden Ayala","Arnoldo Pennington","Aubrey Giles","Bette Rivers","Brianna Alexander","Brianna Mora","Britt Vazquez","Broderick Gillespie","Brooke Roman","Calvin Buck","Carmela Mullins","Carol Stevenson","Carolina Russell","Carolyn Roberts","Chelsea Gilbert","Cheryl Williamson","Christa Frederick","Christian Armstrong","Christopher Stuart","Chung Krueger","Clare Whitney","Clarissa Archer","Claudio Lam","Cordell Mills","Craig Shepherd","Damien Kramer","Dane Burke","Danielle Stout","Darrel Liu","Darrin Mcneil","Darron Aguilar","Della Huber","Delores Krause","Dena Rosario","Dominick Johnston","Dona Herring","Dorothy Winters","Douglas Wiley","Doyle David","Earlene Hester","Earline Shepherd","Edwin Sparks","Eli Galvan","Elinor Kaufman","Elroy Porter","Elvin Flynn","Emmitt Porter","Erik Parsons","Ethel Forbes","Felicia Ware","Fidel Haynes","Francisco Valenzuela","Frank Hunt","Gabriela Moore","Gabrielle Patrick","Gale Fitzpatrick","Gayle Curtis","Genevieve Lucero","Gerry Oneal","Grady Ellis","Grover Escobar","Hans Patel","Horacio Black","Humberto Compton","Hunter Short","Ilene Mcguire","Imelda Lloyd","Ira Macdonald","Issac Allen","Jacques Velazquez","Janis Mullins","Janna Cowan","Javier Garner","Jayson Abbott","Jeannie Tapia","Jefferson Lee","Jeramy Keith","Jermaine Bradshaw","Jewel Lee","Jimmie Yang","Jodie Wood","John Cline","Josefina Dickerson","Josie Pineda","Judith Griffin","Julius Soto","Kelli Romero","Kerri Joseph","Kim Mccall","Lakeisha Velazquez","Latonya Logan","Lee Schmidt","Lela Atkins","Leland Robertson","Leonardo House","Leroy Mcintyre","Lesley Blevins","Lilia Berg","Lilly Stone","Lincoln Bond","Lindsay Hurst","Lionel Fuller","Lorene Hunter","Louis Kidd","Lucius Warren","Lucy Mejia","Lupe Ingram","Lynette Fuller","Lynnette Wright","Madge Copeland","Madge Tanner","Mae Sawyer","Malcolm Newman","Mamie Wong","Mandy Swanson","Marcella Everett","Marco Bright","Marcos Schaefer","Marcus Hays","Marina Walsh","Marion Savage","Marylou Bass","Marylou Mccarthy","Mathew Howard","Maurice Jacobson","Mauricio Bautista","Max Smith","Melanie Bridges","Melissa Brandt","Merlin Wu","Michel Simpson","Mickey Kennedy","Mike Sloan","Milton Walsh","Mohamed Allison","Mohammad Christensen","Nadia Macdonald","Naomi Snyder","Ned Lowe","Nettie Leonard","Olive Perkins","Ophelia Morrow","Oren Montes","Orlando Henderson","Owen Buchanan","Paul Norman","Rafael Barrett","Raymond Cochran","Reed Hooper","Reinaldo Houston","Renato Simmons","Rene Calhoun","Reva Hardin","Robert French","Robin Bender","Rodolfo Scott","Roland Blake","Roland Sullivan","Rolf Barnett","Ross Marquez","Ruthie Daugherty","Sandra Potts","Scott Stephenson","Scotty Gonzales","Sean Wiggins","Shana Gallagher","Sharron Montes","Sheryl Lindsey","Socorro Hayden","Solomon Andrade","Stacey Whitehead","Stevie Hale","Stuart Oliver","Stuart Riddle","Tammy Merritt","Theo Wiley","Theresa Murillo","Timothy Roberts","Tony Torres","Tracy Logan","Troy Hoover","Twila Rubio","Velma Everett","Vincent Mccormick","Vincenzo Stafford","Vito Clark","Waldo Spencer","Werner Lowe","Werner Shepard","Wesley Ford","Wm Cantu","Zelma Pierce"]
[null,null,null,null,null,"Sandra Potts",{"$f":"IF('Resulting List'!F130=\"\",\"\",'Resulting List'!F130)","v":""},null,{"$f":"TRANSPOSE(_xlfn._xlws.SORT(_xlfn.UNIQUE(_xlfn._xlws.FILTER(Customers[Names],ISNUMBER(SEARCH(Customers[[#This Row],[Search Criteria]],Customers[Names])),\"No data.\"))))","v":"Adriana Todd"},"Albert Ramirez","Alex Rubio","Amanda Beck","Amparo Orozco","Amy Todd","Angelina Roberson","April Fox","Arden Ayala","Arnoldo Pennington","Aubrey Giles","Bette Rivers","Brianna Alexander","Brianna Mora","Britt Vazquez","Broderick Gillespie","Brooke Roman","Calvin Buck","Carmela Mullins","Carol Stevenson","Carolina Russell","Carolyn Roberts","Chelsea Gilbert","Cheryl Williamson","Christa Frederick","Christian Armstrong","Christopher Stuart","Chung Krueger","Clare Whitney","Clarissa Archer","Claudio Lam","Cordell Mills","Craig Shepherd","Damien Kramer","Dane Burke","Danielle Stout","Darrel Liu","Darrin Mcneil","Darron Aguilar","Della Huber","Delores Krause","Dena Rosario","Dominick Johnston","Dona Herring","Dorothy Winters","Douglas Wiley","Doyle David","Earlene Hester","Earline Shepherd","Edwin Sparks","Eli Galvan","Elinor Kaufman","Elroy Porter","Elvin Flynn","Emmitt Porter","Erik Parsons","Ethel Forbes","Felicia Ware","Fidel Haynes","Francisco Valenzuela","Frank Hunt","Gabriela Moore","Gabrielle Patrick","Gale Fitzpatrick","Gayle Curtis","Genevieve Lucero","Gerry Oneal","Grady Ellis","Grover Escobar","Hans Patel","Horacio Black","Humberto Compton","Hunter Short","Ilene Mcguire","Imelda Lloyd","Ira Macdonald","Issac Allen","Jacques Velazquez","Janis Mullins","Janna Cowan","Javier Garner","Jayson Abbott","Jeannie Tapia","Jefferson Lee","Jeramy Keith","Jermaine Bradshaw","Jewel Lee","Jimmie Yang","Jodie Wood","John Cline","Josefina Dickerson","Josie Pineda","Judith Griffin","Julius Soto","Kelli Romero","Kerri Joseph","Kim Mccall","Lakeisha Velazquez","Latonya Logan","Lee Schmidt","Lela Atkins","Leland Robertson","Leonardo House","Leroy Mcintyre","Lesley Blevins","Lilia Berg","Lilly Stone","Lincoln Bond","Lindsay Hurst","Lionel Fuller","Lorene Hunter","Louis Kidd","Lucius Warren","Lucy Mejia","Lupe Ingram","Lynette Fuller","Lynnette Wright","Madge Copeland","Madge Tanner","Mae Sawyer","Malcolm Newman","Mamie Wong","Mandy Swanson","Marcella Everett","Marco Bright","Marcos Schaefer","Marcus Hays","Marina Walsh","Marion Savage","Marylou Bass","Marylou Mccarthy","Mathew Howard","Maurice Jacobson","Mauricio Bautista","Max Smith","Melanie Bridges","Melissa Brandt","Merlin Wu","Michel Simpson","Mickey Kennedy","Mike Sloan","Milton Walsh","Mohamed Allison","Mohammad Christensen","Nadia Macdonald","Naomi Snyder","Ned Lowe","Nettie Leonard","Olive Perkins","Ophelia Morrow","Oren Montes","Orlando Henderson","Owen Buchanan","Paul Norman","Rafael Barrett","Raymond Cochran","Reed Hooper","Reinaldo Houston","Renato Simmons","Rene Calhoun","Reva Hardin","Robert French","Robin Bender","Rodolfo Scott","Roland Blake","Roland Sullivan","Rolf Barnett","Ross Marquez","Ruthie Daugherty","Sandra Potts","Scott Stephenson","Scotty Gonzales","Sean Wiggins","Shana Gallagher","Sharron Montes","Sheryl Lindsey","Socorro Hayden","Solomon Andrade","Stacey Whitehead","Stevie Hale","Stuart Oliver","Stuart Riddle","Tammy Merritt","Theo Wiley","Theresa Murillo","Timothy Roberts","Tony Torres","Tracy Logan","Troy Hoover","Twila Rubio","Velma Everett","Vincent Mccormick","Vincenzo Stafford","Vito Clark","Waldo Spencer","Werner Lowe","Werner Shepard","Wesley Ford","Wm Cantu","Zelma Pierce"]
[null,null,null,null,null,"Clarissa Archer",{"$f":"IF('Resulting List'!F131=\"\",\"\",'Resulting List'!F131)","v":""},null,{"$f":"TRANSPOSE(_xlfn._xlws.SORT(_xlfn.UNIQUE(_xlfn._xlws.FILTER(Customers[Names],ISNUMBER(SEARCH(Customers[[#This Row],[Search Criteria]],Customers[Names])),\"No data.\"))))","v":"Adriana Todd"},"Albert Ramirez","Alex Rubio","Amanda Beck","Amparo Orozco","Amy Todd","Angelina Roberson","April Fox","Arden Ayala","Arnoldo Pennington","Aubrey Giles","Bette Rivers","Brianna Alexander","Brianna Mora","Britt Vazquez","Broderick Gillespie","Brooke Roman","Calvin Buck","Carmela Mullins","Carol Stevenson","Carolina Russell","Carolyn Roberts","Chelsea Gilbert","Cheryl Williamson","Christa Frederick","Christian Armstrong","Christopher Stuart","Chung Krueger","Clare Whitney","Clarissa Archer","Claudio Lam","Cordell Mills","Craig Shepherd","Damien Kramer","Dane Burke","Danielle Stout","Darrel Liu","Darrin Mcneil","Darron Aguilar","Della Huber","Delores Krause","Dena Rosario","Dominick Johnston","Dona Herring","Dorothy Winters","Douglas Wiley","Doyle David","Earlene Hester","Earline Shepherd","Edwin Sparks","Eli Galvan","Elinor Kaufman","Elroy Porter","Elvin Flynn","Emmitt Porter","Erik Parsons","Ethel Forbes","Felicia Ware","Fidel Haynes","Francisco Valenzuela","Frank Hunt","Gabriela Moore","Gabrielle Patrick","Gale Fitzpatrick","Gayle Curtis","Genevieve Lucero","Gerry Oneal","Grady Ellis","Grover Escobar","Hans Patel","Horacio Black","Humberto Compton","Hunter Short","Ilene Mcguire","Imelda Lloyd","Ira Macdonald","Issac Allen","Jacques Velazquez","Janis Mullins","Janna Cowan","Javier Garner","Jayson Abbott","Jeannie Tapia","Jefferson Lee","Jeramy Keith","Jermaine Bradshaw","Jewel Lee","Jimmie Yang","Jodie Wood","John Cline","Josefina Dickerson","Josie Pineda","Judith Griffin","Julius Soto","Kelli Romero","Kerri Joseph","Kim Mccall","Lakeisha Velazquez","Latonya Logan","Lee Schmidt","Lela Atkins","Leland Robertson","Leonardo House","Leroy Mcintyre","Lesley Blevins","Lilia Berg","Lilly Stone","Lincoln Bond","Lindsay Hurst","Lionel Fuller","Lorene Hunter","Louis Kidd","Lucius Warren","Lucy Mejia","Lupe Ingram","Lynette Fuller","Lynnette Wright","Madge Copeland","Madge Tanner","Mae Sawyer","Malcolm Newman","Mamie Wong","Mandy Swanson","Marcella Everett","Marco Bright","Marcos Schaefer","Marcus Hays","Marina Walsh","Marion Savage","Marylou Bass","Marylou Mccarthy","Mathew Howard","Maurice Jacobson","Mauricio Bautista","Max Smith","Melanie Bridges","Melissa Brandt","Merlin Wu","Michel Simpson","Mickey Kennedy","Mike Sloan","Milton Walsh","Mohamed Allison","Mohammad Christensen","Nadia Macdonald","Naomi Snyder","Ned Lowe","Nettie Leonard","Olive Perkins","Ophelia Morrow","Oren Montes","Orlando Henderson","Owen Buchanan","Paul Norman","Rafael Barrett","Raymond Cochran","Reed Hooper","Reinaldo Houston","Renato Simmons","Rene Calhoun","Reva Hardin","Robert French","Robin Bender","Rodolfo Scott","Roland Blake","Roland Sullivan","Rolf Barnett","Ross Marquez","Ruthie Daugherty","Sandra Potts","Scott Stephenson","Scotty Gonzales","Sean Wiggins","Shana Gallagher","Sharron Montes","Sheryl Lindsey","Socorro Hayden","Solomon Andrade","Stacey Whitehead","Stevie Hale","Stuart Oliver","Stuart Riddle","Tammy Merritt","Theo Wiley","Theresa Murillo","Timothy Roberts","Tony Torres","Tracy Logan","Troy Hoover","Twila Rubio","Velma Everett","Vincent Mccormick","Vincenzo Stafford","Vito Clark","Waldo Spencer","Werner Lowe","Werner Shepard","Wesley Ford","Wm Cantu","Zelma Pierce"]
[null,null,null,null,null,"Mickey Kennedy",{"$f":"IF('Resulting List'!F132=\"\",\"\",'Resulting List'!F132)","v":""},null,{"$f":"TRANSPOSE(_xlfn._xlws.SORT(_xlfn.UNIQUE(_xlfn._xlws.FILTER(Customers[Names],ISNUMBER(SEARCH(Customers[[#This Row],[Search Criteria]],Customers[Names])),\"No data.\"))))","v":"Adriana Todd"},"Albert Ramirez","Alex Rubio","Amanda Beck","Amparo Orozco","Amy Todd","Angelina Roberson","April Fox","Arden Ayala","Arnoldo Pennington","Aubrey Giles","Bette Rivers","Brianna Alexander","Brianna Mora","Britt Vazquez","Broderick Gillespie","Brooke Roman","Calvin Buck","Carmela Mullins","Carol Stevenson","Carolina Russell","Carolyn Roberts","Chelsea Gilbert","Cheryl Williamson","Christa Frederick","Christian Armstrong","Christopher Stuart","Chung Krueger","Clare Whitney","Clarissa Archer","Claudio Lam","Cordell Mills","Craig Shepherd","Damien Kramer","Dane Burke","Danielle Stout","Darrel Liu","Darrin Mcneil","Darron Aguilar","Della Huber","Delores Krause","Dena Rosario","Dominick Johnston","Dona Herring","Dorothy Winters","Douglas Wiley","Doyle David","Earlene Hester","Earline Shepherd","Edwin Sparks","Eli Galvan","Elinor Kaufman","Elroy Porter","Elvin Flynn","Emmitt Porter","Erik Parsons","Ethel Forbes","Felicia Ware","Fidel Haynes","Francisco Valenzuela","Frank Hunt","Gabriela Moore","Gabrielle Patrick","Gale Fitzpatrick","Gayle Curtis","Genevieve Lucero","Gerry Oneal","Grady Ellis","Grover Escobar","Hans Patel","Horacio Black","Humberto Compton","Hunter Short","Ilene Mcguire","Imelda Lloyd","Ira Macdonald","Issac Allen","Jacques Velazquez","Janis Mullins","Janna Cowan","Javier Garner","Jayson Abbott","Jeannie Tapia","Jefferson Lee","Jeramy Keith","Jermaine Bradshaw","Jewel Lee","Jimmie Yang","Jodie Wood","John Cline","Josefina Dickerson","Josie Pineda","Judith Griffin","Julius Soto","Kelli Romero","Kerri Joseph","Kim Mccall","Lakeisha Velazquez","Latonya Logan","Lee Schmidt","Lela Atkins","Leland Robertson","Leonardo House","Leroy Mcintyre","Lesley Blevins","Lilia Berg","Lilly Stone","Lincoln Bond","Lindsay Hurst","Lionel Fuller","Lorene Hunter","Louis Kidd","Lucius Warren","Lucy Mejia","Lupe Ingram","Lynette Fuller","Lynnette Wright","Madge Copeland","Madge Tanner","Mae Sawyer","Malcolm Newman","Mamie Wong","Mandy Swanson","Marcella Everett","Marco Bright","Marcos Schaefer","Marcus Hays","Marina Walsh","Marion Savage","Marylou Bass","Marylou Mccarthy","Mathew Howard","Maurice Jacobson","Mauricio Bautista","Max Smith","Melanie Bridges","Melissa Brandt","Merlin Wu","Michel Simpson","Mickey Kennedy","Mike Sloan","Milton Walsh","Mohamed Allison","Mohammad Christensen","Nadia Macdonald","Naomi Snyder","Ned Lowe","Nettie Leonard","Olive Perkins","Ophelia Morrow","Oren Montes","Orlando Henderson","Owen Buchanan","Paul Norman","Rafael Barrett","Raymond Cochran","Reed Hooper","Reinaldo Houston","Renato Simmons","Rene Calhoun","Reva Hardin","Robert French","Robin Bender","Rodolfo Scott","Roland Blake","Roland Sullivan","Rolf Barnett","Ross Marquez","Ruthie Daugherty","Sandra Potts","Scott Stephenson","Scotty Gonzales","Sean Wiggins","Shana Gallagher","Sharron Montes","Sheryl Lindsey","Socorro Hayden","Solomon Andrade","Stacey Whitehead","Stevie Hale","Stuart Oliver","Stuart Riddle","Tammy Merritt","Theo Wiley","Theresa Murillo","Timothy Roberts","Tony Torres","Tracy Logan","Troy Hoover","Twila Rubio","Velma Everett","Vincent Mccormick","Vincenzo Stafford","Vito Clark","Waldo Spencer","Werner Lowe","Werner Shepard","Wesley Ford","Wm Cantu","Zelma Pierce"]
[null,null,null,null,null,"Vito Clark",{"$f":"IF('Resulting List'!F133=\"\",\"\",'Resulting List'!F133)","v":""},null,{"$f":"TRANSPOSE(_xlfn._xlws.SORT(_xlfn.UNIQUE(_xlfn._xlws.FILTER(Customers[Names],ISNUMBER(SEARCH(Customers[[#This Row],[Search Criteria]],Customers[Names])),\"No data.\"))))","v":"Adriana Todd"},"Albert Ramirez","Alex Rubio","Amanda Beck","Amparo Orozco","Amy Todd","Angelina Roberson","April Fox","Arden Ayala","Arnoldo Pennington","Aubrey Giles","Bette Rivers","Brianna Alexander","Brianna Mora","Britt Vazquez","Broderick Gillespie","Brooke Roman","Calvin Buck","Carmela Mullins","Carol Stevenson","Carolina Russell","Carolyn Roberts","Chelsea Gilbert","Cheryl Williamson","Christa Frederick","Christian Armstrong","Christopher Stuart","Chung Krueger","Clare Whitney","Clarissa Archer","Claudio Lam","Cordell Mills","Craig Shepherd","Damien Kramer","Dane Burke","Danielle Stout","Darrel Liu","Darrin Mcneil","Darron Aguilar","Della Huber","Delores Krause","Dena Rosario","Dominick Johnston","Dona Herring","Dorothy Winters","Douglas Wiley","Doyle David","Earlene Hester","Earline Shepherd","Edwin Sparks","Eli Galvan","Elinor Kaufman","Elroy Porter","Elvin Flynn","Emmitt Porter","Erik Parsons","Ethel Forbes","Felicia Ware","Fidel Haynes","Francisco Valenzuela","Frank Hunt","Gabriela Moore","Gabrielle Patrick","Gale Fitzpatrick","Gayle Curtis","Genevieve Lucero","Gerry Oneal","Grady Ellis","Grover Escobar","Hans Patel","Horacio Black","Humberto Compton","Hunter Short","Ilene Mcguire","Imelda Lloyd","Ira Macdonald","Issac Allen","Jacques Velazquez","Janis Mullins","Janna Cowan","Javier Garner","Jayson Abbott","Jeannie Tapia","Jefferson Lee","Jeramy Keith","Jermaine Bradshaw","Jewel Lee","Jimmie Yang","Jodie Wood","John Cline","Josefina Dickerson","Josie Pineda","Judith Griffin","Julius Soto","Kelli Romero","Kerri Joseph","Kim Mccall","Lakeisha Velazquez","Latonya Logan","Lee Schmidt","Lela Atkins","Leland Robertson","Leonardo House","Leroy Mcintyre","Lesley Blevins","Lilia Berg","Lilly Stone","Lincoln Bond","Lindsay Hurst","Lionel Fuller","Lorene Hunter","Louis Kidd","Lucius Warren","Lucy Mejia","Lupe Ingram","Lynette Fuller","Lynnette Wright","Madge Copeland","Madge Tanner","Mae Sawyer","Malcolm Newman","Mamie Wong","Mandy Swanson","Marcella Everett","Marco Bright","Marcos Schaefer","Marcus Hays","Marina Walsh","Marion Savage","Marylou Bass","Marylou Mccarthy","Mathew Howard","Maurice Jacobson","Mauricio Bautista","Max Smith","Melanie Bridges","Melissa Brandt","Merlin Wu","Michel Simpson","Mickey Kennedy","Mike Sloan","Milton Walsh","Mohamed Allison","Mohammad Christensen","Nadia Macdonald","Naomi Snyder","Ned Lowe","Nettie Leonard","Olive Perkins","Ophelia Morrow","Oren Montes","Orlando Henderson","Owen Buchanan","Paul Norman","Rafael Barrett","Raymond Cochran","Reed Hooper","Reinaldo Houston","Renato Simmons","Rene Calhoun","Reva Hardin","Robert French","Robin Bender","Rodolfo Scott","Roland Blake","Roland Sullivan","Rolf Barnett","Ross Marquez","Ruthie Daugherty","Sandra Potts","Scott Stephenson","Scotty Gonzales","Sean Wiggins","Shana Gallagher","Sharron Montes","Sheryl Lindsey","Socorro Hayden","Solomon Andrade","Stacey Whitehead","Stevie Hale","Stuart Oliver","Stuart Riddle","Tammy Merritt","Theo Wiley","Theresa Murillo","Timothy Roberts","Tony Torres","Tracy Logan","Troy Hoover","Twila Rubio","Velma Everett","Vincent Mccormick","Vincenzo Stafford","Vito Clark","Waldo Spencer","Werner Lowe","Werner Shepard","Wesley Ford","Wm Cantu","Zelma Pierce"]
[null,null,null,null,null,"Issac Allen",{"$f":"IF('Resulting List'!F134=\"\",\"\",'Resulting List'!F134)","v":""},null,{"$f":"TRANSPOSE(_xlfn._xlws.SORT(_xlfn.UNIQUE(_xlfn._xlws.FILTER(Customers[Names],ISNUMBER(SEARCH(Customers[[#This Row],[Search Criteria]],Customers[Names])),\"No data.\"))))","v":"Adriana Todd"},"Albert Ramirez","Alex Rubio","Amanda Beck","Amparo Orozco","Amy Todd","Angelina Roberson","April Fox","Arden Ayala","Arnoldo Pennington","Aubrey Giles","Bette Rivers","Brianna Alexander","Brianna Mora","Britt Vazquez","Broderick Gillespie","Brooke Roman","Calvin Buck","Carmela Mullins","Carol Stevenson","Carolina Russell","Carolyn Roberts","Chelsea Gilbert","Cheryl Williamson","Christa Frederick","Christian Armstrong","Christopher Stuart","Chung Krueger","Clare Whitney","Clarissa Archer","Claudio Lam","Cordell Mills","Craig Shepherd","Damien Kramer","Dane Burke","Danielle Stout","Darrel Liu","Darrin Mcneil","Darron Aguilar","Della Huber","Delores Krause","Dena Rosario","Dominick Johnston","Dona Herring","Dorothy Winters","Douglas Wiley","Doyle David","Earlene Hester","Earline Shepherd","Edwin Sparks","Eli Galvan","Elinor Kaufman","Elroy Porter","Elvin Flynn","Emmitt Porter","Erik Parsons","Ethel Forbes","Felicia Ware","Fidel Haynes","Francisco Valenzuela","Frank Hunt","Gabriela Moore","Gabrielle Patrick","Gale Fitzpatrick","Gayle Curtis","Genevieve Lucero","Gerry Oneal","Grady Ellis","Grover Escobar","Hans Patel","Horacio Black","Humberto Compton","Hunter Short","Ilene Mcguire","Imelda Lloyd","Ira Macdonald","Issac Allen","Jacques Velazquez","Janis Mullins","Janna Cowan","Javier Garner","Jayson Abbott","Jeannie Tapia","Jefferson Lee","Jeramy Keith","Jermaine Bradshaw","Jewel Lee","Jimmie Yang","Jodie Wood","John Cline","Josefina Dickerson","Josie Pineda","Judith Griffin","Julius Soto","Kelli Romero","Kerri Joseph","Kim Mccall","Lakeisha Velazquez","Latonya Logan","Lee Schmidt","Lela Atkins","Leland Robertson","Leonardo House","Leroy Mcintyre","Lesley Blevins","Lilia Berg","Lilly Stone","Lincoln Bond","Lindsay Hurst","Lionel Fuller","Lorene Hunter","Louis Kidd","Lucius Warren","Lucy Mejia","Lupe Ingram","Lynette Fuller","Lynnette Wright","Madge Copeland","Madge Tanner","Mae Sawyer","Malcolm Newman","Mamie Wong","Mandy Swanson","Marcella Everett","Marco Bright","Marcos Schaefer","Marcus Hays","Marina Walsh","Marion Savage","Marylou Bass","Marylou Mccarthy","Mathew Howard","Maurice Jacobson","Mauricio Bautista","Max Smith","Melanie Bridges","Melissa Brandt","Merlin Wu","Michel Simpson","Mickey Kennedy","Mike Sloan","Milton Walsh","Mohamed Allison","Mohammad Christensen","Nadia Macdonald","Naomi Snyder","Ned Lowe","Nettie Leonard","Olive Perkins","Ophelia Morrow","Oren Montes","Orlando Henderson","Owen Buchanan","Paul Norman","Rafael Barrett","Raymond Cochran","Reed Hooper","Reinaldo Houston","Renato Simmons","Rene Calhoun","Reva Hardin","Robert French","Robin Bender","Rodolfo Scott","Roland Blake","Roland Sullivan","Rolf Barnett","Ross Marquez","Ruthie Daugherty","Sandra Potts","Scott Stephenson","Scotty Gonzales","Sean Wiggins","Shana Gallagher","Sharron Montes","Sheryl Lindsey","Socorro Hayden","Solomon Andrade","Stacey Whitehead","Stevie Hale","Stuart Oliver","Stuart Riddle","Tammy Merritt","Theo Wiley","Theresa Murillo","Timothy Roberts","Tony Torres","Tracy Logan","Troy Hoover","Twila Rubio","Velma Everett","Vincent Mccormick","Vincenzo Stafford","Vito Clark","Waldo Spencer","Werner Lowe","Werner Shepard","Wesley Ford","Wm Cantu","Zelma Pierce"]
[null,null,null,null,null,"Lee Schmidt",{"$f":"IF('Resulting List'!F135=\"\",\"\",'Resulting List'!F135)","v":""},null,{"$f":"TRANSPOSE(_xlfn._xlws.SORT(_xlfn.UNIQUE(_xlfn._xlws.FILTER(Customers[Names],ISNUMBER(SEARCH(Customers[[#This Row],[Search Criteria]],Customers[Names])),\"No data.\"))))","v":"Adriana Todd"},"Albert Ramirez","Alex Rubio","Amanda Beck","Amparo Orozco","Amy Todd","Angelina Roberson","April Fox","Arden Ayala","Arnoldo Pennington","Aubrey Giles","Bette Rivers","Brianna Alexander","Brianna Mora","Britt Vazquez","Broderick Gillespie","Brooke Roman","Calvin Buck","Carmela Mullins","Carol Stevenson","Carolina Russell","Carolyn Roberts","Chelsea Gilbert","Cheryl Williamson","Christa Frederick","Christian Armstrong","Christopher Stuart","Chung Krueger","Clare Whitney","Clarissa Archer","Claudio Lam","Cordell Mills","Craig Shepherd","Damien Kramer","Dane Burke","Danielle Stout","Darrel Liu","Darrin Mcneil","Darron Aguilar","Della Huber","Delores Krause","Dena Rosario","Dominick Johnston","Dona Herring","Dorothy Winters","Douglas Wiley","Doyle David","Earlene Hester","Earline Shepherd","Edwin Sparks","Eli Galvan","Elinor Kaufman","Elroy Porter","Elvin Flynn","Emmitt Porter","Erik Parsons","Ethel Forbes","Felicia Ware","Fidel Haynes","Francisco Valenzuela","Frank Hunt","Gabriela Moore","Gabrielle Patrick","Gale Fitzpatrick","Gayle Curtis","Genevieve Lucero","Gerry Oneal","Grady Ellis","Grover Escobar","Hans Patel","Horacio Black","Humberto Compton","Hunter Short","Ilene Mcguire","Imelda Lloyd","Ira Macdonald","Issac Allen","Jacques Velazquez","Janis Mullins","Janna Cowan","Javier Garner","Jayson Abbott","Jeannie Tapia","Jefferson Lee","Jeramy Keith","Jermaine Bradshaw","Jewel Lee","Jimmie Yang","Jodie Wood","John Cline","Josefina Dickerson","Josie Pineda","Judith Griffin","Julius Soto","Kelli Romero","Kerri Joseph","Kim Mccall","Lakeisha Velazquez","Latonya Logan","Lee Schmidt","Lela Atkins","Leland Robertson","Leonardo House","Leroy Mcintyre","Lesley Blevins","Lilia Berg","Lilly Stone","Lincoln Bond","Lindsay Hurst","Lionel Fuller","Lorene Hunter","Louis Kidd","Lucius Warren","Lucy Mejia","Lupe Ingram","Lynette Fuller","Lynnette Wright","Madge Copeland","Madge Tanner","Mae Sawyer","Malcolm Newman","Mamie Wong","Mandy Swanson","Marcella Everett","Marco Bright","Marcos Schaefer","Marcus Hays","Marina Walsh","Marion Savage","Marylou Bass","Marylou Mccarthy","Mathew Howard","Maurice Jacobson","Mauricio Bautista","Max Smith","Melanie Bridges","Melissa Brandt","Merlin Wu","Michel Simpson","Mickey Kennedy","Mike Sloan","Milton Walsh","Mohamed Allison","Mohammad Christensen","Nadia Macdonald","Naomi Snyder","Ned Lowe","Nettie Leonard","Olive Perkins","Ophelia Morrow","Oren Montes","Orlando Henderson","Owen Buchanan","Paul Norman","Rafael Barrett","Raymond Cochran","Reed Hooper","Reinaldo Houston","Renato Simmons","Rene Calhoun","Reva Hardin","Robert French","Robin Bender","Rodolfo Scott","Roland Blake","Roland Sullivan","Rolf Barnett","Ross Marquez","Ruthie Daugherty","Sandra Potts","Scott Stephenson","Scotty Gonzales","Sean Wiggins","Shana Gallagher","Sharron Montes","Sheryl Lindsey","Socorro Hayden","Solomon Andrade","Stacey Whitehead","Stevie Hale","Stuart Oliver","Stuart Riddle","Tammy Merritt","Theo Wiley","Theresa Murillo","Timothy Roberts","Tony Torres","Tracy Logan","Troy Hoover","Twila Rubio","Velma Everett","Vincent Mccormick","Vincenzo Stafford","Vito Clark","Waldo Spencer","Werner Lowe","Werner Shepard","Wesley Ford","Wm Cantu","Zelma Pierce"]
[null,null,null,null,null,"Lorene Hunter",{"$f":"IF('Resulting List'!F136=\"\",\"\",'Resulting List'!F136)","v":""},null,{"$f":"TRANSPOSE(_xlfn._xlws.SORT(_xlfn.UNIQUE(_xlfn._xlws.FILTER(Customers[Names],ISNUMBER(SEARCH(Customers[[#This Row],[Search Criteria]],Customers[Names])),\"No data.\"))))","v":"Adriana Todd"},"Albert Ramirez","Alex Rubio","Amanda Beck","Amparo Orozco","Amy Todd","Angelina Roberson","April Fox","Arden Ayala","Arnoldo Pennington","Aubrey Giles","Bette Rivers","Brianna Alexander","Brianna Mora","Britt Vazquez","Broderick Gillespie","Brooke Roman","Calvin Buck","Carmela Mullins","Carol Stevenson","Carolina Russell","Carolyn Roberts","Chelsea Gilbert","Cheryl Williamson","Christa Frederick","Christian Armstrong","Christopher Stuart","Chung Krueger","Clare Whitney","Clarissa Archer","Claudio Lam","Cordell Mills","Craig Shepherd","Damien Kramer","Dane Burke","Danielle Stout","Darrel Liu","Darrin Mcneil","Darron Aguilar","Della Huber","Delores Krause","Dena Rosario","Dominick Johnston","Dona Herring","Dorothy Winters","Douglas Wiley","Doyle David","Earlene Hester","Earline Shepherd","Edwin Sparks","Eli Galvan","Elinor Kaufman","Elroy Porter","Elvin Flynn","Emmitt Porter","Erik Parsons","Ethel Forbes","Felicia Ware","Fidel Haynes","Francisco Valenzuela","Frank Hunt","Gabriela Moore","Gabrielle Patrick","Gale Fitzpatrick","Gayle Curtis","Genevieve Lucero","Gerry Oneal","Grady Ellis","Grover Escobar","Hans Patel","Horacio Black","Humberto Compton","Hunter Short","Ilene Mcguire","Imelda Lloyd","Ira Macdonald","Issac Allen","Jacques Velazquez","Janis Mullins","Janna Cowan","Javier Garner","Jayson Abbott","Jeannie Tapia","Jefferson Lee","Jeramy Keith","Jermaine Bradshaw","Jewel Lee","Jimmie Yang","Jodie Wood","John Cline","Josefina Dickerson","Josie Pineda","Judith Griffin","Julius Soto","Kelli Romero","Kerri Joseph","Kim Mccall","Lakeisha Velazquez","Latonya Logan","Lee Schmidt","Lela Atkins","Leland Robertson","Leonardo House","Leroy Mcintyre","Lesley Blevins","Lilia Berg","Lilly Stone","Lincoln Bond","Lindsay Hurst","Lionel Fuller","Lorene Hunter","Louis Kidd","Lucius Warren","Lucy Mejia","Lupe Ingram","Lynette Fuller","Lynnette Wright","Madge Copeland","Madge Tanner","Mae Sawyer","Malcolm Newman","Mamie Wong","Mandy Swanson","Marcella Everett","Marco Bright","Marcos Schaefer","Marcus Hays","Marina Walsh","Marion Savage","Marylou Bass","Marylou Mccarthy","Mathew Howard","Maurice Jacobson","Mauricio Bautista","Max Smith","Melanie Bridges","Melissa Brandt","Merlin Wu","Michel Simpson","Mickey Kennedy","Mike Sloan","Milton Walsh","Mohamed Allison","Mohammad Christensen","Nadia Macdonald","Naomi Snyder","Ned Lowe","Nettie Leonard","Olive Perkins","Ophelia Morrow","Oren Montes","Orlando Henderson","Owen Buchanan","Paul Norman","Rafael Barrett","Raymond Cochran","Reed Hooper","Reinaldo Houston","Renato Simmons","Rene Calhoun","Reva Hardin","Robert French","Robin Bender","Rodolfo Scott","Roland Blake","Roland Sullivan","Rolf Barnett","Ross Marquez","Ruthie Daugherty","Sandra Potts","Scott Stephenson","Scotty Gonzales","Sean Wiggins","Shana Gallagher","Sharron Montes","Sheryl Lindsey","Socorro Hayden","Solomon Andrade","Stacey Whitehead","Stevie Hale","Stuart Oliver","Stuart Riddle","Tammy Merritt","Theo Wiley","Theresa Murillo","Timothy Roberts","Tony Torres","Tracy Logan","Troy Hoover","Twila Rubio","Velma Everett","Vincent Mccormick","Vincenzo Stafford","Vito Clark","Waldo Spencer","Werner Lowe","Werner Shepard","Wesley Ford","Wm Cantu","Zelma Pierce"]
[null,null,null,null,null,"Wesley Ford",{"$f":"IF('Resulting List'!F137=\"\",\"\",'Resulting List'!F137)","v":""},null,{"$f":"TRANSPOSE(_xlfn._xlws.SORT(_xlfn.UNIQUE(_xlfn._xlws.FILTER(Customers[Names],ISNUMBER(SEARCH(Customers[[#This Row],[Search Criteria]],Customers[Names])),\"No data.\"))))","v":"Adriana Todd"},"Albert Ramirez","Alex Rubio","Amanda Beck","Amparo Orozco","Amy Todd","Angelina Roberson","April Fox","Arden Ayala","Arnoldo Pennington","Aubrey Giles","Bette Rivers","Brianna Alexander","Brianna Mora","Britt Vazquez","Broderick Gillespie","Brooke Roman","Calvin Buck","Carmela Mullins","Carol Stevenson","Carolina Russell","Carolyn Roberts","Chelsea Gilbert","Cheryl Williamson","Christa Frederick","Christian Armstrong","Christopher Stuart","Chung Krueger","Clare Whitney","Clarissa Archer","Claudio Lam","Cordell Mills","Craig Shepherd","Damien Kramer","Dane Burke","Danielle Stout","Darrel Liu","Darrin Mcneil","Darron Aguilar","Della Huber","Delores Krause","Dena Rosario","Dominick Johnston","Dona Herring","Dorothy Winters","Douglas Wiley","Doyle David","Earlene Hester","Earline Shepherd","Edwin Sparks","Eli Galvan","Elinor Kaufman","Elroy Porter","Elvin Flynn","Emmitt Porter","Erik Parsons","Ethel Forbes","Felicia Ware","Fidel Haynes","Francisco Valenzuela","Frank Hunt","Gabriela Moore","Gabrielle Patrick","Gale Fitzpatrick","Gayle Curtis","Genevieve Lucero","Gerry Oneal","Grady Ellis","Grover Escobar","Hans Patel","Horacio Black","Humberto Compton","Hunter Short","Ilene Mcguire","Imelda Lloyd","Ira Macdonald","Issac Allen","Jacques Velazquez","Janis Mullins","Janna Cowan","Javier Garner","Jayson Abbott","Jeannie Tapia","Jefferson Lee","Jeramy Keith","Jermaine Bradshaw","Jewel Lee","Jimmie Yang","Jodie Wood","John Cline","Josefina Dickerson","Josie Pineda","Judith Griffin","Julius Soto","Kelli Romero","Kerri Joseph","Kim Mccall","Lakeisha Velazquez","Latonya Logan","Lee Schmidt","Lela Atkins","Leland Robertson","Leonardo House","Leroy Mcintyre","Lesley Blevins","Lilia Berg","Lilly Stone","Lincoln Bond","Lindsay Hurst","Lionel Fuller","Lorene Hunter","Louis Kidd","Lucius Warren","Lucy Mejia","Lupe Ingram","Lynette Fuller","Lynnette Wright","Madge Copeland","Madge Tanner","Mae Sawyer","Malcolm Newman","Mamie Wong","Mandy Swanson","Marcella Everett","Marco Bright","Marcos Schaefer","Marcus Hays","Marina Walsh","Marion Savage","Marylou Bass","Marylou Mccarthy","Mathew Howard","Maurice Jacobson","Mauricio Bautista","Max Smith","Melanie Bridges","Melissa Brandt","Merlin Wu","Michel Simpson","Mickey Kennedy","Mike Sloan","Milton Walsh","Mohamed Allison","Mohammad Christensen","Nadia Macdonald","Naomi Snyder","Ned Lowe","Nettie Leonard","Olive Perkins","Ophelia Morrow","Oren Montes","Orlando Henderson","Owen Buchanan","Paul Norman","Rafael Barrett","Raymond Cochran","Reed Hooper","Reinaldo Houston","Renato Simmons","Rene Calhoun","Reva Hardin","Robert French","Robin Bender","Rodolfo Scott","Roland Blake","Roland Sullivan","Rolf Barnett","Ross Marquez","Ruthie Daugherty","Sandra Potts","Scott Stephenson","Scotty Gonzales","Sean Wiggins","Shana Gallagher","Sharron Montes","Sheryl Lindsey","Socorro Hayden","Solomon Andrade","Stacey Whitehead","Stevie Hale","Stuart Oliver","Stuart Riddle","Tammy Merritt","Theo Wiley","Theresa Murillo","Timothy Roberts","Tony Torres","Tracy Logan","Troy Hoover","Twila Rubio","Velma Everett","Vincent Mccormick","Vincenzo Stafford","Vito Clark","Waldo Spencer","Werner Lowe","Werner Shepard","Wesley Ford","Wm Cantu","Zelma Pierce"]
[null,null,null,null,null,"Troy Hoover",{"$f":"IF('Resulting List'!F138=\"\",\"\",'Resulting List'!F138)","v":""},null,{"$f":"TRANSPOSE(_xlfn._xlws.SORT(_xlfn.UNIQUE(_xlfn._xlws.FILTER(Customers[Names],ISNUMBER(SEARCH(Customers[[#This Row],[Search Criteria]],Customers[Names])),\"No data.\"))))","v":"Adriana Todd"},"Albert Ramirez","Alex Rubio","Amanda Beck","Amparo Orozco","Amy Todd","Angelina Roberson","April Fox","Arden Ayala","Arnoldo Pennington","Aubrey Giles","Bette Rivers","Brianna Alexander","Brianna Mora","Britt Vazquez","Broderick Gillespie","Brooke Roman","Calvin Buck","Carmela Mullins","Carol Stevenson","Carolina Russell","Carolyn Roberts","Chelsea Gilbert","Cheryl Williamson","Christa Frederick","Christian Armstrong","Christopher Stuart","Chung Krueger","Clare Whitney","Clarissa Archer","Claudio Lam","Cordell Mills","Craig Shepherd","Damien Kramer","Dane Burke","Danielle Stout","Darrel Liu","Darrin Mcneil","Darron Aguilar","Della Huber","Delores Krause","Dena Rosario","Dominick Johnston","Dona Herring","Dorothy Winters","Douglas Wiley","Doyle David","Earlene Hester","Earline Shepherd","Edwin Sparks","Eli Galvan","Elinor Kaufman","Elroy Porter","Elvin Flynn","Emmitt Porter","Erik Parsons","Ethel Forbes","Felicia Ware","Fidel Haynes","Francisco Valenzuela","Frank Hunt","Gabriela Moore","Gabrielle Patrick","Gale Fitzpatrick","Gayle Curtis","Genevieve Lucero","Gerry Oneal","Grady Ellis","Grover Escobar","Hans Patel","Horacio Black","Humberto Compton","Hunter Short","Ilene Mcguire","Imelda Lloyd","Ira Macdonald","Issac Allen","Jacques Velazquez","Janis Mullins","Janna Cowan","Javier Garner","Jayson Abbott","Jeannie Tapia","Jefferson Lee","Jeramy Keith","Jermaine Bradshaw","Jewel Lee","Jimmie Yang","Jodie Wood","John Cline","Josefina Dickerson","Josie Pineda","Judith Griffin","Julius Soto","Kelli Romero","Kerri Joseph","Kim Mccall","Lakeisha Velazquez","Latonya Logan","Lee Schmidt","Lela Atkins","Leland Robertson","Leonardo House","Leroy Mcintyre","Lesley Blevins","Lilia Berg","Lilly Stone","Lincoln Bond","Lindsay Hurst","Lionel Fuller","Lorene Hunter","Louis Kidd","Lucius Warren","Lucy Mejia","Lupe Ingram","Lynette Fuller","Lynnette Wright","Madge Copeland","Madge Tanner","Mae Sawyer","Malcolm Newman","Mamie Wong","Mandy Swanson","Marcella Everett","Marco Bright","Marcos Schaefer","Marcus Hays","Marina Walsh","Marion Savage","Marylou Bass","Marylou Mccarthy","Mathew Howard","Maurice Jacobson","Mauricio Bautista","Max Smith","Melanie Bridges","Melissa Brandt","Merlin Wu","Michel Simpson","Mickey Kennedy","Mike Sloan","Milton Walsh","Mohamed Allison","Mohammad Christensen","Nadia Macdonald","Naomi Snyder","Ned Lowe","Nettie Leonard","Olive Perkins","Ophelia Morrow","Oren Montes","Orlando Henderson","Owen Buchanan","Paul Norman","Rafael Barrett","Raymond Cochran","Reed Hooper","Reinaldo Houston","Renato Simmons","Rene Calhoun","Reva Hardin","Robert French","Robin Bender","Rodolfo Scott","Roland Blake","Roland Sullivan","Rolf Barnett","Ross Marquez","Ruthie Daugherty","Sandra Potts","Scott Stephenson","Scotty Gonzales","Sean Wiggins","Shana Gallagher","Sharron Montes","Sheryl Lindsey","Socorro Hayden","Solomon Andrade","Stacey Whitehead","Stevie Hale","Stuart Oliver","Stuart Riddle","Tammy Merritt","Theo Wiley","Theresa Murillo","Timothy Roberts","Tony Torres","Tracy Logan","Troy Hoover","Twila Rubio","Velma Everett","Vincent Mccormick","Vincenzo Stafford","Vito Clark","Waldo Spencer","Werner Lowe","Werner Shepard","Wesley Ford","Wm Cantu","Zelma Pierce"]
[null,null,null,null,null,"Maurice Jacobson",{"$f":"IF('Resulting List'!F139=\"\",\"\",'Resulting List'!F139)","v":""},null,{"$f":"TRANSPOSE(_xlfn._xlws.SORT(_xlfn.UNIQUE(_xlfn._xlws.FILTER(Customers[Names],ISNUMBER(SEARCH(Customers[[#This Row],[Search Criteria]],Customers[Names])),\"No data.\"))))","v":"Adriana Todd"},"Albert Ramirez","Alex Rubio","Amanda Beck","Amparo Orozco","Amy Todd","Angelina Roberson","April Fox","Arden Ayala","Arnoldo Pennington","Aubrey Giles","Bette Rivers","Brianna Alexander","Brianna Mora","Britt Vazquez","Broderick Gillespie","Brooke Roman","Calvin Buck","Carmela Mullins","Carol Stevenson","Carolina Russell","Carolyn Roberts","Chelsea Gilbert","Cheryl Williamson","Christa Frederick","Christian Armstrong","Christopher Stuart","Chung Krueger","Clare Whitney","Clarissa Archer","Claudio Lam","Cordell Mills","Craig Shepherd","Damien Kramer","Dane Burke","Danielle Stout","Darrel Liu","Darrin Mcneil","Darron Aguilar","Della Huber","Delores Krause","Dena Rosario","Dominick Johnston","Dona Herring","Dorothy Winters","Douglas Wiley","Doyle David","Earlene Hester","Earline Shepherd","Edwin Sparks","Eli Galvan","Elinor Kaufman","Elroy Porter","Elvin Flynn","Emmitt Porter","Erik Parsons","Ethel Forbes","Felicia Ware","Fidel Haynes","Francisco Valenzuela","Frank Hunt","Gabriela Moore","Gabrielle Patrick","Gale Fitzpatrick","Gayle Curtis","Genevieve Lucero","Gerry Oneal","Grady Ellis","Grover Escobar","Hans Patel","Horacio Black","Humberto Compton","Hunter Short","Ilene Mcguire","Imelda Lloyd","Ira Macdonald","Issac Allen","Jacques Velazquez","Janis Mullins","Janna Cowan","Javier Garner","Jayson Abbott","Jeannie Tapia","Jefferson Lee","Jeramy Keith","Jermaine Bradshaw","Jewel Lee","Jimmie Yang","Jodie Wood","John Cline","Josefina Dickerson","Josie Pineda","Judith Griffin","Julius Soto","Kelli Romero","Kerri Joseph","Kim Mccall","Lakeisha Velazquez","Latonya Logan","Lee Schmidt","Lela Atkins","Leland Robertson","Leonardo House","Leroy Mcintyre","Lesley Blevins","Lilia Berg","Lilly Stone","Lincoln Bond","Lindsay Hurst","Lionel Fuller","Lorene Hunter","Louis Kidd","Lucius Warren","Lucy Mejia","Lupe Ingram","Lynette Fuller","Lynnette Wright","Madge Copeland","Madge Tanner","Mae Sawyer","Malcolm Newman","Mamie Wong","Mandy Swanson","Marcella Everett","Marco Bright","Marcos Schaefer","Marcus Hays","Marina Walsh","Marion Savage","Marylou Bass","Marylou Mccarthy","Mathew Howard","Maurice Jacobson","Mauricio Bautista","Max Smith","Melanie Bridges","Melissa Brandt","Merlin Wu","Michel Simpson","Mickey Kennedy","Mike Sloan","Milton Walsh","Mohamed Allison","Mohammad Christensen","Nadia Macdonald","Naomi Snyder","Ned Lowe","Nettie Leonard","Olive Perkins","Ophelia Morrow","Oren Montes","Orlando Henderson","Owen Buchanan","Paul Norman","Rafael Barrett","Raymond Cochran","Reed Hooper","Reinaldo Houston","Renato Simmons","Rene Calhoun","Reva Hardin","Robert French","Robin Bender","Rodolfo Scott","Roland Blake","Roland Sullivan","Rolf Barnett","Ross Marquez","Ruthie Daugherty","Sandra Potts","Scott Stephenson","Scotty Gonzales","Sean Wiggins","Shana Gallagher","Sharron Montes","Sheryl Lindsey","Socorro Hayden","Solomon Andrade","Stacey Whitehead","Stevie Hale","Stuart Oliver","Stuart Riddle","Tammy Merritt","Theo Wiley","Theresa Murillo","Timothy Roberts","Tony Torres","Tracy Logan","Troy Hoover","Twila Rubio","Velma Everett","Vincent Mccormick","Vincenzo Stafford","Vito Clark","Waldo Spencer","Werner Lowe","Werner Shepard","Wesley Ford","Wm Cantu","Zelma Pierce"]
[null,null,null,null,null,"Tony Torres",{"$f":"IF('Resulting List'!F140=\"\",\"\",'Resulting List'!F140)","v":""},null,{"$f":"TRANSPOSE(_xlfn._xlws.SORT(_xlfn.UNIQUE(_xlfn._xlws.FILTER(Customers[Names],ISNUMBER(SEARCH(Customers[[#This Row],[Search Criteria]],Customers[Names])),\"No data.\"))))","v":"Adriana Todd"},"Albert Ramirez","Alex Rubio","Amanda Beck","Amparo Orozco","Amy Todd","Angelina Roberson","April Fox","Arden Ayala","Arnoldo Pennington","Aubrey Giles","Bette Rivers","Brianna Alexander","Brianna Mora","Britt Vazquez","Broderick Gillespie","Brooke Roman","Calvin Buck","Carmela Mullins","Carol Stevenson","Carolina Russell","Carolyn Roberts","Chelsea Gilbert","Cheryl Williamson","Christa Frederick","Christian Armstrong","Christopher Stuart","Chung Krueger","Clare Whitney","Clarissa Archer","Claudio Lam","Cordell Mills","Craig Shepherd","Damien Kramer","Dane Burke","Danielle Stout","Darrel Liu","Darrin Mcneil","Darron Aguilar","Della Huber","Delores Krause","Dena Rosario","Dominick Johnston","Dona Herring","Dorothy Winters","Douglas Wiley","Doyle David","Earlene Hester","Earline Shepherd","Edwin Sparks","Eli Galvan","Elinor Kaufman","Elroy Porter","Elvin Flynn","Emmitt Porter","Erik Parsons","Ethel Forbes","Felicia Ware","Fidel Haynes","Francisco Valenzuela","Frank Hunt","Gabriela Moore","Gabrielle Patrick","Gale Fitzpatrick","Gayle Curtis","Genevieve Lucero","Gerry Oneal","Grady Ellis","Grover Escobar","Hans Patel","Horacio Black","Humberto Compton","Hunter Short","Ilene Mcguire","Imelda Lloyd","Ira Macdonald","Issac Allen","Jacques Velazquez","Janis Mullins","Janna Cowan","Javier Garner","Jayson Abbott","Jeannie Tapia","Jefferson Lee","Jeramy Keith","Jermaine Bradshaw","Jewel Lee","Jimmie Yang","Jodie Wood","John Cline","Josefina Dickerson","Josie Pineda","Judith Griffin","Julius Soto","Kelli Romero","Kerri Joseph","Kim Mccall","Lakeisha Velazquez","Latonya Logan","Lee Schmidt","Lela Atkins","Leland Robertson","Leonardo House","Leroy Mcintyre","Lesley Blevins","Lilia Berg","Lilly Stone","Lincoln Bond","Lindsay Hurst","Lionel Fuller","Lorene Hunter","Louis Kidd","Lucius Warren","Lucy Mejia","Lupe Ingram","Lynette Fuller","Lynnette Wright","Madge Copeland","Madge Tanner","Mae Sawyer","Malcolm Newman","Mamie Wong","Mandy Swanson","Marcella Everett","Marco Bright","Marcos Schaefer","Marcus Hays","Marina Walsh","Marion Savage","Marylou Bass","Marylou Mccarthy","Mathew Howard","Maurice Jacobson","Mauricio Bautista","Max Smith","Melanie Bridges","Melissa Brandt","Merlin Wu","Michel Simpson","Mickey Kennedy","Mike Sloan","Milton Walsh","Mohamed Allison","Mohammad Christensen","Nadia Macdonald","Naomi Snyder","Ned Lowe","Nettie Leonard","Olive Perkins","Ophelia Morrow","Oren Montes","Orlando Henderson","Owen Buchanan","Paul Norman","Rafael Barrett","Raymond Cochran","Reed Hooper","Reinaldo Houston","Renato Simmons","Rene Calhoun","Reva Hardin","Robert French","Robin Bender","Rodolfo Scott","Roland Blake","Roland Sullivan","Rolf Barnett","Ross Marquez","Ruthie Daugherty","Sandra Potts","Scott Stephenson","Scotty Gonzales","Sean Wiggins","Shana Gallagher","Sharron Montes","Sheryl Lindsey","Socorro Hayden","Solomon Andrade","Stacey Whitehead","Stevie Hale","Stuart Oliver","Stuart Riddle","Tammy Merritt","Theo Wiley","Theresa Murillo","Timothy Roberts","Tony Torres","Tracy Logan","Troy Hoover","Twila Rubio","Velma Everett","Vincent Mccormick","Vincenzo Stafford","Vito Clark","Waldo Spencer","Werner Lowe","Werner Shepard","Wesley Ford","Wm Cantu","Zelma Pierce"]
[null,null,null,null,null,"Genevieve Lucero",{"$f":"IF('Resulting List'!F141=\"\",\"\",'Resulting List'!F141)","v":""},null,{"$f":"TRANSPOSE(_xlfn._xlws.SORT(_xlfn.UNIQUE(_xlfn._xlws.FILTER(Customers[Names],ISNUMBER(SEARCH(Customers[[#This Row],[Search Criteria]],Customers[Names])),\"No data.\"))))","v":"Adriana Todd"},"Albert Ramirez","Alex Rubio","Amanda Beck","Amparo Orozco","Amy Todd","Angelina Roberson","April Fox","Arden Ayala","Arnoldo Pennington","Aubrey Giles","Bette Rivers","Brianna Alexander","Brianna Mora","Britt Vazquez","Broderick Gillespie","Brooke Roman","Calvin Buck","Carmela Mullins","Carol Stevenson","Carolina Russell","Carolyn Roberts","Chelsea Gilbert","Cheryl Williamson","Christa Frederick","Christian Armstrong","Christopher Stuart","Chung Krueger","Clare Whitney","Clarissa Archer","Claudio Lam","Cordell Mills","Craig Shepherd","Damien Kramer","Dane Burke","Danielle Stout","Darrel Liu","Darrin Mcneil","Darron Aguilar","Della Huber","Delores Krause","Dena Rosario","Dominick Johnston","Dona Herring","Dorothy Winters","Douglas Wiley","Doyle David","Earlene Hester","Earline Shepherd","Edwin Sparks","Eli Galvan","Elinor Kaufman","Elroy Porter","Elvin Flynn","Emmitt Porter","Erik Parsons","Ethel Forbes","Felicia Ware","Fidel Haynes","Francisco Valenzuela","Frank Hunt","Gabriela Moore","Gabrielle Patrick","Gale Fitzpatrick","Gayle Curtis","Genevieve Lucero","Gerry Oneal","Grady Ellis","Grover Escobar","Hans Patel","Horacio Black","Humberto Compton","Hunter Short","Ilene Mcguire","Imelda Lloyd","Ira Macdonald","Issac Allen","Jacques Velazquez","Janis Mullins","Janna Cowan","Javier Garner","Jayson Abbott","Jeannie Tapia","Jefferson Lee","Jeramy Keith","Jermaine Bradshaw","Jewel Lee","Jimmie Yang","Jodie Wood","John Cline","Josefina Dickerson","Josie Pineda","Judith Griffin","Julius Soto","Kelli Romero","Kerri Joseph","Kim Mccall","Lakeisha Velazquez","Latonya Logan","Lee Schmidt","Lela Atkins","Leland Robertson","Leonardo House","Leroy Mcintyre","Lesley Blevins","Lilia Berg","Lilly Stone","Lincoln Bond","Lindsay Hurst","Lionel Fuller","Lorene Hunter","Louis Kidd","Lucius Warren","Lucy Mejia","Lupe Ingram","Lynette Fuller","Lynnette Wright","Madge Copeland","Madge Tanner","Mae Sawyer","Malcolm Newman","Mamie Wong","Mandy Swanson","Marcella Everett","Marco Bright","Marcos Schaefer","Marcus Hays","Marina Walsh","Marion Savage","Marylou Bass","Marylou Mccarthy","Mathew Howard","Maurice Jacobson","Mauricio Bautista","Max Smith","Melanie Bridges","Melissa Brandt","Merlin Wu","Michel Simpson","Mickey Kennedy","Mike Sloan","Milton Walsh","Mohamed Allison","Mohammad Christensen","Nadia Macdonald","Naomi Snyder","Ned Lowe","Nettie Leonard","Olive Perkins","Ophelia Morrow","Oren Montes","Orlando Henderson","Owen Buchanan","Paul Norman","Rafael Barrett","Raymond Cochran","Reed Hooper","Reinaldo Houston","Renato Simmons","Rene Calhoun","Reva Hardin","Robert French","Robin Bender","Rodolfo Scott","Roland Blake","Roland Sullivan","Rolf Barnett","Ross Marquez","Ruthie Daugherty","Sandra Potts","Scott Stephenson","Scotty Gonzales","Sean Wiggins","Shana Gallagher","Sharron Montes","Sheryl Lindsey","Socorro Hayden","Solomon Andrade","Stacey Whitehead","Stevie Hale","Stuart Oliver","Stuart Riddle","Tammy Merritt","Theo Wiley","Theresa Murillo","Timothy Roberts","Tony Torres","Tracy Logan","Troy Hoover","Twila Rubio","Velma Everett","Vincent Mccormick","Vincenzo Stafford","Vito Clark","Waldo Spencer","Werner Lowe","Werner Shepard","Wesley Ford","Wm Cantu","Zelma Pierce"]
[null,null,null,null,null,"Dominick Johnston",{"$f":"IF('Resulting List'!F142=\"\",\"\",'Resulting List'!F142)","v":""},null,{"$f":"TRANSPOSE(_xlfn._xlws.SORT(_xlfn.UNIQUE(_xlfn._xlws.FILTER(Customers[Names],ISNUMBER(SEARCH(Customers[[#This Row],[Search Criteria]],Customers[Names])),\"No data.\"))))","v":"Adriana Todd"},"Albert Ramirez","Alex Rubio","Amanda Beck","Amparo Orozco","Amy Todd","Angelina Roberson","April Fox","Arden Ayala","Arnoldo Pennington","Aubrey Giles","Bette Rivers","Brianna Alexander","Brianna Mora","Britt Vazquez","Broderick Gillespie","Brooke Roman","Calvin Buck","Carmela Mullins","Carol Stevenson","Carolina Russell","Carolyn Roberts","Chelsea Gilbert","Cheryl Williamson","Christa Frederick","Christian Armstrong","Christopher Stuart","Chung Krueger","Clare Whitney","Clarissa Archer","Claudio Lam","Cordell Mills","Craig Shepherd","Damien Kramer","Dane Burke","Danielle Stout","Darrel Liu","Darrin Mcneil","Darron Aguilar","Della Huber","Delores Krause","Dena Rosario","Dominick Johnston","Dona Herring","Dorothy Winters","Douglas Wiley","Doyle David","Earlene Hester","Earline Shepherd","Edwin Sparks","Eli Galvan","Elinor Kaufman","Elroy Porter","Elvin Flynn","Emmitt Porter","Erik Parsons","Ethel Forbes","Felicia Ware","Fidel Haynes","Francisco Valenzuela","Frank Hunt","Gabriela Moore","Gabrielle Patrick","Gale Fitzpatrick","Gayle Curtis","Genevieve Lucero","Gerry Oneal","Grady Ellis","Grover Escobar","Hans Patel","Horacio Black","Humberto Compton","Hunter Short","Ilene Mcguire","Imelda Lloyd","Ira Macdonald","Issac Allen","Jacques Velazquez","Janis Mullins","Janna Cowan","Javier Garner","Jayson Abbott","Jeannie Tapia","Jefferson Lee","Jeramy Keith","Jermaine Bradshaw","Jewel Lee","Jimmie Yang","Jodie Wood","John Cline","Josefina Dickerson","Josie Pineda","Judith Griffin","Julius Soto","Kelli Romero","Kerri Joseph","Kim Mccall","Lakeisha Velazquez","Latonya Logan","Lee Schmidt","Lela Atkins","Leland Robertson","Leonardo House","Leroy Mcintyre","Lesley Blevins","Lilia Berg","Lilly Stone","Lincoln Bond","Lindsay Hurst","Lionel Fuller","Lorene Hunter","Louis Kidd","Lucius Warren","Lucy Mejia","Lupe Ingram","Lynette Fuller","Lynnette Wright","Madge Copeland","Madge Tanner","Mae Sawyer","Malcolm Newman","Mamie Wong","Mandy Swanson","Marcella Everett","Marco Bright","Marcos Schaefer","Marcus Hays","Marina Walsh","Marion Savage","Marylou Bass","Marylou Mccarthy","Mathew Howard","Maurice Jacobson","Mauricio Bautista","Max Smith","Melanie Bridges","Melissa Brandt","Merlin Wu","Michel Simpson","Mickey Kennedy","Mike Sloan","Milton Walsh","Mohamed Allison","Mohammad Christensen","Nadia Macdonald","Naomi Snyder","Ned Lowe","Nettie Leonard","Olive Perkins","Ophelia Morrow","Oren Montes","Orlando Henderson","Owen Buchanan","Paul Norman","Rafael Barrett","Raymond Cochran","Reed Hooper","Reinaldo Houston","Renato Simmons","Rene Calhoun","Reva Hardin","Robert French","Robin Bender","Rodolfo Scott","Roland Blake","Roland Sullivan","Rolf Barnett","Ross Marquez","Ruthie Daugherty","Sandra Potts","Scott Stephenson","Scotty Gonzales","Sean Wiggins","Shana Gallagher","Sharron Montes","Sheryl Lindsey","Socorro Hayden","Solomon Andrade","Stacey Whitehead","Stevie Hale","Stuart Oliver","Stuart Riddle","Tammy Merritt","Theo Wiley","Theresa Murillo","Timothy Roberts","Tony Torres","Tracy Logan","Troy Hoover","Twila Rubio","Velma Everett","Vincent Mccormick","Vincenzo Stafford","Vito Clark","Waldo Spencer","Werner Lowe","Werner Shepard","Wesley Ford","Wm Cantu","Zelma Pierce"]
[null,null,null,null,null,"Zelma Pierce",{"$f":"IF('Resulting List'!F143=\"\",\"\",'Resulting List'!F143)","v":""},null,{"$f":"TRANSPOSE(_xlfn._xlws.SORT(_xlfn.UNIQUE(_xlfn._xlws.FILTER(Customers[Names],ISNUMBER(SEARCH(Customers[[#This Row],[Search Criteria]],Customers[Names])),\"No data.\"))))","v":"Adriana Todd"},"Albert Ramirez","Alex Rubio","Amanda Beck","Amparo Orozco","Amy Todd","Angelina Roberson","April Fox","Arden Ayala","Arnoldo Pennington","Aubrey Giles","Bette Rivers","Brianna Alexander","Brianna Mora","Britt Vazquez","Broderick Gillespie","Brooke Roman","Calvin Buck","Carmela Mullins","Carol Stevenson","Carolina Russell","Carolyn Roberts","Chelsea Gilbert","Cheryl Williamson","Christa Frederick","Christian Armstrong","Christopher Stuart","Chung Krueger","Clare Whitney","Clarissa Archer","Claudio Lam","Cordell Mills","Craig Shepherd","Damien Kramer","Dane Burke","Danielle Stout","Darrel Liu","Darrin Mcneil","Darron Aguilar","Della Huber","Delores Krause","Dena Rosario","Dominick Johnston","Dona Herring","Dorothy Winters","Douglas Wiley","Doyle David","Earlene Hester","Earline Shepherd","Edwin Sparks","Eli Galvan","Elinor Kaufman","Elroy Porter","Elvin Flynn","Emmitt Porter","Erik Parsons","Ethel Forbes","Felicia Ware","Fidel Haynes","Francisco Valenzuela","Frank Hunt","Gabriela Moore","Gabrielle Patrick","Gale Fitzpatrick","Gayle Curtis","Genevieve Lucero","Gerry Oneal","Grady Ellis","Grover Escobar","Hans Patel","Horacio Black","Humberto Compton","Hunter Short","Ilene Mcguire","Imelda Lloyd","Ira Macdonald","Issac Allen","Jacques Velazquez","Janis Mullins","Janna Cowan","Javier Garner","Jayson Abbott","Jeannie Tapia","Jefferson Lee","Jeramy Keith","Jermaine Bradshaw","Jewel Lee","Jimmie Yang","Jodie Wood","John Cline","Josefina Dickerson","Josie Pineda","Judith Griffin","Julius Soto","Kelli Romero","Kerri Joseph","Kim Mccall","Lakeisha Velazquez","Latonya Logan","Lee Schmidt","Lela Atkins","Leland Robertson","Leonardo House","Leroy Mcintyre","Lesley Blevins","Lilia Berg","Lilly Stone","Lincoln Bond","Lindsay Hurst","Lionel Fuller","Lorene Hunter","Louis Kidd","Lucius Warren","Lucy Mejia","Lupe Ingram","Lynette Fuller","Lynnette Wright","Madge Copeland","Madge Tanner","Mae Sawyer","Malcolm Newman","Mamie Wong","Mandy Swanson","Marcella Everett","Marco Bright","Marcos Schaefer","Marcus Hays","Marina Walsh","Marion Savage","Marylou Bass","Marylou Mccarthy","Mathew Howard","Maurice Jacobson","Mauricio Bautista","Max Smith","Melanie Bridges","Melissa Brandt","Merlin Wu","Michel Simpson","Mickey Kennedy","Mike Sloan","Milton Walsh","Mohamed Allison","Mohammad Christensen","Nadia Macdonald","Naomi Snyder","Ned Lowe","Nettie Leonard","Olive Perkins","Ophelia Morrow","Oren Montes","Orlando Henderson","Owen Buchanan","Paul Norman","Rafael Barrett","Raymond Cochran","Reed Hooper","Reinaldo Houston","Renato Simmons","Rene Calhoun","Reva Hardin","Robert French","Robin Bender","Rodolfo Scott","Roland Blake","Roland Sullivan","Rolf Barnett","Ross Marquez","Ruthie Daugherty","Sandra Potts","Scott Stephenson","Scotty Gonzales","Sean Wiggins","Shana Gallagher","Sharron Montes","Sheryl Lindsey","Socorro Hayden","Solomon Andrade","Stacey Whitehead","Stevie Hale","Stuart Oliver","Stuart Riddle","Tammy Merritt","Theo Wiley","Theresa Murillo","Timothy Roberts","Tony Torres","Tracy Logan","Troy Hoover","Twila Rubio","Velma Everett","Vincent Mccormick","Vincenzo Stafford","Vito Clark","Waldo Spencer","Werner Lowe","Werner Shepard","Wesley Ford","Wm Cantu","Zelma Pierce"]
[null,null,null,null,null,"Sheryl Lindsey",{"$f":"IF('Resulting List'!F144=\"\",\"\",'Resulting List'!F144)","v":""},null,{"$f":"TRANSPOSE(_xlfn._xlws.SORT(_xlfn.UNIQUE(_xlfn._xlws.FILTER(Customers[Names],ISNUMBER(SEARCH(Customers[[#This Row],[Search Criteria]],Customers[Names])),\"No data.\"))))","v":"Adriana Todd"},"Albert Ramirez","Alex Rubio","Amanda Beck","Amparo Orozco","Amy Todd","Angelina Roberson","April Fox","Arden Ayala","Arnoldo Pennington","Aubrey Giles","Bette Rivers","Brianna Alexander","Brianna Mora","Britt Vazquez","Broderick Gillespie","Brooke Roman","Calvin Buck","Carmela Mullins","Carol Stevenson","Carolina Russell","Carolyn Roberts","Chelsea Gilbert","Cheryl Williamson","Christa Frederick","Christian Armstrong","Christopher Stuart","Chung Krueger","Clare Whitney","Clarissa Archer","Claudio Lam","Cordell Mills","Craig Shepherd","Damien Kramer","Dane Burke","Danielle Stout","Darrel Liu","Darrin Mcneil","Darron Aguilar","Della Huber","Delores Krause","Dena Rosario","Dominick Johnston","Dona Herring","Dorothy Winters","Douglas Wiley","Doyle David","Earlene Hester","Earline Shepherd","Edwin Sparks","Eli Galvan","Elinor Kaufman","Elroy Porter","Elvin Flynn","Emmitt Porter","Erik Parsons","Ethel Forbes","Felicia Ware","Fidel Haynes","Francisco Valenzuela","Frank Hunt","Gabriela Moore","Gabrielle Patrick","Gale Fitzpatrick","Gayle Curtis","Genevieve Lucero","Gerry Oneal","Grady Ellis","Grover Escobar","Hans Patel","Horacio Black","Humberto Compton","Hunter Short","Ilene Mcguire","Imelda Lloyd","Ira Macdonald","Issac Allen","Jacques Velazquez","Janis Mullins","Janna Cowan","Javier Garner","Jayson Abbott","Jeannie Tapia","Jefferson Lee","Jeramy Keith","Jermaine Bradshaw","Jewel Lee","Jimmie Yang","Jodie Wood","John Cline","Josefina Dickerson","Josie Pineda","Judith Griffin","Julius Soto","Kelli Romero","Kerri Joseph","Kim Mccall","Lakeisha Velazquez","Latonya Logan","Lee Schmidt","Lela Atkins","Leland Robertson","Leonardo House","Leroy Mcintyre","Lesley Blevins","Lilia Berg","Lilly Stone","Lincoln Bond","Lindsay Hurst","Lionel Fuller","Lorene Hunter","Louis Kidd","Lucius Warren","Lucy Mejia","Lupe Ingram","Lynette Fuller","Lynnette Wright","Madge Copeland","Madge Tanner","Mae Sawyer","Malcolm Newman","Mamie Wong","Mandy Swanson","Marcella Everett","Marco Bright","Marcos Schaefer","Marcus Hays","Marina Walsh","Marion Savage","Marylou Bass","Marylou Mccarthy","Mathew Howard","Maurice Jacobson","Mauricio Bautista","Max Smith","Melanie Bridges","Melissa Brandt","Merlin Wu","Michel Simpson","Mickey Kennedy","Mike Sloan","Milton Walsh","Mohamed Allison","Mohammad Christensen","Nadia Macdonald","Naomi Snyder","Ned Lowe","Nettie Leonard","Olive Perkins","Ophelia Morrow","Oren Montes","Orlando Henderson","Owen Buchanan","Paul Norman","Rafael Barrett","Raymond Cochran","Reed Hooper","Reinaldo Houston","Renato Simmons","Rene Calhoun","Reva Hardin","Robert French","Robin Bender","Rodolfo Scott","Roland Blake","Roland Sullivan","Rolf Barnett","Ross Marquez","Ruthie Daugherty","Sandra Potts","Scott Stephenson","Scotty Gonzales","Sean Wiggins","Shana Gallagher","Sharron Montes","Sheryl Lindsey","Socorro Hayden","Solomon Andrade","Stacey Whitehead","Stevie Hale","Stuart Oliver","Stuart Riddle","Tammy Merritt","Theo Wiley","Theresa Murillo","Timothy Roberts","Tony Torres","Tracy Logan","Troy Hoover","Twila Rubio","Velma Everett","Vincent Mccormick","Vincenzo Stafford","Vito Clark","Waldo Spencer","Werner Lowe","Werner Shepard","Wesley Ford","Wm Cantu","Zelma Pierce"]
[null,null,null,null,null,"Grady Ellis",{"$f":"IF('Resulting List'!F145=\"\",\"\",'Resulting List'!F145)","v":""},null,{"$f":"TRANSPOSE(_xlfn._xlws.SORT(_xlfn.UNIQUE(_xlfn._xlws.FILTER(Customers[Names],ISNUMBER(SEARCH(Customers[[#This Row],[Search Criteria]],Customers[Names])),\"No data.\"))))","v":"Adriana Todd"},"Albert Ramirez","Alex Rubio","Amanda Beck","Amparo Orozco","Amy Todd","Angelina Roberson","April Fox","Arden Ayala","Arnoldo Pennington","Aubrey Giles","Bette Rivers","Brianna Alexander","Brianna Mora","Britt Vazquez","Broderick Gillespie","Brooke Roman","Calvin Buck","Carmela Mullins","Carol Stevenson","Carolina Russell","Carolyn Roberts","Chelsea Gilbert","Cheryl Williamson","Christa Frederick","Christian Armstrong","Christopher Stuart","Chung Krueger","Clare Whitney","Clarissa Archer","Claudio Lam","Cordell Mills","Craig Shepherd","Damien Kramer","Dane Burke","Danielle Stout","Darrel Liu","Darrin Mcneil","Darron Aguilar","Della Huber","Delores Krause","Dena Rosario","Dominick Johnston","Dona Herring","Dorothy Winters","Douglas Wiley","Doyle David","Earlene Hester","Earline Shepherd","Edwin Sparks","Eli Galvan","Elinor Kaufman","Elroy Porter","Elvin Flynn","Emmitt Porter","Erik Parsons","Ethel Forbes","Felicia Ware","Fidel Haynes","Francisco Valenzuela","Frank Hunt","Gabriela Moore","Gabrielle Patrick","Gale Fitzpatrick","Gayle Curtis","Genevieve Lucero","Gerry Oneal","Grady Ellis","Grover Escobar","Hans Patel","Horacio Black","Humberto Compton","Hunter Short","Ilene Mcguire","Imelda Lloyd","Ira Macdonald","Issac Allen","Jacques Velazquez","Janis Mullins","Janna Cowan","Javier Garner","Jayson Abbott","Jeannie Tapia","Jefferson Lee","Jeramy Keith","Jermaine Bradshaw","Jewel Lee","Jimmie Yang","Jodie Wood","John Cline","Josefina Dickerson","Josie Pineda","Judith Griffin","Julius Soto","Kelli Romero","Kerri Joseph","Kim Mccall","Lakeisha Velazquez","Latonya Logan","Lee Schmidt","Lela Atkins","Leland Robertson","Leonardo House","Leroy Mcintyre","Lesley Blevins","Lilia Berg","Lilly Stone","Lincoln Bond","Lindsay Hurst","Lionel Fuller","Lorene Hunter","Louis Kidd","Lucius Warren","Lucy Mejia","Lupe Ingram","Lynette Fuller","Lynnette Wright","Madge Copeland","Madge Tanner","Mae Sawyer","Malcolm Newman","Mamie Wong","Mandy Swanson","Marcella Everett","Marco Bright","Marcos Schaefer","Marcus Hays","Marina Walsh","Marion Savage","Marylou Bass","Marylou Mccarthy","Mathew Howard","Maurice Jacobson","Mauricio Bautista","Max Smith","Melanie Bridges","Melissa Brandt","Merlin Wu","Michel Simpson","Mickey Kennedy","Mike Sloan","Milton Walsh","Mohamed Allison","Mohammad Christensen","Nadia Macdonald","Naomi Snyder","Ned Lowe","Nettie Leonard","Olive Perkins","Ophelia Morrow","Oren Montes","Orlando Henderson","Owen Buchanan","Paul Norman","Rafael Barrett","Raymond Cochran","Reed Hooper","Reinaldo Houston","Renato Simmons","Rene Calhoun","Reva Hardin","Robert French","Robin Bender","Rodolfo Scott","Roland Blake","Roland Sullivan","Rolf Barnett","Ross Marquez","Ruthie Daugherty","Sandra Potts","Scott Stephenson","Scotty Gonzales","Sean Wiggins","Shana Gallagher","Sharron Montes","Sheryl Lindsey","Socorro Hayden","Solomon Andrade","Stacey Whitehead","Stevie Hale","Stuart Oliver","Stuart Riddle","Tammy Merritt","Theo Wiley","Theresa Murillo","Timothy Roberts","Tony Torres","Tracy Logan","Troy Hoover","Twila Rubio","Velma Everett","Vincent Mccormick","Vincenzo Stafford","Vito Clark","Waldo Spencer","Werner Lowe","Werner Shepard","Wesley Ford","Wm Cantu","Zelma Pierce"]
[null,null,null,null,null,"Brooke Roman",{"$f":"IF('Resulting List'!F146=\"\",\"\",'Resulting List'!F146)","v":""},null,{"$f":"TRANSPOSE(_xlfn._xlws.SORT(_xlfn.UNIQUE(_xlfn._xlws.FILTER(Customers[Names],ISNUMBER(SEARCH(Customers[[#This Row],[Search Criteria]],Customers[Names])),\"No data.\"))))","v":"Adriana Todd"},"Albert Ramirez","Alex Rubio","Amanda Beck","Amparo Orozco","Amy Todd","Angelina Roberson","April Fox","Arden Ayala","Arnoldo Pennington","Aubrey Giles","Bette Rivers","Brianna Alexander","Brianna Mora","Britt Vazquez","Broderick Gillespie","Brooke Roman","Calvin Buck","Carmela Mullins","Carol Stevenson","Carolina Russell","Carolyn Roberts","Chelsea Gilbert","Cheryl Williamson","Christa Frederick","Christian Armstrong","Christopher Stuart","Chung Krueger","Clare Whitney","Clarissa Archer","Claudio Lam","Cordell Mills","Craig Shepherd","Damien Kramer","Dane Burke","Danielle Stout","Darrel Liu","Darrin Mcneil","Darron Aguilar","Della Huber","Delores Krause","Dena Rosario","Dominick Johnston","Dona Herring","Dorothy Winters","Douglas Wiley","Doyle David","Earlene Hester","Earline Shepherd","Edwin Sparks","Eli Galvan","Elinor Kaufman","Elroy Porter","Elvin Flynn","Emmitt Porter","Erik Parsons","Ethel Forbes","Felicia Ware","Fidel Haynes","Francisco Valenzuela","Frank Hunt","Gabriela Moore","Gabrielle Patrick","Gale Fitzpatrick","Gayle Curtis","Genevieve Lucero","Gerry Oneal","Grady Ellis","Grover Escobar","Hans Patel","Horacio Black","Humberto Compton","Hunter Short","Ilene Mcguire","Imelda Lloyd","Ira Macdonald","Issac Allen","Jacques Velazquez","Janis Mullins","Janna Cowan","Javier Garner","Jayson Abbott","Jeannie Tapia","Jefferson Lee","Jeramy Keith","Jermaine Bradshaw","Jewel Lee","Jimmie Yang","Jodie Wood","John Cline","Josefina Dickerson","Josie Pineda","Judith Griffin","Julius Soto","Kelli Romero","Kerri Joseph","Kim Mccall","Lakeisha Velazquez","Latonya Logan","Lee Schmidt","Lela Atkins","Leland Robertson","Leonardo House","Leroy Mcintyre","Lesley Blevins","Lilia Berg","Lilly Stone","Lincoln Bond","Lindsay Hurst","Lionel Fuller","Lorene Hunter","Louis Kidd","Lucius Warren","Lucy Mejia","Lupe Ingram","Lynette Fuller","Lynnette Wright","Madge Copeland","Madge Tanner","Mae Sawyer","Malcolm Newman","Mamie Wong","Mandy Swanson","Marcella Everett","Marco Bright","Marcos Schaefer","Marcus Hays","Marina Walsh","Marion Savage","Marylou Bass","Marylou Mccarthy","Mathew Howard","Maurice Jacobson","Mauricio Bautista","Max Smith","Melanie Bridges","Melissa Brandt","Merlin Wu","Michel Simpson","Mickey Kennedy","Mike Sloan","Milton Walsh","Mohamed Allison","Mohammad Christensen","Nadia Macdonald","Naomi Snyder","Ned Lowe","Nettie Leonard","Olive Perkins","Ophelia Morrow","Oren Montes","Orlando Henderson","Owen Buchanan","Paul Norman","Rafael Barrett","Raymond Cochran","Reed Hooper","Reinaldo Houston","Renato Simmons","Rene Calhoun","Reva Hardin","Robert French","Robin Bender","Rodolfo Scott","Roland Blake","Roland Sullivan","Rolf Barnett","Ross Marquez","Ruthie Daugherty","Sandra Potts","Scott Stephenson","Scotty Gonzales","Sean Wiggins","Shana Gallagher","Sharron Montes","Sheryl Lindsey","Socorro Hayden","Solomon Andrade","Stacey Whitehead","Stevie Hale","Stuart Oliver","Stuart Riddle","Tammy Merritt","Theo Wiley","Theresa Murillo","Timothy Roberts","Tony Torres","Tracy Logan","Troy Hoover","Twila Rubio","Velma Everett","Vincent Mccormick","Vincenzo Stafford","Vito Clark","Waldo Spencer","Werner Lowe","Werner Shepard","Wesley Ford","Wm Cantu","Zelma Pierce"]
[null,null,null,null,null,"Stevie Hale",{"$f":"IF('Resulting List'!F147=\"\",\"\",'Resulting List'!F147)","v":""},null,{"$f":"TRANSPOSE(_xlfn._xlws.SORT(_xlfn.UNIQUE(_xlfn._xlws.FILTER(Customers[Names],ISNUMBER(SEARCH(Customers[[#This Row],[Search Criteria]],Customers[Names])),\"No data.\"))))","v":"Adriana Todd"},"Albert Ramirez","Alex Rubio","Amanda Beck","Amparo Orozco","Amy Todd","Angelina Roberson","April Fox","Arden Ayala","Arnoldo Pennington","Aubrey Giles","Bette Rivers","Brianna Alexander","Brianna Mora","Britt Vazquez","Broderick Gillespie","Brooke Roman","Calvin Buck","Carmela Mullins","Carol Stevenson","Carolina Russell","Carolyn Roberts","Chelsea Gilbert","Cheryl Williamson","Christa Frederick","Christian Armstrong","Christopher Stuart","Chung Krueger","Clare Whitney","Clarissa Archer","Claudio Lam","Cordell Mills","Craig Shepherd","Damien Kramer","Dane Burke","Danielle Stout","Darrel Liu","Darrin Mcneil","Darron Aguilar","Della Huber","Delores Krause","Dena Rosario","Dominick Johnston","Dona Herring","Dorothy Winters","Douglas Wiley","Doyle David","Earlene Hester","Earline Shepherd","Edwin Sparks","Eli Galvan","Elinor Kaufman","Elroy Porter","Elvin Flynn","Emmitt Porter","Erik Parsons","Ethel Forbes","Felicia Ware","Fidel Haynes","Francisco Valenzuela","Frank Hunt","Gabriela Moore","Gabrielle Patrick","Gale Fitzpatrick","Gayle Curtis","Genevieve Lucero","Gerry Oneal","Grady Ellis","Grover Escobar","Hans Patel","Horacio Black","Humberto Compton","Hunter Short","Ilene Mcguire","Imelda Lloyd","Ira Macdonald","Issac Allen","Jacques Velazquez","Janis Mullins","Janna Cowan","Javier Garner","Jayson Abbott","Jeannie Tapia","Jefferson Lee","Jeramy Keith","Jermaine Bradshaw","Jewel Lee","Jimmie Yang","Jodie Wood","John Cline","Josefina Dickerson","Josie Pineda","Judith Griffin","Julius Soto","Kelli Romero","Kerri Joseph","Kim Mccall","Lakeisha Velazquez","Latonya Logan","Lee Schmidt","Lela Atkins","Leland Robertson","Leonardo House","Leroy Mcintyre","Lesley Blevins","Lilia Berg","Lilly Stone","Lincoln Bond","Lindsay Hurst","Lionel Fuller","Lorene Hunter","Louis Kidd","Lucius Warren","Lucy Mejia","Lupe Ingram","Lynette Fuller","Lynnette Wright","Madge Copeland","Madge Tanner","Mae Sawyer","Malcolm Newman","Mamie Wong","Mandy Swanson","Marcella Everett","Marco Bright","Marcos Schaefer","Marcus Hays","Marina Walsh","Marion Savage","Marylou Bass","Marylou Mccarthy","Mathew Howard","Maurice Jacobson","Mauricio Bautista","Max Smith","Melanie Bridges","Melissa Brandt","Merlin Wu","Michel Simpson","Mickey Kennedy","Mike Sloan","Milton Walsh","Mohamed Allison","Mohammad Christensen","Nadia Macdonald","Naomi Snyder","Ned Lowe","Nettie Leonard","Olive Perkins","Ophelia Morrow","Oren Montes","Orlando Henderson","Owen Buchanan","Paul Norman","Rafael Barrett","Raymond Cochran","Reed Hooper","Reinaldo Houston","Renato Simmons","Rene Calhoun","Reva Hardin","Robert French","Robin Bender","Rodolfo Scott","Roland Blake","Roland Sullivan","Rolf Barnett","Ross Marquez","Ruthie Daugherty","Sandra Potts","Scott Stephenson","Scotty Gonzales","Sean Wiggins","Shana Gallagher","Sharron Montes","Sheryl Lindsey","Socorro Hayden","Solomon Andrade","Stacey Whitehead","Stevie Hale","Stuart Oliver","Stuart Riddle","Tammy Merritt","Theo Wiley","Theresa Murillo","Timothy Roberts","Tony Torres","Tracy Logan","Troy Hoover","Twila Rubio","Velma Everett","Vincent Mccormick","Vincenzo Stafford","Vito Clark","Waldo Spencer","Werner Lowe","Werner Shepard","Wesley Ford","Wm Cantu","Zelma Pierce"]
[null,null,null,null,null,"Robin Bender",{"$f":"IF('Resulting List'!F148=\"\",\"\",'Resulting List'!F148)","v":""},null,{"$f":"TRANSPOSE(_xlfn._xlws.SORT(_xlfn.UNIQUE(_xlfn._xlws.FILTER(Customers[Names],ISNUMBER(SEARCH(Customers[[#This Row],[Search Criteria]],Customers[Names])),\"No data.\"))))","v":"Adriana Todd"},"Albert Ramirez","Alex Rubio","Amanda Beck","Amparo Orozco","Amy Todd","Angelina Roberson","April Fox","Arden Ayala","Arnoldo Pennington","Aubrey Giles","Bette Rivers","Brianna Alexander","Brianna Mora","Britt Vazquez","Broderick Gillespie","Brooke Roman","Calvin Buck","Carmela Mullins","Carol Stevenson","Carolina Russell","Carolyn Roberts","Chelsea Gilbert","Cheryl Williamson","Christa Frederick","Christian Armstrong","Christopher Stuart","Chung Krueger","Clare Whitney","Clarissa Archer","Claudio Lam","Cordell Mills","Craig Shepherd","Damien Kramer","Dane Burke","Danielle Stout","Darrel Liu","Darrin Mcneil","Darron Aguilar","Della Huber","Delores Krause","Dena Rosario","Dominick Johnston","Dona Herring","Dorothy Winters","Douglas Wiley","Doyle David","Earlene Hester","Earline Shepherd","Edwin Sparks","Eli Galvan","Elinor Kaufman","Elroy Porter","Elvin Flynn","Emmitt Porter","Erik Parsons","Ethel Forbes","Felicia Ware","Fidel Haynes","Francisco Valenzuela","Frank Hunt","Gabriela Moore","Gabrielle Patrick","Gale Fitzpatrick","Gayle Curtis","Genevieve Lucero","Gerry Oneal","Grady Ellis","Grover Escobar","Hans Patel","Horacio Black","Humberto Compton","Hunter Short","Ilene Mcguire","Imelda Lloyd","Ira Macdonald","Issac Allen","Jacques Velazquez","Janis Mullins","Janna Cowan","Javier Garner","Jayson Abbott","Jeannie Tapia","Jefferson Lee","Jeramy Keith","Jermaine Bradshaw","Jewel Lee","Jimmie Yang","Jodie Wood","John Cline","Josefina Dickerson","Josie Pineda","Judith Griffin","Julius Soto","Kelli Romero","Kerri Joseph","Kim Mccall","Lakeisha Velazquez","Latonya Logan","Lee Schmidt","Lela Atkins","Leland Robertson","Leonardo House","Leroy Mcintyre","Lesley Blevins","Lilia Berg","Lilly Stone","Lincoln Bond","Lindsay Hurst","Lionel Fuller","Lorene Hunter","Louis Kidd","Lucius Warren","Lucy Mejia","Lupe Ingram","Lynette Fuller","Lynnette Wright","Madge Copeland","Madge Tanner","Mae Sawyer","Malcolm Newman","Mamie Wong","Mandy Swanson","Marcella Everett","Marco Bright","Marcos Schaefer","Marcus Hays","Marina Walsh","Marion Savage","Marylou Bass","Marylou Mccarthy","Mathew Howard","Maurice Jacobson","Mauricio Bautista","Max Smith","Melanie Bridges","Melissa Brandt","Merlin Wu","Michel Simpson","Mickey Kennedy","Mike Sloan","Milton Walsh","Mohamed Allison","Mohammad Christensen","Nadia Macdonald","Naomi Snyder","Ned Lowe","Nettie Leonard","Olive Perkins","Ophelia Morrow","Oren Montes","Orlando Henderson","Owen Buchanan","Paul Norman","Rafael Barrett","Raymond Cochran","Reed Hooper","Reinaldo Houston","Renato Simmons","Rene Calhoun","Reva Hardin","Robert French","Robin Bender","Rodolfo Scott","Roland Blake","Roland Sullivan","Rolf Barnett","Ross Marquez","Ruthie Daugherty","Sandra Potts","Scott Stephenson","Scotty Gonzales","Sean Wiggins","Shana Gallagher","Sharron Montes","Sheryl Lindsey","Socorro Hayden","Solomon Andrade","Stacey Whitehead","Stevie Hale","Stuart Oliver","Stuart Riddle","Tammy Merritt","Theo Wiley","Theresa Murillo","Timothy Roberts","Tony Torres","Tracy Logan","Troy Hoover","Twila Rubio","Velma Everett","Vincent Mccormick","Vincenzo Stafford","Vito Clark","Waldo Spencer","Werner Lowe","Werner Shepard","Wesley Ford","Wm Cantu","Zelma Pierce"]
[null,null,null,null,null,"Arnoldo Pennington",{"$f":"IF('Resulting List'!F149=\"\",\"\",'Resulting List'!F149)","v":""},null,{"$f":"TRANSPOSE(_xlfn._xlws.SORT(_xlfn.UNIQUE(_xlfn._xlws.FILTER(Customers[Names],ISNUMBER(SEARCH(Customers[[#This Row],[Search Criteria]],Customers[Names])),\"No data.\"))))","v":"Adriana Todd"},"Albert Ramirez","Alex Rubio","Amanda Beck","Amparo Orozco","Amy Todd","Angelina Roberson","April Fox","Arden Ayala","Arnoldo Pennington","Aubrey Giles","Bette Rivers","Brianna Alexander","Brianna Mora","Britt Vazquez","Broderick Gillespie","Brooke Roman","Calvin Buck","Carmela Mullins","Carol Stevenson","Carolina Russell","Carolyn Roberts","Chelsea Gilbert","Cheryl Williamson","Christa Frederick","Christian Armstrong","Christopher Stuart","Chung Krueger","Clare Whitney","Clarissa Archer","Claudio Lam","Cordell Mills","Craig Shepherd","Damien Kramer","Dane Burke","Danielle Stout","Darrel Liu","Darrin Mcneil","Darron Aguilar","Della Huber","Delores Krause","Dena Rosario","Dominick Johnston","Dona Herring","Dorothy Winters","Douglas Wiley","Doyle David","Earlene Hester","Earline Shepherd","Edwin Sparks","Eli Galvan","Elinor Kaufman","Elroy Porter","Elvin Flynn","Emmitt Porter","Erik Parsons","Ethel Forbes","Felicia Ware","Fidel Haynes","Francisco Valenzuela","Frank Hunt","Gabriela Moore","Gabrielle Patrick","Gale Fitzpatrick","Gayle Curtis","Genevieve Lucero","Gerry Oneal","Grady Ellis","Grover Escobar","Hans Patel","Horacio Black","Humberto Compton","Hunter Short","Ilene Mcguire","Imelda Lloyd","Ira Macdonald","Issac Allen","Jacques Velazquez","Janis Mullins","Janna Cowan","Javier Garner","Jayson Abbott","Jeannie Tapia","Jefferson Lee","Jeramy Keith","Jermaine Bradshaw","Jewel Lee","Jimmie Yang","Jodie Wood","John Cline","Josefina Dickerson","Josie Pineda","Judith Griffin","Julius Soto","Kelli Romero","Kerri Joseph","Kim Mccall","Lakeisha Velazquez","Latonya Logan","Lee Schmidt","Lela Atkins","Leland Robertson","Leonardo House","Leroy Mcintyre","Lesley Blevins","Lilia Berg","Lilly Stone","Lincoln Bond","Lindsay Hurst","Lionel Fuller","Lorene Hunter","Louis Kidd","Lucius Warren","Lucy Mejia","Lupe Ingram","Lynette Fuller","Lynnette Wright","Madge Copeland","Madge Tanner","Mae Sawyer","Malcolm Newman","Mamie Wong","Mandy Swanson","Marcella Everett","Marco Bright","Marcos Schaefer","Marcus Hays","Marina Walsh","Marion Savage","Marylou Bass","Marylou Mccarthy","Mathew Howard","Maurice Jacobson","Mauricio Bautista","Max Smith","Melanie Bridges","Melissa Brandt","Merlin Wu","Michel Simpson","Mickey Kennedy","Mike Sloan","Milton Walsh","Mohamed Allison","Mohammad Christensen","Nadia Macdonald","Naomi Snyder","Ned Lowe","Nettie Leonard","Olive Perkins","Ophelia Morrow","Oren Montes","Orlando Henderson","Owen Buchanan","Paul Norman","Rafael Barrett","Raymond Cochran","Reed Hooper","Reinaldo Houston","Renato Simmons","Rene Calhoun","Reva Hardin","Robert French","Robin Bender","Rodolfo Scott","Roland Blake","Roland Sullivan","Rolf Barnett","Ross Marquez","Ruthie Daugherty","Sandra Potts","Scott Stephenson","Scotty Gonzales","Sean Wiggins","Shana Gallagher","Sharron Montes","Sheryl Lindsey","Socorro Hayden","Solomon Andrade","Stacey Whitehead","Stevie Hale","Stuart Oliver","Stuart Riddle","Tammy Merritt","Theo Wiley","Theresa Murillo","Timothy Roberts","Tony Torres","Tracy Logan","Troy Hoover","Twila Rubio","Velma Everett","Vincent Mccormick","Vincenzo Stafford","Vito Clark","Waldo Spencer","Werner Lowe","Werner Shepard","Wesley Ford","Wm Cantu","Zelma Pierce"]
[null,null,null,null,null,"Jermaine Bradshaw",{"$f":"IF('Resulting List'!F150=\"\",\"\",'Resulting List'!F150)","v":""},null,{"$f":"TRANSPOSE(_xlfn._xlws.SORT(_xlfn.UNIQUE(_xlfn._xlws.FILTER(Customers[Names],ISNUMBER(SEARCH(Customers[[#This Row],[Search Criteria]],Customers[Names])),\"No data.\"))))","v":"Adriana Todd"},"Albert Ramirez","Alex Rubio","Amanda Beck","Amparo Orozco","Amy Todd","Angelina Roberson","April Fox","Arden Ayala","Arnoldo Pennington","Aubrey Giles","Bette Rivers","Brianna Alexander","Brianna Mora","Britt Vazquez","Broderick Gillespie","Brooke Roman","Calvin Buck","Carmela Mullins","Carol Stevenson","Carolina Russell","Carolyn Roberts","Chelsea Gilbert","Cheryl Williamson","Christa Frederick","Christian Armstrong","Christopher Stuart","Chung Krueger","Clare Whitney","Clarissa Archer","Claudio Lam","Cordell Mills","Craig Shepherd","Damien Kramer","Dane Burke","Danielle Stout","Darrel Liu","Darrin Mcneil","Darron Aguilar","Della Huber","Delores Krause","Dena Rosario","Dominick Johnston","Dona Herring","Dorothy Winters","Douglas Wiley","Doyle David","Earlene Hester","Earline Shepherd","Edwin Sparks","Eli Galvan","Elinor Kaufman","Elroy Porter","Elvin Flynn","Emmitt Porter","Erik Parsons","Ethel Forbes","Felicia Ware","Fidel Haynes","Francisco Valenzuela","Frank Hunt","Gabriela Moore","Gabrielle Patrick","Gale Fitzpatrick","Gayle Curtis","Genevieve Lucero","Gerry Oneal","Grady Ellis","Grover Escobar","Hans Patel","Horacio Black","Humberto Compton","Hunter Short","Ilene Mcguire","Imelda Lloyd","Ira Macdonald","Issac Allen","Jacques Velazquez","Janis Mullins","Janna Cowan","Javier Garner","Jayson Abbott","Jeannie Tapia","Jefferson Lee","Jeramy Keith","Jermaine Bradshaw","Jewel Lee","Jimmie Yang","Jodie Wood","John Cline","Josefina Dickerson","Josie Pineda","Judith Griffin","Julius Soto","Kelli Romero","Kerri Joseph","Kim Mccall","Lakeisha Velazquez","Latonya Logan","Lee Schmidt","Lela Atkins","Leland Robertson","Leonardo House","Leroy Mcintyre","Lesley Blevins","Lilia Berg","Lilly Stone","Lincoln Bond","Lindsay Hurst","Lionel Fuller","Lorene Hunter","Louis Kidd","Lucius Warren","Lucy Mejia","Lupe Ingram","Lynette Fuller","Lynnette Wright","Madge Copeland","Madge Tanner","Mae Sawyer","Malcolm Newman","Mamie Wong","Mandy Swanson","Marcella Everett","Marco Bright","Marcos Schaefer","Marcus Hays","Marina Walsh","Marion Savage","Marylou Bass","Marylou Mccarthy","Mathew Howard","Maurice Jacobson","Mauricio Bautista","Max Smith","Melanie Bridges","Melissa Brandt","Merlin Wu","Michel Simpson","Mickey Kennedy","Mike Sloan","Milton Walsh","Mohamed Allison","Mohammad Christensen","Nadia Macdonald","Naomi Snyder","Ned Lowe","Nettie Leonard","Olive Perkins","Ophelia Morrow","Oren Montes","Orlando Henderson","Owen Buchanan","Paul Norman","Rafael Barrett","Raymond Cochran","Reed Hooper","Reinaldo Houston","Renato Simmons","Rene Calhoun","Reva Hardin","Robert French","Robin Bender","Rodolfo Scott","Roland Blake","Roland Sullivan","Rolf Barnett","Ross Marquez","Ruthie Daugherty","Sandra Potts","Scott Stephenson","Scotty Gonzales","Sean Wiggins","Shana Gallagher","Sharron Montes","Sheryl Lindsey","Socorro Hayden","Solomon Andrade","Stacey Whitehead","Stevie Hale","Stuart Oliver","Stuart Riddle","Tammy Merritt","Theo Wiley","Theresa Murillo","Timothy Roberts","Tony Torres","Tracy Logan","Troy Hoover","Twila Rubio","Velma Everett","Vincent Mccormick","Vincenzo Stafford","Vito Clark","Waldo Spencer","Werner Lowe","Werner Shepard","Wesley Ford","Wm Cantu","Zelma Pierce"]
[null,null,null,null,null,"Ruthie Daugherty",{"$f":"IF('Resulting List'!F151=\"\",\"\",'Resulting List'!F151)","v":""},null,{"$f":"TRANSPOSE(_xlfn._xlws.SORT(_xlfn.UNIQUE(_xlfn._xlws.FILTER(Customers[Names],ISNUMBER(SEARCH(Customers[[#This Row],[Search Criteria]],Customers[Names])),\"No data.\"))))","v":"Adriana Todd"},"Albert Ramirez","Alex Rubio","Amanda Beck","Amparo Orozco","Amy Todd","Angelina Roberson","April Fox","Arden Ayala","Arnoldo Pennington","Aubrey Giles","Bette Rivers","Brianna Alexander","Brianna Mora","Britt Vazquez","Broderick Gillespie","Brooke Roman","Calvin Buck","Carmela Mullins","Carol Stevenson","Carolina Russell","Carolyn Roberts","Chelsea Gilbert","Cheryl Williamson","Christa Frederick","Christian Armstrong","Christopher Stuart","Chung Krueger","Clare Whitney","Clarissa Archer","Claudio Lam","Cordell Mills","Craig Shepherd","Damien Kramer","Dane Burke","Danielle Stout","Darrel Liu","Darrin Mcneil","Darron Aguilar","Della Huber","Delores Krause","Dena Rosario","Dominick Johnston","Dona Herring","Dorothy Winters","Douglas Wiley","Doyle David","Earlene Hester","Earline Shepherd","Edwin Sparks","Eli Galvan","Elinor Kaufman","Elroy Porter","Elvin Flynn","Emmitt Porter","Erik Parsons","Ethel Forbes","Felicia Ware","Fidel Haynes","Francisco Valenzuela","Frank Hunt","Gabriela Moore","Gabrielle Patrick","Gale Fitzpatrick","Gayle Curtis","Genevieve Lucero","Gerry Oneal","Grady Ellis","Grover Escobar","Hans Patel","Horacio Black","Humberto Compton","Hunter Short","Ilene Mcguire","Imelda Lloyd","Ira Macdonald","Issac Allen","Jacques Velazquez","Janis Mullins","Janna Cowan","Javier Garner","Jayson Abbott","Jeannie Tapia","Jefferson Lee","Jeramy Keith","Jermaine Bradshaw","Jewel Lee","Jimmie Yang","Jodie Wood","John Cline","Josefina Dickerson","Josie Pineda","Judith Griffin","Julius Soto","Kelli Romero","Kerri Joseph","Kim Mccall","Lakeisha Velazquez","Latonya Logan","Lee Schmidt","Lela Atkins","Leland Robertson","Leonardo House","Leroy Mcintyre","Lesley Blevins","Lilia Berg","Lilly Stone","Lincoln Bond","Lindsay Hurst","Lionel Fuller","Lorene Hunter","Louis Kidd","Lucius Warren","Lucy Mejia","Lupe Ingram","Lynette Fuller","Lynnette Wright","Madge Copeland","Madge Tanner","Mae Sawyer","Malcolm Newman","Mamie Wong","Mandy Swanson","Marcella Everett","Marco Bright","Marcos Schaefer","Marcus Hays","Marina Walsh","Marion Savage","Marylou Bass","Marylou Mccarthy","Mathew Howard","Maurice Jacobson","Mauricio Bautista","Max Smith","Melanie Bridges","Melissa Brandt","Merlin Wu","Michel Simpson","Mickey Kennedy","Mike Sloan","Milton Walsh","Mohamed Allison","Mohammad Christensen","Nadia Macdonald","Naomi Snyder","Ned Lowe","Nettie Leonard","Olive Perkins","Ophelia Morrow","Oren Montes","Orlando Henderson","Owen Buchanan","Paul Norman","Rafael Barrett","Raymond Cochran","Reed Hooper","Reinaldo Houston","Renato Simmons","Rene Calhoun","Reva Hardin","Robert French","Robin Bender","Rodolfo Scott","Roland Blake","Roland Sullivan","Rolf Barnett","Ross Marquez","Ruthie Daugherty","Sandra Potts","Scott Stephenson","Scotty Gonzales","Sean Wiggins","Shana Gallagher","Sharron Montes","Sheryl Lindsey","Socorro Hayden","Solomon Andrade","Stacey Whitehead","Stevie Hale","Stuart Oliver","Stuart Riddle","Tammy Merritt","Theo Wiley","Theresa Murillo","Timothy Roberts","Tony Torres","Tracy Logan","Troy Hoover","Twila Rubio","Velma Everett","Vincent Mccormick","Vincenzo Stafford","Vito Clark","Waldo Spencer","Werner Lowe","Werner Shepard","Wesley Ford","Wm Cantu","Zelma Pierce"]
[null,null,null,null,null,"Amy Todd",{"$f":"IF('Resulting List'!F152=\"\",\"\",'Resulting List'!F152)","v":""},null,{"$f":"TRANSPOSE(_xlfn._xlws.SORT(_xlfn.UNIQUE(_xlfn._xlws.FILTER(Customers[Names],ISNUMBER(SEARCH(Customers[[#This Row],[Search Criteria]],Customers[Names])),\"No data.\"))))","v":"Adriana Todd"},"Albert Ramirez","Alex Rubio","Amanda Beck","Amparo Orozco","Amy Todd","Angelina Roberson","April Fox","Arden Ayala","Arnoldo Pennington","Aubrey Giles","Bette Rivers","Brianna Alexander","Brianna Mora","Britt Vazquez","Broderick Gillespie","Brooke Roman","Calvin Buck","Carmela Mullins","Carol Stevenson","Carolina Russell","Carolyn Roberts","Chelsea Gilbert","Cheryl Williamson","Christa Frederick","Christian Armstrong","Christopher Stuart","Chung Krueger","Clare Whitney","Clarissa Archer","Claudio Lam","Cordell Mills","Craig Shepherd","Damien Kramer","Dane Burke","Danielle Stout","Darrel Liu","Darrin Mcneil","Darron Aguilar","Della Huber","Delores Krause","Dena Rosario","Dominick Johnston","Dona Herring","Dorothy Winters","Douglas Wiley","Doyle David","Earlene Hester","Earline Shepherd","Edwin Sparks","Eli Galvan","Elinor Kaufman","Elroy Porter","Elvin Flynn","Emmitt Porter","Erik Parsons","Ethel Forbes","Felicia Ware","Fidel Haynes","Francisco Valenzuela","Frank Hunt","Gabriela Moore","Gabrielle Patrick","Gale Fitzpatrick","Gayle Curtis","Genevieve Lucero","Gerry Oneal","Grady Ellis","Grover Escobar","Hans Patel","Horacio Black","Humberto Compton","Hunter Short","Ilene Mcguire","Imelda Lloyd","Ira Macdonald","Issac Allen","Jacques Velazquez","Janis Mullins","Janna Cowan","Javier Garner","Jayson Abbott","Jeannie Tapia","Jefferson Lee","Jeramy Keith","Jermaine Bradshaw","Jewel Lee","Jimmie Yang","Jodie Wood","John Cline","Josefina Dickerson","Josie Pineda","Judith Griffin","Julius Soto","Kelli Romero","Kerri Joseph","Kim Mccall","Lakeisha Velazquez","Latonya Logan","Lee Schmidt","Lela Atkins","Leland Robertson","Leonardo House","Leroy Mcintyre","Lesley Blevins","Lilia Berg","Lilly Stone","Lincoln Bond","Lindsay Hurst","Lionel Fuller","Lorene Hunter","Louis Kidd","Lucius Warren","Lucy Mejia","Lupe Ingram","Lynette Fuller","Lynnette Wright","Madge Copeland","Madge Tanner","Mae Sawyer","Malcolm Newman","Mamie Wong","Mandy Swanson","Marcella Everett","Marco Bright","Marcos Schaefer","Marcus Hays","Marina Walsh","Marion Savage","Marylou Bass","Marylou Mccarthy","Mathew Howard","Maurice Jacobson","Mauricio Bautista","Max Smith","Melanie Bridges","Melissa Brandt","Merlin Wu","Michel Simpson","Mickey Kennedy","Mike Sloan","Milton Walsh","Mohamed Allison","Mohammad Christensen","Nadia Macdonald","Naomi Snyder","Ned Lowe","Nettie Leonard","Olive Perkins","Ophelia Morrow","Oren Montes","Orlando Henderson","Owen Buchanan","Paul Norman","Rafael Barrett","Raymond Cochran","Reed Hooper","Reinaldo Houston","Renato Simmons","Rene Calhoun","Reva Hardin","Robert French","Robin Bender","Rodolfo Scott","Roland Blake","Roland Sullivan","Rolf Barnett","Ross Marquez","Ruthie Daugherty","Sandra Potts","Scott Stephenson","Scotty Gonzales","Sean Wiggins","Shana Gallagher","Sharron Montes","Sheryl Lindsey","Socorro Hayden","Solomon Andrade","Stacey Whitehead","Stevie Hale","Stuart Oliver","Stuart Riddle","Tammy Merritt","Theo Wiley","Theresa Murillo","Timothy Roberts","Tony Torres","Tracy Logan","Troy Hoover","Twila Rubio","Velma Everett","Vincent Mccormick","Vincenzo Stafford","Vito Clark","Waldo Spencer","Werner Lowe","Werner Shepard","Wesley Ford","Wm Cantu","Zelma Pierce"]
[null,null,null,null,null,"Michel Simpson",{"$f":"IF('Resulting List'!F153=\"\",\"\",'Resulting List'!F153)","v":""},null,{"$f":"TRANSPOSE(_xlfn._xlws.SORT(_xlfn.UNIQUE(_xlfn._xlws.FILTER(Customers[Names],ISNUMBER(SEARCH(Customers[[#This Row],[Search Criteria]],Customers[Names])),\"No data.\"))))","v":"Adriana Todd"},"Albert Ramirez","Alex Rubio","Amanda Beck","Amparo Orozco","Amy Todd","Angelina Roberson","April Fox","Arden Ayala","Arnoldo Pennington","Aubrey Giles","Bette Rivers","Brianna Alexander","Brianna Mora","Britt Vazquez","Broderick Gillespie","Brooke Roman","Calvin Buck","Carmela Mullins","Carol Stevenson","Carolina Russell","Carolyn Roberts","Chelsea Gilbert","Cheryl Williamson","Christa Frederick","Christian Armstrong","Christopher Stuart","Chung Krueger","Clare Whitney","Clarissa Archer","Claudio Lam","Cordell Mills","Craig Shepherd","Damien Kramer","Dane Burke","Danielle Stout","Darrel Liu","Darrin Mcneil","Darron Aguilar","Della Huber","Delores Krause","Dena Rosario","Dominick Johnston","Dona Herring","Dorothy Winters","Douglas Wiley","Doyle David","Earlene Hester","Earline Shepherd","Edwin Sparks","Eli Galvan","Elinor Kaufman","Elroy Porter","Elvin Flynn","Emmitt Porter","Erik Parsons","Ethel Forbes","Felicia Ware","Fidel Haynes","Francisco Valenzuela","Frank Hunt","Gabriela Moore","Gabrielle Patrick","Gale Fitzpatrick","Gayle Curtis","Genevieve Lucero","Gerry Oneal","Grady Ellis","Grover Escobar","Hans Patel","Horacio Black","Humberto Compton","Hunter Short","Ilene Mcguire","Imelda Lloyd","Ira Macdonald","Issac Allen","Jacques Velazquez","Janis Mullins","Janna Cowan","Javier Garner","Jayson Abbott","Jeannie Tapia","Jefferson Lee","Jeramy Keith","Jermaine Bradshaw","Jewel Lee","Jimmie Yang","Jodie Wood","John Cline","Josefina Dickerson","Josie Pineda","Judith Griffin","Julius Soto","Kelli Romero","Kerri Joseph","Kim Mccall","Lakeisha Velazquez","Latonya Logan","Lee Schmidt","Lela Atkins","Leland Robertson","Leonardo House","Leroy Mcintyre","Lesley Blevins","Lilia Berg","Lilly Stone","Lincoln Bond","Lindsay Hurst","Lionel Fuller","Lorene Hunter","Louis Kidd","Lucius Warren","Lucy Mejia","Lupe Ingram","Lynette Fuller","Lynnette Wright","Madge Copeland","Madge Tanner","Mae Sawyer","Malcolm Newman","Mamie Wong","Mandy Swanson","Marcella Everett","Marco Bright","Marcos Schaefer","Marcus Hays","Marina Walsh","Marion Savage","Marylou Bass","Marylou Mccarthy","Mathew Howard","Maurice Jacobson","Mauricio Bautista","Max Smith","Melanie Bridges","Melissa Brandt","Merlin Wu","Michel Simpson","Mickey Kennedy","Mike Sloan","Milton Walsh","Mohamed Allison","Mohammad Christensen","Nadia Macdonald","Naomi Snyder","Ned Lowe","Nettie Leonard","Olive Perkins","Ophelia Morrow","Oren Montes","Orlando Henderson","Owen Buchanan","Paul Norman","Rafael Barrett","Raymond Cochran","Reed Hooper","Reinaldo Houston","Renato Simmons","Rene Calhoun","Reva Hardin","Robert French","Robin Bender","Rodolfo Scott","Roland Blake","Roland Sullivan","Rolf Barnett","Ross Marquez","Ruthie Daugherty","Sandra Potts","Scott Stephenson","Scotty Gonzales","Sean Wiggins","Shana Gallagher","Sharron Montes","Sheryl Lindsey","Socorro Hayden","Solomon Andrade","Stacey Whitehead","Stevie Hale","Stuart Oliver","Stuart Riddle","Tammy Merritt","Theo Wiley","Theresa Murillo","Timothy Roberts","Tony Torres","Tracy Logan","Troy Hoover","Twila Rubio","Velma Everett","Vincent Mccormick","Vincenzo Stafford","Vito Clark","Waldo Spencer","Werner Lowe","Werner Shepard","Wesley Ford","Wm Cantu","Zelma Pierce"]
[null,null,null,null,null,"Earlene Hester",{"$f":"IF('Resulting List'!F154=\"\",\"\",'Resulting List'!F154)","v":""},null,{"$f":"TRANSPOSE(_xlfn._xlws.SORT(_xlfn.UNIQUE(_xlfn._xlws.FILTER(Customers[Names],ISNUMBER(SEARCH(Customers[[#This Row],[Search Criteria]],Customers[Names])),\"No data.\"))))","v":"Adriana Todd"},"Albert Ramirez","Alex Rubio","Amanda Beck","Amparo Orozco","Amy Todd","Angelina Roberson","April Fox","Arden Ayala","Arnoldo Pennington","Aubrey Giles","Bette Rivers","Brianna Alexander","Brianna Mora","Britt Vazquez","Broderick Gillespie","Brooke Roman","Calvin Buck","Carmela Mullins","Carol Stevenson","Carolina Russell","Carolyn Roberts","Chelsea Gilbert","Cheryl Williamson","Christa Frederick","Christian Armstrong","Christopher Stuart","Chung Krueger","Clare Whitney","Clarissa Archer","Claudio Lam","Cordell Mills","Craig Shepherd","Damien Kramer","Dane Burke","Danielle Stout","Darrel Liu","Darrin Mcneil","Darron Aguilar","Della Huber","Delores Krause","Dena Rosario","Dominick Johnston","Dona Herring","Dorothy Winters","Douglas Wiley","Doyle David","Earlene Hester","Earline Shepherd","Edwin Sparks","Eli Galvan","Elinor Kaufman","Elroy Porter","Elvin Flynn","Emmitt Porter","Erik Parsons","Ethel Forbes","Felicia Ware","Fidel Haynes","Francisco Valenzuela","Frank Hunt","Gabriela Moore","Gabrielle Patrick","Gale Fitzpatrick","Gayle Curtis","Genevieve Lucero","Gerry Oneal","Grady Ellis","Grover Escobar","Hans Patel","Horacio Black","Humberto Compton","Hunter Short","Ilene Mcguire","Imelda Lloyd","Ira Macdonald","Issac Allen","Jacques Velazquez","Janis Mullins","Janna Cowan","Javier Garner","Jayson Abbott","Jeannie Tapia","Jefferson Lee","Jeramy Keith","Jermaine Bradshaw","Jewel Lee","Jimmie Yang","Jodie Wood","John Cline","Josefina Dickerson","Josie Pineda","Judith Griffin","Julius Soto","Kelli Romero","Kerri Joseph","Kim Mccall","Lakeisha Velazquez","Latonya Logan","Lee Schmidt","Lela Atkins","Leland Robertson","Leonardo House","Leroy Mcintyre","Lesley Blevins","Lilia Berg","Lilly Stone","Lincoln Bond","Lindsay Hurst","Lionel Fuller","Lorene Hunter","Louis Kidd","Lucius Warren","Lucy Mejia","Lupe Ingram","Lynette Fuller","Lynnette Wright","Madge Copeland","Madge Tanner","Mae Sawyer","Malcolm Newman","Mamie Wong","Mandy Swanson","Marcella Everett","Marco Bright","Marcos Schaefer","Marcus Hays","Marina Walsh","Marion Savage","Marylou Bass","Marylou Mccarthy","Mathew Howard","Maurice Jacobson","Mauricio Bautista","Max Smith","Melanie Bridges","Melissa Brandt","Merlin Wu","Michel Simpson","Mickey Kennedy","Mike Sloan","Milton Walsh","Mohamed Allison","Mohammad Christensen","Nadia Macdonald","Naomi Snyder","Ned Lowe","Nettie Leonard","Olive Perkins","Ophelia Morrow","Oren Montes","Orlando Henderson","Owen Buchanan","Paul Norman","Rafael Barrett","Raymond Cochran","Reed Hooper","Reinaldo Houston","Renato Simmons","Rene Calhoun","Reva Hardin","Robert French","Robin Bender","Rodolfo Scott","Roland Blake","Roland Sullivan","Rolf Barnett","Ross Marquez","Ruthie Daugherty","Sandra Potts","Scott Stephenson","Scotty Gonzales","Sean Wiggins","Shana Gallagher","Sharron Montes","Sheryl Lindsey","Socorro Hayden","Solomon Andrade","Stacey Whitehead","Stevie Hale","Stuart Oliver","Stuart Riddle","Tammy Merritt","Theo Wiley","Theresa Murillo","Timothy Roberts","Tony Torres","Tracy Logan","Troy Hoover","Twila Rubio","Velma Everett","Vincent Mccormick","Vincenzo Stafford","Vito Clark","Waldo Spencer","Werner Lowe","Werner Shepard","Wesley Ford","Wm Cantu","Zelma Pierce"]
[null,null,null,null,null,"Sean Wiggins",{"$f":"IF('Resulting List'!F155=\"\",\"\",'Resulting List'!F155)","v":""},null,{"$f":"TRANSPOSE(_xlfn._xlws.SORT(_xlfn.UNIQUE(_xlfn._xlws.FILTER(Customers[Names],ISNUMBER(SEARCH(Customers[[#This Row],[Search Criteria]],Customers[Names])),\"No data.\"))))","v":"Adriana Todd"},"Albert Ramirez","Alex Rubio","Amanda Beck","Amparo Orozco","Amy Todd","Angelina Roberson","April Fox","Arden Ayala","Arnoldo Pennington","Aubrey Giles","Bette Rivers","Brianna Alexander","Brianna Mora","Britt Vazquez","Broderick Gillespie","Brooke Roman","Calvin Buck","Carmela Mullins","Carol Stevenson","Carolina Russell","Carolyn Roberts","Chelsea Gilbert","Cheryl Williamson","Christa Frederick","Christian Armstrong","Christopher Stuart","Chung Krueger","Clare Whitney","Clarissa Archer","Claudio Lam","Cordell Mills","Craig Shepherd","Damien Kramer","Dane Burke","Danielle Stout","Darrel Liu","Darrin Mcneil","Darron Aguilar","Della Huber","Delores Krause","Dena Rosario","Dominick Johnston","Dona Herring","Dorothy Winters","Douglas Wiley","Doyle David","Earlene Hester","Earline Shepherd","Edwin Sparks","Eli Galvan","Elinor Kaufman","Elroy Porter","Elvin Flynn","Emmitt Porter","Erik Parsons","Ethel Forbes","Felicia Ware","Fidel Haynes","Francisco Valenzuela","Frank Hunt","Gabriela Moore","Gabrielle Patrick","Gale Fitzpatrick","Gayle Curtis","Genevieve Lucero","Gerry Oneal","Grady Ellis","Grover Escobar","Hans Patel","Horacio Black","Humberto Compton","Hunter Short","Ilene Mcguire","Imelda Lloyd","Ira Macdonald","Issac Allen","Jacques Velazquez","Janis Mullins","Janna Cowan","Javier Garner","Jayson Abbott","Jeannie Tapia","Jefferson Lee","Jeramy Keith","Jermaine Bradshaw","Jewel Lee","Jimmie Yang","Jodie Wood","John Cline","Josefina Dickerson","Josie Pineda","Judith Griffin","Julius Soto","Kelli Romero","Kerri Joseph","Kim Mccall","Lakeisha Velazquez","Latonya Logan","Lee Schmidt","Lela Atkins","Leland Robertson","Leonardo House","Leroy Mcintyre","Lesley Blevins","Lilia Berg","Lilly Stone","Lincoln Bond","Lindsay Hurst","Lionel Fuller","Lorene Hunter","Louis Kidd","Lucius Warren","Lucy Mejia","Lupe Ingram","Lynette Fuller","Lynnette Wright","Madge Copeland","Madge Tanner","Mae Sawyer","Malcolm Newman","Mamie Wong","Mandy Swanson","Marcella Everett","Marco Bright","Marcos Schaefer","Marcus Hays","Marina Walsh","Marion Savage","Marylou Bass","Marylou Mccarthy","Mathew Howard","Maurice Jacobson","Mauricio Bautista","Max Smith","Melanie Bridges","Melissa Brandt","Merlin Wu","Michel Simpson","Mickey Kennedy","Mike Sloan","Milton Walsh","Mohamed Allison","Mohammad Christensen","Nadia Macdonald","Naomi Snyder","Ned Lowe","Nettie Leonard","Olive Perkins","Ophelia Morrow","Oren Montes","Orlando Henderson","Owen Buchanan","Paul Norman","Rafael Barrett","Raymond Cochran","Reed Hooper","Reinaldo Houston","Renato Simmons","Rene Calhoun","Reva Hardin","Robert French","Robin Bender","Rodolfo Scott","Roland Blake","Roland Sullivan","Rolf Barnett","Ross Marquez","Ruthie Daugherty","Sandra Potts","Scott Stephenson","Scotty Gonzales","Sean Wiggins","Shana Gallagher","Sharron Montes","Sheryl Lindsey","Socorro Hayden","Solomon Andrade","Stacey Whitehead","Stevie Hale","Stuart Oliver","Stuart Riddle","Tammy Merritt","Theo Wiley","Theresa Murillo","Timothy Roberts","Tony Torres","Tracy Logan","Troy Hoover","Twila Rubio","Velma Everett","Vincent Mccormick","Vincenzo Stafford","Vito Clark","Waldo Spencer","Werner Lowe","Werner Shepard","Wesley Ford","Wm Cantu","Zelma Pierce"]
[null,null,null,null,null,"Carolina Russell",{"$f":"IF('Resulting List'!F156=\"\",\"\",'Resulting List'!F156)","v":""},null,{"$f":"TRANSPOSE(_xlfn._xlws.SORT(_xlfn.UNIQUE(_xlfn._xlws.FILTER(Customers[Names],ISNUMBER(SEARCH(Customers[[#This Row],[Search Criteria]],Customers[Names])),\"No data.\"))))","v":"Adriana Todd"},"Albert Ramirez","Alex Rubio","Amanda Beck","Amparo Orozco","Amy Todd","Angelina Roberson","April Fox","Arden Ayala","Arnoldo Pennington","Aubrey Giles","Bette Rivers","Brianna Alexander","Brianna Mora","Britt Vazquez","Broderick Gillespie","Brooke Roman","Calvin Buck","Carmela Mullins","Carol Stevenson","Carolina Russell","Carolyn Roberts","Chelsea Gilbert","Cheryl Williamson","Christa Frederick","Christian Armstrong","Christopher Stuart","Chung Krueger","Clare Whitney","Clarissa Archer","Claudio Lam","Cordell Mills","Craig Shepherd","Damien Kramer","Dane Burke","Danielle Stout","Darrel Liu","Darrin Mcneil","Darron Aguilar","Della Huber","Delores Krause","Dena Rosario","Dominick Johnston","Dona Herring","Dorothy Winters","Douglas Wiley","Doyle David","Earlene Hester","Earline Shepherd","Edwin Sparks","Eli Galvan","Elinor Kaufman","Elroy Porter","Elvin Flynn","Emmitt Porter","Erik Parsons","Ethel Forbes","Felicia Ware","Fidel Haynes","Francisco Valenzuela","Frank Hunt","Gabriela Moore","Gabrielle Patrick","Gale Fitzpatrick","Gayle Curtis","Genevieve Lucero","Gerry Oneal","Grady Ellis","Grover Escobar","Hans Patel","Horacio Black","Humberto Compton","Hunter Short","Ilene Mcguire","Imelda Lloyd","Ira Macdonald","Issac Allen","Jacques Velazquez","Janis Mullins","Janna Cowan","Javier Garner","Jayson Abbott","Jeannie Tapia","Jefferson Lee","Jeramy Keith","Jermaine Bradshaw","Jewel Lee","Jimmie Yang","Jodie Wood","John Cline","Josefina Dickerson","Josie Pineda","Judith Griffin","Julius Soto","Kelli Romero","Kerri Joseph","Kim Mccall","Lakeisha Velazquez","Latonya Logan","Lee Schmidt","Lela Atkins","Leland Robertson","Leonardo House","Leroy Mcintyre","Lesley Blevins","Lilia Berg","Lilly Stone","Lincoln Bond","Lindsay Hurst","Lionel Fuller","Lorene Hunter","Louis Kidd","Lucius Warren","Lucy Mejia","Lupe Ingram","Lynette Fuller","Lynnette Wright","Madge Copeland","Madge Tanner","Mae Sawyer","Malcolm Newman","Mamie Wong","Mandy Swanson","Marcella Everett","Marco Bright","Marcos Schaefer","Marcus Hays","Marina Walsh","Marion Savage","Marylou Bass","Marylou Mccarthy","Mathew Howard","Maurice Jacobson","Mauricio Bautista","Max Smith","Melanie Bridges","Melissa Brandt","Merlin Wu","Michel Simpson","Mickey Kennedy","Mike Sloan","Milton Walsh","Mohamed Allison","Mohammad Christensen","Nadia Macdonald","Naomi Snyder","Ned Lowe","Nettie Leonard","Olive Perkins","Ophelia Morrow","Oren Montes","Orlando Henderson","Owen Buchanan","Paul Norman","Rafael Barrett","Raymond Cochran","Reed Hooper","Reinaldo Houston","Renato Simmons","Rene Calhoun","Reva Hardin","Robert French","Robin Bender","Rodolfo Scott","Roland Blake","Roland Sullivan","Rolf Barnett","Ross Marquez","Ruthie Daugherty","Sandra Potts","Scott Stephenson","Scotty Gonzales","Sean Wiggins","Shana Gallagher","Sharron Montes","Sheryl Lindsey","Socorro Hayden","Solomon Andrade","Stacey Whitehead","Stevie Hale","Stuart Oliver","Stuart Riddle","Tammy Merritt","Theo Wiley","Theresa Murillo","Timothy Roberts","Tony Torres","Tracy Logan","Troy Hoover","Twila Rubio","Velma Everett","Vincent Mccormick","Vincenzo Stafford","Vito Clark","Waldo Spencer","Werner Lowe","Werner Shepard","Wesley Ford","Wm Cantu","Zelma Pierce"]
[null,null,null,null,null,"Leroy Mcintyre",{"$f":"IF('Resulting List'!F157=\"\",\"\",'Resulting List'!F157)","v":""},null,{"$f":"TRANSPOSE(_xlfn._xlws.SORT(_xlfn.UNIQUE(_xlfn._xlws.FILTER(Customers[Names],ISNUMBER(SEARCH(Customers[[#This Row],[Search Criteria]],Customers[Names])),\"No data.\"))))","v":"Adriana Todd"},"Albert Ramirez","Alex Rubio","Amanda Beck","Amparo Orozco","Amy Todd","Angelina Roberson","April Fox","Arden Ayala","Arnoldo Pennington","Aubrey Giles","Bette Rivers","Brianna Alexander","Brianna Mora","Britt Vazquez","Broderick Gillespie","Brooke Roman","Calvin Buck","Carmela Mullins","Carol Stevenson","Carolina Russell","Carolyn Roberts","Chelsea Gilbert","Cheryl Williamson","Christa Frederick","Christian Armstrong","Christopher Stuart","Chung Krueger","Clare Whitney","Clarissa Archer","Claudio Lam","Cordell Mills","Craig Shepherd","Damien Kramer","Dane Burke","Danielle Stout","Darrel Liu","Darrin Mcneil","Darron Aguilar","Della Huber","Delores Krause","Dena Rosario","Dominick Johnston","Dona Herring","Dorothy Winters","Douglas Wiley","Doyle David","Earlene Hester","Earline Shepherd","Edwin Sparks","Eli Galvan","Elinor Kaufman","Elroy Porter","Elvin Flynn","Emmitt Porter","Erik Parsons","Ethel Forbes","Felicia Ware","Fidel Haynes","Francisco Valenzuela","Frank Hunt","Gabriela Moore","Gabrielle Patrick","Gale Fitzpatrick","Gayle Curtis","Genevieve Lucero","Gerry Oneal","Grady Ellis","Grover Escobar","Hans Patel","Horacio Black","Humberto Compton","Hunter Short","Ilene Mcguire","Imelda Lloyd","Ira Macdonald","Issac Allen","Jacques Velazquez","Janis Mullins","Janna Cowan","Javier Garner","Jayson Abbott","Jeannie Tapia","Jefferson Lee","Jeramy Keith","Jermaine Bradshaw","Jewel Lee","Jimmie Yang","Jodie Wood","John Cline","Josefina Dickerson","Josie Pineda","Judith Griffin","Julius Soto","Kelli Romero","Kerri Joseph","Kim Mccall","Lakeisha Velazquez","Latonya Logan","Lee Schmidt","Lela Atkins","Leland Robertson","Leonardo House","Leroy Mcintyre","Lesley Blevins","Lilia Berg","Lilly Stone","Lincoln Bond","Lindsay Hurst","Lionel Fuller","Lorene Hunter","Louis Kidd","Lucius Warren","Lucy Mejia","Lupe Ingram","Lynette Fuller","Lynnette Wright","Madge Copeland","Madge Tanner","Mae Sawyer","Malcolm Newman","Mamie Wong","Mandy Swanson","Marcella Everett","Marco Bright","Marcos Schaefer","Marcus Hays","Marina Walsh","Marion Savage","Marylou Bass","Marylou Mccarthy","Mathew Howard","Maurice Jacobson","Mauricio Bautista","Max Smith","Melanie Bridges","Melissa Brandt","Merlin Wu","Michel Simpson","Mickey Kennedy","Mike Sloan","Milton Walsh","Mohamed Allison","Mohammad Christensen","Nadia Macdonald","Naomi Snyder","Ned Lowe","Nettie Leonard","Olive Perkins","Ophelia Morrow","Oren Montes","Orlando Henderson","Owen Buchanan","Paul Norman","Rafael Barrett","Raymond Cochran","Reed Hooper","Reinaldo Houston","Renato Simmons","Rene Calhoun","Reva Hardin","Robert French","Robin Bender","Rodolfo Scott","Roland Blake","Roland Sullivan","Rolf Barnett","Ross Marquez","Ruthie Daugherty","Sandra Potts","Scott Stephenson","Scotty Gonzales","Sean Wiggins","Shana Gallagher","Sharron Montes","Sheryl Lindsey","Socorro Hayden","Solomon Andrade","Stacey Whitehead","Stevie Hale","Stuart Oliver","Stuart Riddle","Tammy Merritt","Theo Wiley","Theresa Murillo","Timothy Roberts","Tony Torres","Tracy Logan","Troy Hoover","Twila Rubio","Velma Everett","Vincent Mccormick","Vincenzo Stafford","Vito Clark","Waldo Spencer","Werner Lowe","Werner Shepard","Wesley Ford","Wm Cantu","Zelma Pierce"]
[null,null,null,null,null,"Amparo Orozco",{"$f":"IF('Resulting List'!F158=\"\",\"\",'Resulting List'!F158)","v":""},null,{"$f":"TRANSPOSE(_xlfn._xlws.SORT(_xlfn.UNIQUE(_xlfn._xlws.FILTER(Customers[Names],ISNUMBER(SEARCH(Customers[[#This Row],[Search Criteria]],Customers[Names])),\"No data.\"))))","v":"Adriana Todd"},"Albert Ramirez","Alex Rubio","Amanda Beck","Amparo Orozco","Amy Todd","Angelina Roberson","April Fox","Arden Ayala","Arnoldo Pennington","Aubrey Giles","Bette Rivers","Brianna Alexander","Brianna Mora","Britt Vazquez","Broderick Gillespie","Brooke Roman","Calvin Buck","Carmela Mullins","Carol Stevenson","Carolina Russell","Carolyn Roberts","Chelsea Gilbert","Cheryl Williamson","Christa Frederick","Christian Armstrong","Christopher Stuart","Chung Krueger","Clare Whitney","Clarissa Archer","Claudio Lam","Cordell Mills","Craig Shepherd","Damien Kramer","Dane Burke","Danielle Stout","Darrel Liu","Darrin Mcneil","Darron Aguilar","Della Huber","Delores Krause","Dena Rosario","Dominick Johnston","Dona Herring","Dorothy Winters","Douglas Wiley","Doyle David","Earlene Hester","Earline Shepherd","Edwin Sparks","Eli Galvan","Elinor Kaufman","Elroy Porter","Elvin Flynn","Emmitt Porter","Erik Parsons","Ethel Forbes","Felicia Ware","Fidel Haynes","Francisco Valenzuela","Frank Hunt","Gabriela Moore","Gabrielle Patrick","Gale Fitzpatrick","Gayle Curtis","Genevieve Lucero","Gerry Oneal","Grady Ellis","Grover Escobar","Hans Patel","Horacio Black","Humberto Compton","Hunter Short","Ilene Mcguire","Imelda Lloyd","Ira Macdonald","Issac Allen","Jacques Velazquez","Janis Mullins","Janna Cowan","Javier Garner","Jayson Abbott","Jeannie Tapia","Jefferson Lee","Jeramy Keith","Jermaine Bradshaw","Jewel Lee","Jimmie Yang","Jodie Wood","John Cline","Josefina Dickerson","Josie Pineda","Judith Griffin","Julius Soto","Kelli Romero","Kerri Joseph","Kim Mccall","Lakeisha Velazquez","Latonya Logan","Lee Schmidt","Lela Atkins","Leland Robertson","Leonardo House","Leroy Mcintyre","Lesley Blevins","Lilia Berg","Lilly Stone","Lincoln Bond","Lindsay Hurst","Lionel Fuller","Lorene Hunter","Louis Kidd","Lucius Warren","Lucy Mejia","Lupe Ingram","Lynette Fuller","Lynnette Wright","Madge Copeland","Madge Tanner","Mae Sawyer","Malcolm Newman","Mamie Wong","Mandy Swanson","Marcella Everett","Marco Bright","Marcos Schaefer","Marcus Hays","Marina Walsh","Marion Savage","Marylou Bass","Marylou Mccarthy","Mathew Howard","Maurice Jacobson","Mauricio Bautista","Max Smith","Melanie Bridges","Melissa Brandt","Merlin Wu","Michel Simpson","Mickey Kennedy","Mike Sloan","Milton Walsh","Mohamed Allison","Mohammad Christensen","Nadia Macdonald","Naomi Snyder","Ned Lowe","Nettie Leonard","Olive Perkins","Ophelia Morrow","Oren Montes","Orlando Henderson","Owen Buchanan","Paul Norman","Rafael Barrett","Raymond Cochran","Reed Hooper","Reinaldo Houston","Renato Simmons","Rene Calhoun","Reva Hardin","Robert French","Robin Bender","Rodolfo Scott","Roland Blake","Roland Sullivan","Rolf Barnett","Ross Marquez","Ruthie Daugherty","Sandra Potts","Scott Stephenson","Scotty Gonzales","Sean Wiggins","Shana Gallagher","Sharron Montes","Sheryl Lindsey","Socorro Hayden","Solomon Andrade","Stacey Whitehead","Stevie Hale","Stuart Oliver","Stuart Riddle","Tammy Merritt","Theo Wiley","Theresa Murillo","Timothy Roberts","Tony Torres","Tracy Logan","Troy Hoover","Twila Rubio","Velma Everett","Vincent Mccormick","Vincenzo Stafford","Vito Clark","Waldo Spencer","Werner Lowe","Werner Shepard","Wesley Ford","Wm Cantu","Zelma Pierce"]
[null,null,null,null,null,"Timothy Roberts",{"$f":"IF('Resulting List'!F159=\"\",\"\",'Resulting List'!F159)","v":""},null,{"$f":"TRANSPOSE(_xlfn._xlws.SORT(_xlfn.UNIQUE(_xlfn._xlws.FILTER(Customers[Names],ISNUMBER(SEARCH(Customers[[#This Row],[Search Criteria]],Customers[Names])),\"No data.\"))))","v":"Adriana Todd"},"Albert Ramirez","Alex Rubio","Amanda Beck","Amparo Orozco","Amy Todd","Angelina Roberson","April Fox","Arden Ayala","Arnoldo Pennington","Aubrey Giles","Bette Rivers","Brianna Alexander","Brianna Mora","Britt Vazquez","Broderick Gillespie","Brooke Roman","Calvin Buck","Carmela Mullins","Carol Stevenson","Carolina Russell","Carolyn Roberts","Chelsea Gilbert","Cheryl Williamson","Christa Frederick","Christian Armstrong","Christopher Stuart","Chung Krueger","Clare Whitney","Clarissa Archer","Claudio Lam","Cordell Mills","Craig Shepherd","Damien Kramer","Dane Burke","Danielle Stout","Darrel Liu","Darrin Mcneil","Darron Aguilar","Della Huber","Delores Krause","Dena Rosario","Dominick Johnston","Dona Herring","Dorothy Winters","Douglas Wiley","Doyle David","Earlene Hester","Earline Shepherd","Edwin Sparks","Eli Galvan","Elinor Kaufman","Elroy Porter","Elvin Flynn","Emmitt Porter","Erik Parsons","Ethel Forbes","Felicia Ware","Fidel Haynes","Francisco Valenzuela","Frank Hunt","Gabriela Moore","Gabrielle Patrick","Gale Fitzpatrick","Gayle Curtis","Genevieve Lucero","Gerry Oneal","Grady Ellis","Grover Escobar","Hans Patel","Horacio Black","Humberto Compton","Hunter Short","Ilene Mcguire","Imelda Lloyd","Ira Macdonald","Issac Allen","Jacques Velazquez","Janis Mullins","Janna Cowan","Javier Garner","Jayson Abbott","Jeannie Tapia","Jefferson Lee","Jeramy Keith","Jermaine Bradshaw","Jewel Lee","Jimmie Yang","Jodie Wood","John Cline","Josefina Dickerson","Josie Pineda","Judith Griffin","Julius Soto","Kelli Romero","Kerri Joseph","Kim Mccall","Lakeisha Velazquez","Latonya Logan","Lee Schmidt","Lela Atkins","Leland Robertson","Leonardo House","Leroy Mcintyre","Lesley Blevins","Lilia Berg","Lilly Stone","Lincoln Bond","Lindsay Hurst","Lionel Fuller","Lorene Hunter","Louis Kidd","Lucius Warren","Lucy Mejia","Lupe Ingram","Lynette Fuller","Lynnette Wright","Madge Copeland","Madge Tanner","Mae Sawyer","Malcolm Newman","Mamie Wong","Mandy Swanson","Marcella Everett","Marco Bright","Marcos Schaefer","Marcus Hays","Marina Walsh","Marion Savage","Marylou Bass","Marylou Mccarthy","Mathew Howard","Maurice Jacobson","Mauricio Bautista","Max Smith","Melanie Bridges","Melissa Brandt","Merlin Wu","Michel Simpson","Mickey Kennedy","Mike Sloan","Milton Walsh","Mohamed Allison","Mohammad Christensen","Nadia Macdonald","Naomi Snyder","Ned Lowe","Nettie Leonard","Olive Perkins","Ophelia Morrow","Oren Montes","Orlando Henderson","Owen Buchanan","Paul Norman","Rafael Barrett","Raymond Cochran","Reed Hooper","Reinaldo Houston","Renato Simmons","Rene Calhoun","Reva Hardin","Robert French","Robin Bender","Rodolfo Scott","Roland Blake","Roland Sullivan","Rolf Barnett","Ross Marquez","Ruthie Daugherty","Sandra Potts","Scott Stephenson","Scotty Gonzales","Sean Wiggins","Shana Gallagher","Sharron Montes","Sheryl Lindsey","Socorro Hayden","Solomon Andrade","Stacey Whitehead","Stevie Hale","Stuart Oliver","Stuart Riddle","Tammy Merritt","Theo Wiley","Theresa Murillo","Timothy Roberts","Tony Torres","Tracy Logan","Troy Hoover","Twila Rubio","Velma Everett","Vincent Mccormick","Vincenzo Stafford","Vito Clark","Waldo Spencer","Werner Lowe","Werner Shepard","Wesley Ford","Wm Cantu","Zelma Pierce"]
[null,null,null,null,null,"Gerry Oneal",{"$f":"IF('Resulting List'!F160=\"\",\"\",'Resulting List'!F160)","v":""},null,{"$f":"TRANSPOSE(_xlfn._xlws.SORT(_xlfn.UNIQUE(_xlfn._xlws.FILTER(Customers[Names],ISNUMBER(SEARCH(Customers[[#This Row],[Search Criteria]],Customers[Names])),\"No data.\"))))","v":"Adriana Todd"},"Albert Ramirez","Alex Rubio","Amanda Beck","Amparo Orozco","Amy Todd","Angelina Roberson","April Fox","Arden Ayala","Arnoldo Pennington","Aubrey Giles","Bette Rivers","Brianna Alexander","Brianna Mora","Britt Vazquez","Broderick Gillespie","Brooke Roman","Calvin Buck","Carmela Mullins","Carol Stevenson","Carolina Russell","Carolyn Roberts","Chelsea Gilbert","Cheryl Williamson","Christa Frederick","Christian Armstrong","Christopher Stuart","Chung Krueger","Clare Whitney","Clarissa Archer","Claudio Lam","Cordell Mills","Craig Shepherd","Damien Kramer","Dane Burke","Danielle Stout","Darrel Liu","Darrin Mcneil","Darron Aguilar","Della Huber","Delores Krause","Dena Rosario","Dominick Johnston","Dona Herring","Dorothy Winters","Douglas Wiley","Doyle David","Earlene Hester","Earline Shepherd","Edwin Sparks","Eli Galvan","Elinor Kaufman","Elroy Porter","Elvin Flynn","Emmitt Porter","Erik Parsons","Ethel Forbes","Felicia Ware","Fidel Haynes","Francisco Valenzuela","Frank Hunt","Gabriela Moore","Gabrielle Patrick","Gale Fitzpatrick","Gayle Curtis","Genevieve Lucero","Gerry Oneal","Grady Ellis","Grover Escobar","Hans Patel","Horacio Black","Humberto Compton","Hunter Short","Ilene Mcguire","Imelda Lloyd","Ira Macdonald","Issac Allen","Jacques Velazquez","Janis Mullins","Janna Cowan","Javier Garner","Jayson Abbott","Jeannie Tapia","Jefferson Lee","Jeramy Keith","Jermaine Bradshaw","Jewel Lee","Jimmie Yang","Jodie Wood","John Cline","Josefina Dickerson","Josie Pineda","Judith Griffin","Julius Soto","Kelli Romero","Kerri Joseph","Kim Mccall","Lakeisha Velazquez","Latonya Logan","Lee Schmidt","Lela Atkins","Leland Robertson","Leonardo House","Leroy Mcintyre","Lesley Blevins","Lilia Berg","Lilly Stone","Lincoln Bond","Lindsay Hurst","Lionel Fuller","Lorene Hunter","Louis Kidd","Lucius Warren","Lucy Mejia","Lupe Ingram","Lynette Fuller","Lynnette Wright","Madge Copeland","Madge Tanner","Mae Sawyer","Malcolm Newman","Mamie Wong","Mandy Swanson","Marcella Everett","Marco Bright","Marcos Schaefer","Marcus Hays","Marina Walsh","Marion Savage","Marylou Bass","Marylou Mccarthy","Mathew Howard","Maurice Jacobson","Mauricio Bautista","Max Smith","Melanie Bridges","Melissa Brandt","Merlin Wu","Michel Simpson","Mickey Kennedy","Mike Sloan","Milton Walsh","Mohamed Allison","Mohammad Christensen","Nadia Macdonald","Naomi Snyder","Ned Lowe","Nettie Leonard","Olive Perkins","Ophelia Morrow","Oren Montes","Orlando Henderson","Owen Buchanan","Paul Norman","Rafael Barrett","Raymond Cochran","Reed Hooper","Reinaldo Houston","Renato Simmons","Rene Calhoun","Reva Hardin","Robert French","Robin Bender","Rodolfo Scott","Roland Blake","Roland Sullivan","Rolf Barnett","Ross Marquez","Ruthie Daugherty","Sandra Potts","Scott Stephenson","Scotty Gonzales","Sean Wiggins","Shana Gallagher","Sharron Montes","Sheryl Lindsey","Socorro Hayden","Solomon Andrade","Stacey Whitehead","Stevie Hale","Stuart Oliver","Stuart Riddle","Tammy Merritt","Theo Wiley","Theresa Murillo","Timothy Roberts","Tony Torres","Tracy Logan","Troy Hoover","Twila Rubio","Velma Everett","Vincent Mccormick","Vincenzo Stafford","Vito Clark","Waldo Spencer","Werner Lowe","Werner Shepard","Wesley Ford","Wm Cantu","Zelma Pierce"]
[null,null,null,null,null,"Chung Krueger",{"$f":"IF('Resulting List'!F161=\"\",\"\",'Resulting List'!F161)","v":""},null,{"$f":"TRANSPOSE(_xlfn._xlws.SORT(_xlfn.UNIQUE(_xlfn._xlws.FILTER(Customers[Names],ISNUMBER(SEARCH(Customers[[#This Row],[Search Criteria]],Customers[Names])),\"No data.\"))))","v":"Adriana Todd"},"Albert Ramirez","Alex Rubio","Amanda Beck","Amparo Orozco","Amy Todd","Angelina Roberson","April Fox","Arden Ayala","Arnoldo Pennington","Aubrey Giles","Bette Rivers","Brianna Alexander","Brianna Mora","Britt Vazquez","Broderick Gillespie","Brooke Roman","Calvin Buck","Carmela Mullins","Carol Stevenson","Carolina Russell","Carolyn Roberts","Chelsea Gilbert","Cheryl Williamson","Christa Frederick","Christian Armstrong","Christopher Stuart","Chung Krueger","Clare Whitney","Clarissa Archer","Claudio Lam","Cordell Mills","Craig Shepherd","Damien Kramer","Dane Burke","Danielle Stout","Darrel Liu","Darrin Mcneil","Darron Aguilar","Della Huber","Delores Krause","Dena Rosario","Dominick Johnston","Dona Herring","Dorothy Winters","Douglas Wiley","Doyle David","Earlene Hester","Earline Shepherd","Edwin Sparks","Eli Galvan","Elinor Kaufman","Elroy Porter","Elvin Flynn","Emmitt Porter","Erik Parsons","Ethel Forbes","Felicia Ware","Fidel Haynes","Francisco Valenzuela","Frank Hunt","Gabriela Moore","Gabrielle Patrick","Gale Fitzpatrick","Gayle Curtis","Genevieve Lucero","Gerry Oneal","Grady Ellis","Grover Escobar","Hans Patel","Horacio Black","Humberto Compton","Hunter Short","Ilene Mcguire","Imelda Lloyd","Ira Macdonald","Issac Allen","Jacques Velazquez","Janis Mullins","Janna Cowan","Javier Garner","Jayson Abbott","Jeannie Tapia","Jefferson Lee","Jeramy Keith","Jermaine Bradshaw","Jewel Lee","Jimmie Yang","Jodie Wood","John Cline","Josefina Dickerson","Josie Pineda","Judith Griffin","Julius Soto","Kelli Romero","Kerri Joseph","Kim Mccall","Lakeisha Velazquez","Latonya Logan","Lee Schmidt","Lela Atkins","Leland Robertson","Leonardo House","Leroy Mcintyre","Lesley Blevins","Lilia Berg","Lilly Stone","Lincoln Bond","Lindsay Hurst","Lionel Fuller","Lorene Hunter","Louis Kidd","Lucius Warren","Lucy Mejia","Lupe Ingram","Lynette Fuller","Lynnette Wright","Madge Copeland","Madge Tanner","Mae Sawyer","Malcolm Newman","Mamie Wong","Mandy Swanson","Marcella Everett","Marco Bright","Marcos Schaefer","Marcus Hays","Marina Walsh","Marion Savage","Marylou Bass","Marylou Mccarthy","Mathew Howard","Maurice Jacobson","Mauricio Bautista","Max Smith","Melanie Bridges","Melissa Brandt","Merlin Wu","Michel Simpson","Mickey Kennedy","Mike Sloan","Milton Walsh","Mohamed Allison","Mohammad Christensen","Nadia Macdonald","Naomi Snyder","Ned Lowe","Nettie Leonard","Olive Perkins","Ophelia Morrow","Oren Montes","Orlando Henderson","Owen Buchanan","Paul Norman","Rafael Barrett","Raymond Cochran","Reed Hooper","Reinaldo Houston","Renato Simmons","Rene Calhoun","Reva Hardin","Robert French","Robin Bender","Rodolfo Scott","Roland Blake","Roland Sullivan","Rolf Barnett","Ross Marquez","Ruthie Daugherty","Sandra Potts","Scott Stephenson","Scotty Gonzales","Sean Wiggins","Shana Gallagher","Sharron Montes","Sheryl Lindsey","Socorro Hayden","Solomon Andrade","Stacey Whitehead","Stevie Hale","Stuart Oliver","Stuart Riddle","Tammy Merritt","Theo Wiley","Theresa Murillo","Timothy Roberts","Tony Torres","Tracy Logan","Troy Hoover","Twila Rubio","Velma Everett","Vincent Mccormick","Vincenzo Stafford","Vito Clark","Waldo Spencer","Werner Lowe","Werner Shepard","Wesley Ford","Wm Cantu","Zelma Pierce"]
[null,null,null,null,null,"Lynette Fuller",{"$f":"IF('Resulting List'!F162=\"\",\"\",'Resulting List'!F162)","v":""},null,{"$f":"TRANSPOSE(_xlfn._xlws.SORT(_xlfn.UNIQUE(_xlfn._xlws.FILTER(Customers[Names],ISNUMBER(SEARCH(Customers[[#This Row],[Search Criteria]],Customers[Names])),\"No data.\"))))","v":"Adriana Todd"},"Albert Ramirez","Alex Rubio","Amanda Beck","Amparo Orozco","Amy Todd","Angelina Roberson","April Fox","Arden Ayala","Arnoldo Pennington","Aubrey Giles","Bette Rivers","Brianna Alexander","Brianna Mora","Britt Vazquez","Broderick Gillespie","Brooke Roman","Calvin Buck","Carmela Mullins","Carol Stevenson","Carolina Russell","Carolyn Roberts","Chelsea Gilbert","Cheryl Williamson","Christa Frederick","Christian Armstrong","Christopher Stuart","Chung Krueger","Clare Whitney","Clarissa Archer","Claudio Lam","Cordell Mills","Craig Shepherd","Damien Kramer","Dane Burke","Danielle Stout","Darrel Liu","Darrin Mcneil","Darron Aguilar","Della Huber","Delores Krause","Dena Rosario","Dominick Johnston","Dona Herring","Dorothy Winters","Douglas Wiley","Doyle David","Earlene Hester","Earline Shepherd","Edwin Sparks","Eli Galvan","Elinor Kaufman","Elroy Porter","Elvin Flynn","Emmitt Porter","Erik Parsons","Ethel Forbes","Felicia Ware","Fidel Haynes","Francisco Valenzuela","Frank Hunt","Gabriela Moore","Gabrielle Patrick","Gale Fitzpatrick","Gayle Curtis","Genevieve Lucero","Gerry Oneal","Grady Ellis","Grover Escobar","Hans Patel","Horacio Black","Humberto Compton","Hunter Short","Ilene Mcguire","Imelda Lloyd","Ira Macdonald","Issac Allen","Jacques Velazquez","Janis Mullins","Janna Cowan","Javier Garner","Jayson Abbott","Jeannie Tapia","Jefferson Lee","Jeramy Keith","Jermaine Bradshaw","Jewel Lee","Jimmie Yang","Jodie Wood","John Cline","Josefina Dickerson","Josie Pineda","Judith Griffin","Julius Soto","Kelli Romero","Kerri Joseph","Kim Mccall","Lakeisha Velazquez","Latonya Logan","Lee Schmidt","Lela Atkins","Leland Robertson","Leonardo House","Leroy Mcintyre","Lesley Blevins","Lilia Berg","Lilly Stone","Lincoln Bond","Lindsay Hurst","Lionel Fuller","Lorene Hunter","Louis Kidd","Lucius Warren","Lucy Mejia","Lupe Ingram","Lynette Fuller","Lynnette Wright","Madge Copeland","Madge Tanner","Mae Sawyer","Malcolm Newman","Mamie Wong","Mandy Swanson","Marcella Everett","Marco Bright","Marcos Schaefer","Marcus Hays","Marina Walsh","Marion Savage","Marylou Bass","Marylou Mccarthy","Mathew Howard","Maurice Jacobson","Mauricio Bautista","Max Smith","Melanie Bridges","Melissa Brandt","Merlin Wu","Michel Simpson","Mickey Kennedy","Mike Sloan","Milton Walsh","Mohamed Allison","Mohammad Christensen","Nadia Macdonald","Naomi Snyder","Ned Lowe","Nettie Leonard","Olive Perkins","Ophelia Morrow","Oren Montes","Orlando Henderson","Owen Buchanan","Paul Norman","Rafael Barrett","Raymond Cochran","Reed Hooper","Reinaldo Houston","Renato Simmons","Rene Calhoun","Reva Hardin","Robert French","Robin Bender","Rodolfo Scott","Roland Blake","Roland Sullivan","Rolf Barnett","Ross Marquez","Ruthie Daugherty","Sandra Potts","Scott Stephenson","Scotty Gonzales","Sean Wiggins","Shana Gallagher","Sharron Montes","Sheryl Lindsey","Socorro Hayden","Solomon Andrade","Stacey Whitehead","Stevie Hale","Stuart Oliver","Stuart Riddle","Tammy Merritt","Theo Wiley","Theresa Murillo","Timothy Roberts","Tony Torres","Tracy Logan","Troy Hoover","Twila Rubio","Velma Everett","Vincent Mccormick","Vincenzo Stafford","Vito Clark","Waldo Spencer","Werner Lowe","Werner Shepard","Wesley Ford","Wm Cantu","Zelma Pierce"]
[null,null,null,null,null,"Clare Whitney",{"$f":"IF('Resulting List'!F163=\"\",\"\",'Resulting List'!F163)","v":""},null,{"$f":"TRANSPOSE(_xlfn._xlws.SORT(_xlfn.UNIQUE(_xlfn._xlws.FILTER(Customers[Names],ISNUMBER(SEARCH(Customers[[#This Row],[Search Criteria]],Customers[Names])),\"No data.\"))))","v":"Adriana Todd"},"Albert Ramirez","Alex Rubio","Amanda Beck","Amparo Orozco","Amy Todd","Angelina Roberson","April Fox","Arden Ayala","Arnoldo Pennington","Aubrey Giles","Bette Rivers","Brianna Alexander","Brianna Mora","Britt Vazquez","Broderick Gillespie","Brooke Roman","Calvin Buck","Carmela Mullins","Carol Stevenson","Carolina Russell","Carolyn Roberts","Chelsea Gilbert","Cheryl Williamson","Christa Frederick","Christian Armstrong","Christopher Stuart","Chung Krueger","Clare Whitney","Clarissa Archer","Claudio Lam","Cordell Mills","Craig Shepherd","Damien Kramer","Dane Burke","Danielle Stout","Darrel Liu","Darrin Mcneil","Darron Aguilar","Della Huber","Delores Krause","Dena Rosario","Dominick Johnston","Dona Herring","Dorothy Winters","Douglas Wiley","Doyle David","Earlene Hester","Earline Shepherd","Edwin Sparks","Eli Galvan","Elinor Kaufman","Elroy Porter","Elvin Flynn","Emmitt Porter","Erik Parsons","Ethel Forbes","Felicia Ware","Fidel Haynes","Francisco Valenzuela","Frank Hunt","Gabriela Moore","Gabrielle Patrick","Gale Fitzpatrick","Gayle Curtis","Genevieve Lucero","Gerry Oneal","Grady Ellis","Grover Escobar","Hans Patel","Horacio Black","Humberto Compton","Hunter Short","Ilene Mcguire","Imelda Lloyd","Ira Macdonald","Issac Allen","Jacques Velazquez","Janis Mullins","Janna Cowan","Javier Garner","Jayson Abbott","Jeannie Tapia","Jefferson Lee","Jeramy Keith","Jermaine Bradshaw","Jewel Lee","Jimmie Yang","Jodie Wood","John Cline","Josefina Dickerson","Josie Pineda","Judith Griffin","Julius Soto","Kelli Romero","Kerri Joseph","Kim Mccall","Lakeisha Velazquez","Latonya Logan","Lee Schmidt","Lela Atkins","Leland Robertson","Leonardo House","Leroy Mcintyre","Lesley Blevins","Lilia Berg","Lilly Stone","Lincoln Bond","Lindsay Hurst","Lionel Fuller","Lorene Hunter","Louis Kidd","Lucius Warren","Lucy Mejia","Lupe Ingram","Lynette Fuller","Lynnette Wright","Madge Copeland","Madge Tanner","Mae Sawyer","Malcolm Newman","Mamie Wong","Mandy Swanson","Marcella Everett","Marco Bright","Marcos Schaefer","Marcus Hays","Marina Walsh","Marion Savage","Marylou Bass","Marylou Mccarthy","Mathew Howard","Maurice Jacobson","Mauricio Bautista","Max Smith","Melanie Bridges","Melissa Brandt","Merlin Wu","Michel Simpson","Mickey Kennedy","Mike Sloan","Milton Walsh","Mohamed Allison","Mohammad Christensen","Nadia Macdonald","Naomi Snyder","Ned Lowe","Nettie Leonard","Olive Perkins","Ophelia Morrow","Oren Montes","Orlando Henderson","Owen Buchanan","Paul Norman","Rafael Barrett","Raymond Cochran","Reed Hooper","Reinaldo Houston","Renato Simmons","Rene Calhoun","Reva Hardin","Robert French","Robin Bender","Rodolfo Scott","Roland Blake","Roland Sullivan","Rolf Barnett","Ross Marquez","Ruthie Daugherty","Sandra Potts","Scott Stephenson","Scotty Gonzales","Sean Wiggins","Shana Gallagher","Sharron Montes","Sheryl Lindsey","Socorro Hayden","Solomon Andrade","Stacey Whitehead","Stevie Hale","Stuart Oliver","Stuart Riddle","Tammy Merritt","Theo Wiley","Theresa Murillo","Timothy Roberts","Tony Torres","Tracy Logan","Troy Hoover","Twila Rubio","Velma Everett","Vincent Mccormick","Vincenzo Stafford","Vito Clark","Waldo Spencer","Werner Lowe","Werner Shepard","Wesley Ford","Wm Cantu","Zelma Pierce"]
[null,null,null,null,null,"Milton Walsh",{"$f":"IF('Resulting List'!F164=\"\",\"\",'Resulting List'!F164)","v":""},null,{"$f":"TRANSPOSE(_xlfn._xlws.SORT(_xlfn.UNIQUE(_xlfn._xlws.FILTER(Customers[Names],ISNUMBER(SEARCH(Customers[[#This Row],[Search Criteria]],Customers[Names])),\"No data.\"))))","v":"Adriana Todd"},"Albert Ramirez","Alex Rubio","Amanda Beck","Amparo Orozco","Amy Todd","Angelina Roberson","April Fox","Arden Ayala","Arnoldo Pennington","Aubrey Giles","Bette Rivers","Brianna Alexander","Brianna Mora","Britt Vazquez","Broderick Gillespie","Brooke Roman","Calvin Buck","Carmela Mullins","Carol Stevenson","Carolina Russell","Carolyn Roberts","Chelsea Gilbert","Cheryl Williamson","Christa Frederick","Christian Armstrong","Christopher Stuart","Chung Krueger","Clare Whitney","Clarissa Archer","Claudio Lam","Cordell Mills","Craig Shepherd","Damien Kramer","Dane Burke","Danielle Stout","Darrel Liu","Darrin Mcneil","Darron Aguilar","Della Huber","Delores Krause","Dena Rosario","Dominick Johnston","Dona Herring","Dorothy Winters","Douglas Wiley","Doyle David","Earlene Hester","Earline Shepherd","Edwin Sparks","Eli Galvan","Elinor Kaufman","Elroy Porter","Elvin Flynn","Emmitt Porter","Erik Parsons","Ethel Forbes","Felicia Ware","Fidel Haynes","Francisco Valenzuela","Frank Hunt","Gabriela Moore","Gabrielle Patrick","Gale Fitzpatrick","Gayle Curtis","Genevieve Lucero","Gerry Oneal","Grady Ellis","Grover Escobar","Hans Patel","Horacio Black","Humberto Compton","Hunter Short","Ilene Mcguire","Imelda Lloyd","Ira Macdonald","Issac Allen","Jacques Velazquez","Janis Mullins","Janna Cowan","Javier Garner","Jayson Abbott","Jeannie Tapia","Jefferson Lee","Jeramy Keith","Jermaine Bradshaw","Jewel Lee","Jimmie Yang","Jodie Wood","John Cline","Josefina Dickerson","Josie Pineda","Judith Griffin","Julius Soto","Kelli Romero","Kerri Joseph","Kim Mccall","Lakeisha Velazquez","Latonya Logan","Lee Schmidt","Lela Atkins","Leland Robertson","Leonardo House","Leroy Mcintyre","Lesley Blevins","Lilia Berg","Lilly Stone","Lincoln Bond","Lindsay Hurst","Lionel Fuller","Lorene Hunter","Louis Kidd","Lucius Warren","Lucy Mejia","Lupe Ingram","Lynette Fuller","Lynnette Wright","Madge Copeland","Madge Tanner","Mae Sawyer","Malcolm Newman","Mamie Wong","Mandy Swanson","Marcella Everett","Marco Bright","Marcos Schaefer","Marcus Hays","Marina Walsh","Marion Savage","Marylou Bass","Marylou Mccarthy","Mathew Howard","Maurice Jacobson","Mauricio Bautista","Max Smith","Melanie Bridges","Melissa Brandt","Merlin Wu","Michel Simpson","Mickey Kennedy","Mike Sloan","Milton Walsh","Mohamed Allison","Mohammad Christensen","Nadia Macdonald","Naomi Snyder","Ned Lowe","Nettie Leonard","Olive Perkins","Ophelia Morrow","Oren Montes","Orlando Henderson","Owen Buchanan","Paul Norman","Rafael Barrett","Raymond Cochran","Reed Hooper","Reinaldo Houston","Renato Simmons","Rene Calhoun","Reva Hardin","Robert French","Robin Bender","Rodolfo Scott","Roland Blake","Roland Sullivan","Rolf Barnett","Ross Marquez","Ruthie Daugherty","Sandra Potts","Scott Stephenson","Scotty Gonzales","Sean Wiggins","Shana Gallagher","Sharron Montes","Sheryl Lindsey","Socorro Hayden","Solomon Andrade","Stacey Whitehead","Stevie Hale","Stuart Oliver","Stuart Riddle","Tammy Merritt","Theo Wiley","Theresa Murillo","Timothy Roberts","Tony Torres","Tracy Logan","Troy Hoover","Twila Rubio","Velma Everett","Vincent Mccormick","Vincenzo Stafford","Vito Clark","Waldo Spencer","Werner Lowe","Werner Shepard","Wesley Ford","Wm Cantu","Zelma Pierce"]
[null,null,null,null,null,"Douglas Wiley",{"$f":"IF('Resulting List'!F165=\"\",\"\",'Resulting List'!F165)","v":""},null,{"$f":"TRANSPOSE(_xlfn._xlws.SORT(_xlfn.UNIQUE(_xlfn._xlws.FILTER(Customers[Names],ISNUMBER(SEARCH(Customers[[#This Row],[Search Criteria]],Customers[Names])),\"No data.\"))))","v":"Adriana Todd"},"Albert Ramirez","Alex Rubio","Amanda Beck","Amparo Orozco","Amy Todd","Angelina Roberson","April Fox","Arden Ayala","Arnoldo Pennington","Aubrey Giles","Bette Rivers","Brianna Alexander","Brianna Mora","Britt Vazquez","Broderick Gillespie","Brooke Roman","Calvin Buck","Carmela Mullins","Carol Stevenson","Carolina Russell","Carolyn Roberts","Chelsea Gilbert","Cheryl Williamson","Christa Frederick","Christian Armstrong","Christopher Stuart","Chung Krueger","Clare Whitney","Clarissa Archer","Claudio Lam","Cordell Mills","Craig Shepherd","Damien Kramer","Dane Burke","Danielle Stout","Darrel Liu","Darrin Mcneil","Darron Aguilar","Della Huber","Delores Krause","Dena Rosario","Dominick Johnston","Dona Herring","Dorothy Winters","Douglas Wiley","Doyle David","Earlene Hester","Earline Shepherd","Edwin Sparks","Eli Galvan","Elinor Kaufman","Elroy Porter","Elvin Flynn","Emmitt Porter","Erik Parsons","Ethel Forbes","Felicia Ware","Fidel Haynes","Francisco Valenzuela","Frank Hunt","Gabriela Moore","Gabrielle Patrick","Gale Fitzpatrick","Gayle Curtis","Genevieve Lucero","Gerry Oneal","Grady Ellis","Grover Escobar","Hans Patel","Horacio Black","Humberto Compton","Hunter Short","Ilene Mcguire","Imelda Lloyd","Ira Macdonald","Issac Allen","Jacques Velazquez","Janis Mullins","Janna Cowan","Javier Garner","Jayson Abbott","Jeannie Tapia","Jefferson Lee","Jeramy Keith","Jermaine Bradshaw","Jewel Lee","Jimmie Yang","Jodie Wood","John Cline","Josefina Dickerson","Josie Pineda","Judith Griffin","Julius Soto","Kelli Romero","Kerri Joseph","Kim Mccall","Lakeisha Velazquez","Latonya Logan","Lee Schmidt","Lela Atkins","Leland Robertson","Leonardo House","Leroy Mcintyre","Lesley Blevins","Lilia Berg","Lilly Stone","Lincoln Bond","Lindsay Hurst","Lionel Fuller","Lorene Hunter","Louis Kidd","Lucius Warren","Lucy Mejia","Lupe Ingram","Lynette Fuller","Lynnette Wright","Madge Copeland","Madge Tanner","Mae Sawyer","Malcolm Newman","Mamie Wong","Mandy Swanson","Marcella Everett","Marco Bright","Marcos Schaefer","Marcus Hays","Marina Walsh","Marion Savage","Marylou Bass","Marylou Mccarthy","Mathew Howard","Maurice Jacobson","Mauricio Bautista","Max Smith","Melanie Bridges","Melissa Brandt","Merlin Wu","Michel Simpson","Mickey Kennedy","Mike Sloan","Milton Walsh","Mohamed Allison","Mohammad Christensen","Nadia Macdonald","Naomi Snyder","Ned Lowe","Nettie Leonard","Olive Perkins","Ophelia Morrow","Oren Montes","Orlando Henderson","Owen Buchanan","Paul Norman","Rafael Barrett","Raymond Cochran","Reed Hooper","Reinaldo Houston","Renato Simmons","Rene Calhoun","Reva Hardin","Robert French","Robin Bender","Rodolfo Scott","Roland Blake","Roland Sullivan","Rolf Barnett","Ross Marquez","Ruthie Daugherty","Sandra Potts","Scott Stephenson","Scotty Gonzales","Sean Wiggins","Shana Gallagher","Sharron Montes","Sheryl Lindsey","Socorro Hayden","Solomon Andrade","Stacey Whitehead","Stevie Hale","Stuart Oliver","Stuart Riddle","Tammy Merritt","Theo Wiley","Theresa Murillo","Timothy Roberts","Tony Torres","Tracy Logan","Troy Hoover","Twila Rubio","Velma Everett","Vincent Mccormick","Vincenzo Stafford","Vito Clark","Waldo Spencer","Werner Lowe","Werner Shepard","Wesley Ford","Wm Cantu","Zelma Pierce"]
[null,null,null,null,null,"Stuart Oliver",{"$f":"IF('Resulting List'!F166=\"\",\"\",'Resulting List'!F166)","v":""},null,{"$f":"TRANSPOSE(_xlfn._xlws.SORT(_xlfn.UNIQUE(_xlfn._xlws.FILTER(Customers[Names],ISNUMBER(SEARCH(Customers[[#This Row],[Search Criteria]],Customers[Names])),\"No data.\"))))","v":"Adriana Todd"},"Albert Ramirez","Alex Rubio","Amanda Beck","Amparo Orozco","Amy Todd","Angelina Roberson","April Fox","Arden Ayala","Arnoldo Pennington","Aubrey Giles","Bette Rivers","Brianna Alexander","Brianna Mora","Britt Vazquez","Broderick Gillespie","Brooke Roman","Calvin Buck","Carmela Mullins","Carol Stevenson","Carolina Russell","Carolyn Roberts","Chelsea Gilbert","Cheryl Williamson","Christa Frederick","Christian Armstrong","Christopher Stuart","Chung Krueger","Clare Whitney","Clarissa Archer","Claudio Lam","Cordell Mills","Craig Shepherd","Damien Kramer","Dane Burke","Danielle Stout","Darrel Liu","Darrin Mcneil","Darron Aguilar","Della Huber","Delores Krause","Dena Rosario","Dominick Johnston","Dona Herring","Dorothy Winters","Douglas Wiley","Doyle David","Earlene Hester","Earline Shepherd","Edwin Sparks","Eli Galvan","Elinor Kaufman","Elroy Porter","Elvin Flynn","Emmitt Porter","Erik Parsons","Ethel Forbes","Felicia Ware","Fidel Haynes","Francisco Valenzuela","Frank Hunt","Gabriela Moore","Gabrielle Patrick","Gale Fitzpatrick","Gayle Curtis","Genevieve Lucero","Gerry Oneal","Grady Ellis","Grover Escobar","Hans Patel","Horacio Black","Humberto Compton","Hunter Short","Ilene Mcguire","Imelda Lloyd","Ira Macdonald","Issac Allen","Jacques Velazquez","Janis Mullins","Janna Cowan","Javier Garner","Jayson Abbott","Jeannie Tapia","Jefferson Lee","Jeramy Keith","Jermaine Bradshaw","Jewel Lee","Jimmie Yang","Jodie Wood","John Cline","Josefina Dickerson","Josie Pineda","Judith Griffin","Julius Soto","Kelli Romero","Kerri Joseph","Kim Mccall","Lakeisha Velazquez","Latonya Logan","Lee Schmidt","Lela Atkins","Leland Robertson","Leonardo House","Leroy Mcintyre","Lesley Blevins","Lilia Berg","Lilly Stone","Lincoln Bond","Lindsay Hurst","Lionel Fuller","Lorene Hunter","Louis Kidd","Lucius Warren","Lucy Mejia","Lupe Ingram","Lynette Fuller","Lynnette Wright","Madge Copeland","Madge Tanner","Mae Sawyer","Malcolm Newman","Mamie Wong","Mandy Swanson","Marcella Everett","Marco Bright","Marcos Schaefer","Marcus Hays","Marina Walsh","Marion Savage","Marylou Bass","Marylou Mccarthy","Mathew Howard","Maurice Jacobson","Mauricio Bautista","Max Smith","Melanie Bridges","Melissa Brandt","Merlin Wu","Michel Simpson","Mickey Kennedy","Mike Sloan","Milton Walsh","Mohamed Allison","Mohammad Christensen","Nadia Macdonald","Naomi Snyder","Ned Lowe","Nettie Leonard","Olive Perkins","Ophelia Morrow","Oren Montes","Orlando Henderson","Owen Buchanan","Paul Norman","Rafael Barrett","Raymond Cochran","Reed Hooper","Reinaldo Houston","Renato Simmons","Rene Calhoun","Reva Hardin","Robert French","Robin Bender","Rodolfo Scott","Roland Blake","Roland Sullivan","Rolf Barnett","Ross Marquez","Ruthie Daugherty","Sandra Potts","Scott Stephenson","Scotty Gonzales","Sean Wiggins","Shana Gallagher","Sharron Montes","Sheryl Lindsey","Socorro Hayden","Solomon Andrade","Stacey Whitehead","Stevie Hale","Stuart Oliver","Stuart Riddle","Tammy Merritt","Theo Wiley","Theresa Murillo","Timothy Roberts","Tony Torres","Tracy Logan","Troy Hoover","Twila Rubio","Velma Everett","Vincent Mccormick","Vincenzo Stafford","Vito Clark","Waldo Spencer","Werner Lowe","Werner Shepard","Wesley Ford","Wm Cantu","Zelma Pierce"]
[null,null,null,null,null,"Bette Rivers",{"$f":"IF('Resulting List'!F167=\"\",\"\",'Resulting List'!F167)","v":""},null,{"$f":"TRANSPOSE(_xlfn._xlws.SORT(_xlfn.UNIQUE(_xlfn._xlws.FILTER(Customers[Names],ISNUMBER(SEARCH(Customers[[#This Row],[Search Criteria]],Customers[Names])),\"No data.\"))))","v":"Adriana Todd"},"Albert Ramirez","Alex Rubio","Amanda Beck","Amparo Orozco","Amy Todd","Angelina Roberson","April Fox","Arden Ayala","Arnoldo Pennington","Aubrey Giles","Bette Rivers","Brianna Alexander","Brianna Mora","Britt Vazquez","Broderick Gillespie","Brooke Roman","Calvin Buck","Carmela Mullins","Carol Stevenson","Carolina Russell","Carolyn Roberts","Chelsea Gilbert","Cheryl Williamson","Christa Frederick","Christian Armstrong","Christopher Stuart","Chung Krueger","Clare Whitney","Clarissa Archer","Claudio Lam","Cordell Mills","Craig Shepherd","Damien Kramer","Dane Burke","Danielle Stout","Darrel Liu","Darrin Mcneil","Darron Aguilar","Della Huber","Delores Krause","Dena Rosario","Dominick Johnston","Dona Herring","Dorothy Winters","Douglas Wiley","Doyle David","Earlene Hester","Earline Shepherd","Edwin Sparks","Eli Galvan","Elinor Kaufman","Elroy Porter","Elvin Flynn","Emmitt Porter","Erik Parsons","Ethel Forbes","Felicia Ware","Fidel Haynes","Francisco Valenzuela","Frank Hunt","Gabriela Moore","Gabrielle Patrick","Gale Fitzpatrick","Gayle Curtis","Genevieve Lucero","Gerry Oneal","Grady Ellis","Grover Escobar","Hans Patel","Horacio Black","Humberto Compton","Hunter Short","Ilene Mcguire","Imelda Lloyd","Ira Macdonald","Issac Allen","Jacques Velazquez","Janis Mullins","Janna Cowan","Javier Garner","Jayson Abbott","Jeannie Tapia","Jefferson Lee","Jeramy Keith","Jermaine Bradshaw","Jewel Lee","Jimmie Yang","Jodie Wood","John Cline","Josefina Dickerson","Josie Pineda","Judith Griffin","Julius Soto","Kelli Romero","Kerri Joseph","Kim Mccall","Lakeisha Velazquez","Latonya Logan","Lee Schmidt","Lela Atkins","Leland Robertson","Leonardo House","Leroy Mcintyre","Lesley Blevins","Lilia Berg","Lilly Stone","Lincoln Bond","Lindsay Hurst","Lionel Fuller","Lorene Hunter","Louis Kidd","Lucius Warren","Lucy Mejia","Lupe Ingram","Lynette Fuller","Lynnette Wright","Madge Copeland","Madge Tanner","Mae Sawyer","Malcolm Newman","Mamie Wong","Mandy Swanson","Marcella Everett","Marco Bright","Marcos Schaefer","Marcus Hays","Marina Walsh","Marion Savage","Marylou Bass","Marylou Mccarthy","Mathew Howard","Maurice Jacobson","Mauricio Bautista","Max Smith","Melanie Bridges","Melissa Brandt","Merlin Wu","Michel Simpson","Mickey Kennedy","Mike Sloan","Milton Walsh","Mohamed Allison","Mohammad Christensen","Nadia Macdonald","Naomi Snyder","Ned Lowe","Nettie Leonard","Olive Perkins","Ophelia Morrow","Oren Montes","Orlando Henderson","Owen Buchanan","Paul Norman","Rafael Barrett","Raymond Cochran","Reed Hooper","Reinaldo Houston","Renato Simmons","Rene Calhoun","Reva Hardin","Robert French","Robin Bender","Rodolfo Scott","Roland Blake","Roland Sullivan","Rolf Barnett","Ross Marquez","Ruthie Daugherty","Sandra Potts","Scott Stephenson","Scotty Gonzales","Sean Wiggins","Shana Gallagher","Sharron Montes","Sheryl Lindsey","Socorro Hayden","Solomon Andrade","Stacey Whitehead","Stevie Hale","Stuart Oliver","Stuart Riddle","Tammy Merritt","Theo Wiley","Theresa Murillo","Timothy Roberts","Tony Torres","Tracy Logan","Troy Hoover","Twila Rubio","Velma Everett","Vincent Mccormick","Vincenzo Stafford","Vito Clark","Waldo Spencer","Werner Lowe","Werner Shepard","Wesley Ford","Wm Cantu","Zelma Pierce"]
[null,null,null,null,null,"Leland Robertson",{"$f":"IF('Resulting List'!F168=\"\",\"\",'Resulting List'!F168)","v":""},null,{"$f":"TRANSPOSE(_xlfn._xlws.SORT(_xlfn.UNIQUE(_xlfn._xlws.FILTER(Customers[Names],ISNUMBER(SEARCH(Customers[[#This Row],[Search Criteria]],Customers[Names])),\"No data.\"))))","v":"Adriana Todd"},"Albert Ramirez","Alex Rubio","Amanda Beck","Amparo Orozco","Amy Todd","Angelina Roberson","April Fox","Arden Ayala","Arnoldo Pennington","Aubrey Giles","Bette Rivers","Brianna Alexander","Brianna Mora","Britt Vazquez","Broderick Gillespie","Brooke Roman","Calvin Buck","Carmela Mullins","Carol Stevenson","Carolina Russell","Carolyn Roberts","Chelsea Gilbert","Cheryl Williamson","Christa Frederick","Christian Armstrong","Christopher Stuart","Chung Krueger","Clare Whitney","Clarissa Archer","Claudio Lam","Cordell Mills","Craig Shepherd","Damien Kramer","Dane Burke","Danielle Stout","Darrel Liu","Darrin Mcneil","Darron Aguilar","Della Huber","Delores Krause","Dena Rosario","Dominick Johnston","Dona Herring","Dorothy Winters","Douglas Wiley","Doyle David","Earlene Hester","Earline Shepherd","Edwin Sparks","Eli Galvan","Elinor Kaufman","Elroy Porter","Elvin Flynn","Emmitt Porter","Erik Parsons","Ethel Forbes","Felicia Ware","Fidel Haynes","Francisco Valenzuela","Frank Hunt","Gabriela Moore","Gabrielle Patrick","Gale Fitzpatrick","Gayle Curtis","Genevieve Lucero","Gerry Oneal","Grady Ellis","Grover Escobar","Hans Patel","Horacio Black","Humberto Compton","Hunter Short","Ilene Mcguire","Imelda Lloyd","Ira Macdonald","Issac Allen","Jacques Velazquez","Janis Mullins","Janna Cowan","Javier Garner","Jayson Abbott","Jeannie Tapia","Jefferson Lee","Jeramy Keith","Jermaine Bradshaw","Jewel Lee","Jimmie Yang","Jodie Wood","John Cline","Josefina Dickerson","Josie Pineda","Judith Griffin","Julius Soto","Kelli Romero","Kerri Joseph","Kim Mccall","Lakeisha Velazquez","Latonya Logan","Lee Schmidt","Lela Atkins","Leland Robertson","Leonardo House","Leroy Mcintyre","Lesley Blevins","Lilia Berg","Lilly Stone","Lincoln Bond","Lindsay Hurst","Lionel Fuller","Lorene Hunter","Louis Kidd","Lucius Warren","Lucy Mejia","Lupe Ingram","Lynette Fuller","Lynnette Wright","Madge Copeland","Madge Tanner","Mae Sawyer","Malcolm Newman","Mamie Wong","Mandy Swanson","Marcella Everett","Marco Bright","Marcos Schaefer","Marcus Hays","Marina Walsh","Marion Savage","Marylou Bass","Marylou Mccarthy","Mathew Howard","Maurice Jacobson","Mauricio Bautista","Max Smith","Melanie Bridges","Melissa Brandt","Merlin Wu","Michel Simpson","Mickey Kennedy","Mike Sloan","Milton Walsh","Mohamed Allison","Mohammad Christensen","Nadia Macdonald","Naomi Snyder","Ned Lowe","Nettie Leonard","Olive Perkins","Ophelia Morrow","Oren Montes","Orlando Henderson","Owen Buchanan","Paul Norman","Rafael Barrett","Raymond Cochran","Reed Hooper","Reinaldo Houston","Renato Simmons","Rene Calhoun","Reva Hardin","Robert French","Robin Bender","Rodolfo Scott","Roland Blake","Roland Sullivan","Rolf Barnett","Ross Marquez","Ruthie Daugherty","Sandra Potts","Scott Stephenson","Scotty Gonzales","Sean Wiggins","Shana Gallagher","Sharron Montes","Sheryl Lindsey","Socorro Hayden","Solomon Andrade","Stacey Whitehead","Stevie Hale","Stuart Oliver","Stuart Riddle","Tammy Merritt","Theo Wiley","Theresa Murillo","Timothy Roberts","Tony Torres","Tracy Logan","Troy Hoover","Twila Rubio","Velma Everett","Vincent Mccormick","Vincenzo Stafford","Vito Clark","Waldo Spencer","Werner Lowe","Werner Shepard","Wesley Ford","Wm Cantu","Zelma Pierce"]
[null,null,null,null,null,"Werner Lowe",{"$f":"IF('Resulting List'!F169=\"\",\"\",'Resulting List'!F169)","v":""},null,{"$f":"TRANSPOSE(_xlfn._xlws.SORT(_xlfn.UNIQUE(_xlfn._xlws.FILTER(Customers[Names],ISNUMBER(SEARCH(Customers[[#This Row],[Search Criteria]],Customers[Names])),\"No data.\"))))","v":"Adriana Todd"},"Albert Ramirez","Alex Rubio","Amanda Beck","Amparo Orozco","Amy Todd","Angelina Roberson","April Fox","Arden Ayala","Arnoldo Pennington","Aubrey Giles","Bette Rivers","Brianna Alexander","Brianna Mora","Britt Vazquez","Broderick Gillespie","Brooke Roman","Calvin Buck","Carmela Mullins","Carol Stevenson","Carolina Russell","Carolyn Roberts","Chelsea Gilbert","Cheryl Williamson","Christa Frederick","Christian Armstrong","Christopher Stuart","Chung Krueger","Clare Whitney","Clarissa Archer","Claudio Lam","Cordell Mills","Craig Shepherd","Damien Kramer","Dane Burke","Danielle Stout","Darrel Liu","Darrin Mcneil","Darron Aguilar","Della Huber","Delores Krause","Dena Rosario","Dominick Johnston","Dona Herring","Dorothy Winters","Douglas Wiley","Doyle David","Earlene Hester","Earline Shepherd","Edwin Sparks","Eli Galvan","Elinor Kaufman","Elroy Porter","Elvin Flynn","Emmitt Porter","Erik Parsons","Ethel Forbes","Felicia Ware","Fidel Haynes","Francisco Valenzuela","Frank Hunt","Gabriela Moore","Gabrielle Patrick","Gale Fitzpatrick","Gayle Curtis","Genevieve Lucero","Gerry Oneal","Grady Ellis","Grover Escobar","Hans Patel","Horacio Black","Humberto Compton","Hunter Short","Ilene Mcguire","Imelda Lloyd","Ira Macdonald","Issac Allen","Jacques Velazquez","Janis Mullins","Janna Cowan","Javier Garner","Jayson Abbott","Jeannie Tapia","Jefferson Lee","Jeramy Keith","Jermaine Bradshaw","Jewel Lee","Jimmie Yang","Jodie Wood","John Cline","Josefina Dickerson","Josie Pineda","Judith Griffin","Julius Soto","Kelli Romero","Kerri Joseph","Kim Mccall","Lakeisha Velazquez","Latonya Logan","Lee Schmidt","Lela Atkins","Leland Robertson","Leonardo House","Leroy Mcintyre","Lesley Blevins","Lilia Berg","Lilly Stone","Lincoln Bond","Lindsay Hurst","Lionel Fuller","Lorene Hunter","Louis Kidd","Lucius Warren","Lucy Mejia","Lupe Ingram","Lynette Fuller","Lynnette Wright","Madge Copeland","Madge Tanner","Mae Sawyer","Malcolm Newman","Mamie Wong","Mandy Swanson","Marcella Everett","Marco Bright","Marcos Schaefer","Marcus Hays","Marina Walsh","Marion Savage","Marylou Bass","Marylou Mccarthy","Mathew Howard","Maurice Jacobson","Mauricio Bautista","Max Smith","Melanie Bridges","Melissa Brandt","Merlin Wu","Michel Simpson","Mickey Kennedy","Mike Sloan","Milton Walsh","Mohamed Allison","Mohammad Christensen","Nadia Macdonald","Naomi Snyder","Ned Lowe","Nettie Leonard","Olive Perkins","Ophelia Morrow","Oren Montes","Orlando Henderson","Owen Buchanan","Paul Norman","Rafael Barrett","Raymond Cochran","Reed Hooper","Reinaldo Houston","Renato Simmons","Rene Calhoun","Reva Hardin","Robert French","Robin Bender","Rodolfo Scott","Roland Blake","Roland Sullivan","Rolf Barnett","Ross Marquez","Ruthie Daugherty","Sandra Potts","Scott Stephenson","Scotty Gonzales","Sean Wiggins","Shana Gallagher","Sharron Montes","Sheryl Lindsey","Socorro Hayden","Solomon Andrade","Stacey Whitehead","Stevie Hale","Stuart Oliver","Stuart Riddle","Tammy Merritt","Theo Wiley","Theresa Murillo","Timothy Roberts","Tony Torres","Tracy Logan","Troy Hoover","Twila Rubio","Velma Everett","Vincent Mccormick","Vincenzo Stafford","Vito Clark","Waldo Spencer","Werner Lowe","Werner Shepard","Wesley Ford","Wm Cantu","Zelma Pierce"]
[null,null,null,null,null,"Jeramy Keith",{"$f":"IF('Resulting List'!F170=\"\",\"\",'Resulting List'!F170)","v":""},null,{"$f":"TRANSPOSE(_xlfn._xlws.SORT(_xlfn.UNIQUE(_xlfn._xlws.FILTER(Customers[Names],ISNUMBER(SEARCH(Customers[[#This Row],[Search Criteria]],Customers[Names])),\"No data.\"))))","v":"Adriana Todd"},"Albert Ramirez","Alex Rubio","Amanda Beck","Amparo Orozco","Amy Todd","Angelina Roberson","April Fox","Arden Ayala","Arnoldo Pennington","Aubrey Giles","Bette Rivers","Brianna Alexander","Brianna Mora","Britt Vazquez","Broderick Gillespie","Brooke Roman","Calvin Buck","Carmela Mullins","Carol Stevenson","Carolina Russell","Carolyn Roberts","Chelsea Gilbert","Cheryl Williamson","Christa Frederick","Christian Armstrong","Christopher Stuart","Chung Krueger","Clare Whitney","Clarissa Archer","Claudio Lam","Cordell Mills","Craig Shepherd","Damien Kramer","Dane Burke","Danielle Stout","Darrel Liu","Darrin Mcneil","Darron Aguilar","Della Huber","Delores Krause","Dena Rosario","Dominick Johnston","Dona Herring","Dorothy Winters","Douglas Wiley","Doyle David","Earlene Hester","Earline Shepherd","Edwin Sparks","Eli Galvan","Elinor Kaufman","Elroy Porter","Elvin Flynn","Emmitt Porter","Erik Parsons","Ethel Forbes","Felicia Ware","Fidel Haynes","Francisco Valenzuela","Frank Hunt","Gabriela Moore","Gabrielle Patrick","Gale Fitzpatrick","Gayle Curtis","Genevieve Lucero","Gerry Oneal","Grady Ellis","Grover Escobar","Hans Patel","Horacio Black","Humberto Compton","Hunter Short","Ilene Mcguire","Imelda Lloyd","Ira Macdonald","Issac Allen","Jacques Velazquez","Janis Mullins","Janna Cowan","Javier Garner","Jayson Abbott","Jeannie Tapia","Jefferson Lee","Jeramy Keith","Jermaine Bradshaw","Jewel Lee","Jimmie Yang","Jodie Wood","John Cline","Josefina Dickerson","Josie Pineda","Judith Griffin","Julius Soto","Kelli Romero","Kerri Joseph","Kim Mccall","Lakeisha Velazquez","Latonya Logan","Lee Schmidt","Lela Atkins","Leland Robertson","Leonardo House","Leroy Mcintyre","Lesley Blevins","Lilia Berg","Lilly Stone","Lincoln Bond","Lindsay Hurst","Lionel Fuller","Lorene Hunter","Louis Kidd","Lucius Warren","Lucy Mejia","Lupe Ingram","Lynette Fuller","Lynnette Wright","Madge Copeland","Madge Tanner","Mae Sawyer","Malcolm Newman","Mamie Wong","Mandy Swanson","Marcella Everett","Marco Bright","Marcos Schaefer","Marcus Hays","Marina Walsh","Marion Savage","Marylou Bass","Marylou Mccarthy","Mathew Howard","Maurice Jacobson","Mauricio Bautista","Max Smith","Melanie Bridges","Melissa Brandt","Merlin Wu","Michel Simpson","Mickey Kennedy","Mike Sloan","Milton Walsh","Mohamed Allison","Mohammad Christensen","Nadia Macdonald","Naomi Snyder","Ned Lowe","Nettie Leonard","Olive Perkins","Ophelia Morrow","Oren Montes","Orlando Henderson","Owen Buchanan","Paul Norman","Rafael Barrett","Raymond Cochran","Reed Hooper","Reinaldo Houston","Renato Simmons","Rene Calhoun","Reva Hardin","Robert French","Robin Bender","Rodolfo Scott","Roland Blake","Roland Sullivan","Rolf Barnett","Ross Marquez","Ruthie Daugherty","Sandra Potts","Scott Stephenson","Scotty Gonzales","Sean Wiggins","Shana Gallagher","Sharron Montes","Sheryl Lindsey","Socorro Hayden","Solomon Andrade","Stacey Whitehead","Stevie Hale","Stuart Oliver","Stuart Riddle","Tammy Merritt","Theo Wiley","Theresa Murillo","Timothy Roberts","Tony Torres","Tracy Logan","Troy Hoover","Twila Rubio","Velma Everett","Vincent Mccormick","Vincenzo Stafford","Vito Clark","Waldo Spencer","Werner Lowe","Werner Shepard","Wesley Ford","Wm Cantu","Zelma Pierce"]
[null,null,null,null,null,"Felicia Ware",{"$f":"IF('Resulting List'!F171=\"\",\"\",'Resulting List'!F171)","v":""},null,{"$f":"TRANSPOSE(_xlfn._xlws.SORT(_xlfn.UNIQUE(_xlfn._xlws.FILTER(Customers[Names],ISNUMBER(SEARCH(Customers[[#This Row],[Search Criteria]],Customers[Names])),\"No data.\"))))","v":"Adriana Todd"},"Albert Ramirez","Alex Rubio","Amanda Beck","Amparo Orozco","Amy Todd","Angelina Roberson","April Fox","Arden Ayala","Arnoldo Pennington","Aubrey Giles","Bette Rivers","Brianna Alexander","Brianna Mora","Britt Vazquez","Broderick Gillespie","Brooke Roman","Calvin Buck","Carmela Mullins","Carol Stevenson","Carolina Russell","Carolyn Roberts","Chelsea Gilbert","Cheryl Williamson","Christa Frederick","Christian Armstrong","Christopher Stuart","Chung Krueger","Clare Whitney","Clarissa Archer","Claudio Lam","Cordell Mills","Craig Shepherd","Damien Kramer","Dane Burke","Danielle Stout","Darrel Liu","Darrin Mcneil","Darron Aguilar","Della Huber","Delores Krause","Dena Rosario","Dominick Johnston","Dona Herring","Dorothy Winters","Douglas Wiley","Doyle David","Earlene Hester","Earline Shepherd","Edwin Sparks","Eli Galvan","Elinor Kaufman","Elroy Porter","Elvin Flynn","Emmitt Porter","Erik Parsons","Ethel Forbes","Felicia Ware","Fidel Haynes","Francisco Valenzuela","Frank Hunt","Gabriela Moore","Gabrielle Patrick","Gale Fitzpatrick","Gayle Curtis","Genevieve Lucero","Gerry Oneal","Grady Ellis","Grover Escobar","Hans Patel","Horacio Black","Humberto Compton","Hunter Short","Ilene Mcguire","Imelda Lloyd","Ira Macdonald","Issac Allen","Jacques Velazquez","Janis Mullins","Janna Cowan","Javier Garner","Jayson Abbott","Jeannie Tapia","Jefferson Lee","Jeramy Keith","Jermaine Bradshaw","Jewel Lee","Jimmie Yang","Jodie Wood","John Cline","Josefina Dickerson","Josie Pineda","Judith Griffin","Julius Soto","Kelli Romero","Kerri Joseph","Kim Mccall","Lakeisha Velazquez","Latonya Logan","Lee Schmidt","Lela Atkins","Leland Robertson","Leonardo House","Leroy Mcintyre","Lesley Blevins","Lilia Berg","Lilly Stone","Lincoln Bond","Lindsay Hurst","Lionel Fuller","Lorene Hunter","Louis Kidd","Lucius Warren","Lucy Mejia","Lupe Ingram","Lynette Fuller","Lynnette Wright","Madge Copeland","Madge Tanner","Mae Sawyer","Malcolm Newman","Mamie Wong","Mandy Swanson","Marcella Everett","Marco Bright","Marcos Schaefer","Marcus Hays","Marina Walsh","Marion Savage","Marylou Bass","Marylou Mccarthy","Mathew Howard","Maurice Jacobson","Mauricio Bautista","Max Smith","Melanie Bridges","Melissa Brandt","Merlin Wu","Michel Simpson","Mickey Kennedy","Mike Sloan","Milton Walsh","Mohamed Allison","Mohammad Christensen","Nadia Macdonald","Naomi Snyder","Ned Lowe","Nettie Leonard","Olive Perkins","Ophelia Morrow","Oren Montes","Orlando Henderson","Owen Buchanan","Paul Norman","Rafael Barrett","Raymond Cochran","Reed Hooper","Reinaldo Houston","Renato Simmons","Rene Calhoun","Reva Hardin","Robert French","Robin Bender","Rodolfo Scott","Roland Blake","Roland Sullivan","Rolf Barnett","Ross Marquez","Ruthie Daugherty","Sandra Potts","Scott Stephenson","Scotty Gonzales","Sean Wiggins","Shana Gallagher","Sharron Montes","Sheryl Lindsey","Socorro Hayden","Solomon Andrade","Stacey Whitehead","Stevie Hale","Stuart Oliver","Stuart Riddle","Tammy Merritt","Theo Wiley","Theresa Murillo","Timothy Roberts","Tony Torres","Tracy Logan","Troy Hoover","Twila Rubio","Velma Everett","Vincent Mccormick","Vincenzo Stafford","Vito Clark","Waldo Spencer","Werner Lowe","Werner Shepard","Wesley Ford","Wm Cantu","Zelma Pierce"]
[null,null,null,null,null,"Merlin Wu",{"$f":"IF('Resulting List'!F172=\"\",\"\",'Resulting List'!F172)","v":""},null,{"$f":"TRANSPOSE(_xlfn._xlws.SORT(_xlfn.UNIQUE(_xlfn._xlws.FILTER(Customers[Names],ISNUMBER(SEARCH(Customers[[#This Row],[Search Criteria]],Customers[Names])),\"No data.\"))))","v":"Adriana Todd"},"Albert Ramirez","Alex Rubio","Amanda Beck","Amparo Orozco","Amy Todd","Angelina Roberson","April Fox","Arden Ayala","Arnoldo Pennington","Aubrey Giles","Bette Rivers","Brianna Alexander","Brianna Mora","Britt Vazquez","Broderick Gillespie","Brooke Roman","Calvin Buck","Carmela Mullins","Carol Stevenson","Carolina Russell","Carolyn Roberts","Chelsea Gilbert","Cheryl Williamson","Christa Frederick","Christian Armstrong","Christopher Stuart","Chung Krueger","Clare Whitney","Clarissa Archer","Claudio Lam","Cordell Mills","Craig Shepherd","Damien Kramer","Dane Burke","Danielle Stout","Darrel Liu","Darrin Mcneil","Darron Aguilar","Della Huber","Delores Krause","Dena Rosario","Dominick Johnston","Dona Herring","Dorothy Winters","Douglas Wiley","Doyle David","Earlene Hester","Earline Shepherd","Edwin Sparks","Eli Galvan","Elinor Kaufman","Elroy Porter","Elvin Flynn","Emmitt Porter","Erik Parsons","Ethel Forbes","Felicia Ware","Fidel Haynes","Francisco Valenzuela","Frank Hunt","Gabriela Moore","Gabrielle Patrick","Gale Fitzpatrick","Gayle Curtis","Genevieve Lucero","Gerry Oneal","Grady Ellis","Grover Escobar","Hans Patel","Horacio Black","Humberto Compton","Hunter Short","Ilene Mcguire","Imelda Lloyd","Ira Macdonald","Issac Allen","Jacques Velazquez","Janis Mullins","Janna Cowan","Javier Garner","Jayson Abbott","Jeannie Tapia","Jefferson Lee","Jeramy Keith","Jermaine Bradshaw","Jewel Lee","Jimmie Yang","Jodie Wood","John Cline","Josefina Dickerson","Josie Pineda","Judith Griffin","Julius Soto","Kelli Romero","Kerri Joseph","Kim Mccall","Lakeisha Velazquez","Latonya Logan","Lee Schmidt","Lela Atkins","Leland Robertson","Leonardo House","Leroy Mcintyre","Lesley Blevins","Lilia Berg","Lilly Stone","Lincoln Bond","Lindsay Hurst","Lionel Fuller","Lorene Hunter","Louis Kidd","Lucius Warren","Lucy Mejia","Lupe Ingram","Lynette Fuller","Lynnette Wright","Madge Copeland","Madge Tanner","Mae Sawyer","Malcolm Newman","Mamie Wong","Mandy Swanson","Marcella Everett","Marco Bright","Marcos Schaefer","Marcus Hays","Marina Walsh","Marion Savage","Marylou Bass","Marylou Mccarthy","Mathew Howard","Maurice Jacobson","Mauricio Bautista","Max Smith","Melanie Bridges","Melissa Brandt","Merlin Wu","Michel Simpson","Mickey Kennedy","Mike Sloan","Milton Walsh","Mohamed Allison","Mohammad Christensen","Nadia Macdonald","Naomi Snyder","Ned Lowe","Nettie Leonard","Olive Perkins","Ophelia Morrow","Oren Montes","Orlando Henderson","Owen Buchanan","Paul Norman","Rafael Barrett","Raymond Cochran","Reed Hooper","Reinaldo Houston","Renato Simmons","Rene Calhoun","Reva Hardin","Robert French","Robin Bender","Rodolfo Scott","Roland Blake","Roland Sullivan","Rolf Barnett","Ross Marquez","Ruthie Daugherty","Sandra Potts","Scott Stephenson","Scotty Gonzales","Sean Wiggins","Shana Gallagher","Sharron Montes","Sheryl Lindsey","Socorro Hayden","Solomon Andrade","Stacey Whitehead","Stevie Hale","Stuart Oliver","Stuart Riddle","Tammy Merritt","Theo Wiley","Theresa Murillo","Timothy Roberts","Tony Torres","Tracy Logan","Troy Hoover","Twila Rubio","Velma Everett","Vincent Mccormick","Vincenzo Stafford","Vito Clark","Waldo Spencer","Werner Lowe","Werner Shepard","Wesley Ford","Wm Cantu","Zelma Pierce"]
[null,null,null,null,null,"Mike Sloan",{"$f":"IF('Resulting List'!F173=\"\",\"\",'Resulting List'!F173)","v":""},null,{"$f":"TRANSPOSE(_xlfn._xlws.SORT(_xlfn.UNIQUE(_xlfn._xlws.FILTER(Customers[Names],ISNUMBER(SEARCH(Customers[[#This Row],[Search Criteria]],Customers[Names])),\"No data.\"))))","v":"Adriana Todd"},"Albert Ramirez","Alex Rubio","Amanda Beck","Amparo Orozco","Amy Todd","Angelina Roberson","April Fox","Arden Ayala","Arnoldo Pennington","Aubrey Giles","Bette Rivers","Brianna Alexander","Brianna Mora","Britt Vazquez","Broderick Gillespie","Brooke Roman","Calvin Buck","Carmela Mullins","Carol Stevenson","Carolina Russell","Carolyn Roberts","Chelsea Gilbert","Cheryl Williamson","Christa Frederick","Christian Armstrong","Christopher Stuart","Chung Krueger","Clare Whitney","Clarissa Archer","Claudio Lam","Cordell Mills","Craig Shepherd","Damien Kramer","Dane Burke","Danielle Stout","Darrel Liu","Darrin Mcneil","Darron Aguilar","Della Huber","Delores Krause","Dena Rosario","Dominick Johnston","Dona Herring","Dorothy Winters","Douglas Wiley","Doyle David","Earlene Hester","Earline Shepherd","Edwin Sparks","Eli Galvan","Elinor Kaufman","Elroy Porter","Elvin Flynn","Emmitt Porter","Erik Parsons","Ethel Forbes","Felicia Ware","Fidel Haynes","Francisco Valenzuela","Frank Hunt","Gabriela Moore","Gabrielle Patrick","Gale Fitzpatrick","Gayle Curtis","Genevieve Lucero","Gerry Oneal","Grady Ellis","Grover Escobar","Hans Patel","Horacio Black","Humberto Compton","Hunter Short","Ilene Mcguire","Imelda Lloyd","Ira Macdonald","Issac Allen","Jacques Velazquez","Janis Mullins","Janna Cowan","Javier Garner","Jayson Abbott","Jeannie Tapia","Jefferson Lee","Jeramy Keith","Jermaine Bradshaw","Jewel Lee","Jimmie Yang","Jodie Wood","John Cline","Josefina Dickerson","Josie Pineda","Judith Griffin","Julius Soto","Kelli Romero","Kerri Joseph","Kim Mccall","Lakeisha Velazquez","Latonya Logan","Lee Schmidt","Lela Atkins","Leland Robertson","Leonardo House","Leroy Mcintyre","Lesley Blevins","Lilia Berg","Lilly Stone","Lincoln Bond","Lindsay Hurst","Lionel Fuller","Lorene Hunter","Louis Kidd","Lucius Warren","Lucy Mejia","Lupe Ingram","Lynette Fuller","Lynnette Wright","Madge Copeland","Madge Tanner","Mae Sawyer","Malcolm Newman","Mamie Wong","Mandy Swanson","Marcella Everett","Marco Bright","Marcos Schaefer","Marcus Hays","Marina Walsh","Marion Savage","Marylou Bass","Marylou Mccarthy","Mathew Howard","Maurice Jacobson","Mauricio Bautista","Max Smith","Melanie Bridges","Melissa Brandt","Merlin Wu","Michel Simpson","Mickey Kennedy","Mike Sloan","Milton Walsh","Mohamed Allison","Mohammad Christensen","Nadia Macdonald","Naomi Snyder","Ned Lowe","Nettie Leonard","Olive Perkins","Ophelia Morrow","Oren Montes","Orlando Henderson","Owen Buchanan","Paul Norman","Rafael Barrett","Raymond Cochran","Reed Hooper","Reinaldo Houston","Renato Simmons","Rene Calhoun","Reva Hardin","Robert French","Robin Bender","Rodolfo Scott","Roland Blake","Roland Sullivan","Rolf Barnett","Ross Marquez","Ruthie Daugherty","Sandra Potts","Scott Stephenson","Scotty Gonzales","Sean Wiggins","Shana Gallagher","Sharron Montes","Sheryl Lindsey","Socorro Hayden","Solomon Andrade","Stacey Whitehead","Stevie Hale","Stuart Oliver","Stuart Riddle","Tammy Merritt","Theo Wiley","Theresa Murillo","Timothy Roberts","Tony Torres","Tracy Logan","Troy Hoover","Twila Rubio","Velma Everett","Vincent Mccormick","Vincenzo Stafford","Vito Clark","Waldo Spencer","Werner Lowe","Werner Shepard","Wesley Ford","Wm Cantu","Zelma Pierce"]
[null,null,null,null,null,"Erik Parsons",{"$f":"IF('Resulting List'!F174=\"\",\"\",'Resulting List'!F174)","v":""},null,{"$f":"TRANSPOSE(_xlfn._xlws.SORT(_xlfn.UNIQUE(_xlfn._xlws.FILTER(Customers[Names],ISNUMBER(SEARCH(Customers[[#This Row],[Search Criteria]],Customers[Names])),\"No data.\"))))","v":"Adriana Todd"},"Albert Ramirez","Alex Rubio","Amanda Beck","Amparo Orozco","Amy Todd","Angelina Roberson","April Fox","Arden Ayala","Arnoldo Pennington","Aubrey Giles","Bette Rivers","Brianna Alexander","Brianna Mora","Britt Vazquez","Broderick Gillespie","Brooke Roman","Calvin Buck","Carmela Mullins","Carol Stevenson","Carolina Russell","Carolyn Roberts","Chelsea Gilbert","Cheryl Williamson","Christa Frederick","Christian Armstrong","Christopher Stuart","Chung Krueger","Clare Whitney","Clarissa Archer","Claudio Lam","Cordell Mills","Craig Shepherd","Damien Kramer","Dane Burke","Danielle Stout","Darrel Liu","Darrin Mcneil","Darron Aguilar","Della Huber","Delores Krause","Dena Rosario","Dominick Johnston","Dona Herring","Dorothy Winters","Douglas Wiley","Doyle David","Earlene Hester","Earline Shepherd","Edwin Sparks","Eli Galvan","Elinor Kaufman","Elroy Porter","Elvin Flynn","Emmitt Porter","Erik Parsons","Ethel Forbes","Felicia Ware","Fidel Haynes","Francisco Valenzuela","Frank Hunt","Gabriela Moore","Gabrielle Patrick","Gale Fitzpatrick","Gayle Curtis","Genevieve Lucero","Gerry Oneal","Grady Ellis","Grover Escobar","Hans Patel","Horacio Black","Humberto Compton","Hunter Short","Ilene Mcguire","Imelda Lloyd","Ira Macdonald","Issac Allen","Jacques Velazquez","Janis Mullins","Janna Cowan","Javier Garner","Jayson Abbott","Jeannie Tapia","Jefferson Lee","Jeramy Keith","Jermaine Bradshaw","Jewel Lee","Jimmie Yang","Jodie Wood","John Cline","Josefina Dickerson","Josie Pineda","Judith Griffin","Julius Soto","Kelli Romero","Kerri Joseph","Kim Mccall","Lakeisha Velazquez","Latonya Logan","Lee Schmidt","Lela Atkins","Leland Robertson","Leonardo House","Leroy Mcintyre","Lesley Blevins","Lilia Berg","Lilly Stone","Lincoln Bond","Lindsay Hurst","Lionel Fuller","Lorene Hunter","Louis Kidd","Lucius Warren","Lucy Mejia","Lupe Ingram","Lynette Fuller","Lynnette Wright","Madge Copeland","Madge Tanner","Mae Sawyer","Malcolm Newman","Mamie Wong","Mandy Swanson","Marcella Everett","Marco Bright","Marcos Schaefer","Marcus Hays","Marina Walsh","Marion Savage","Marylou Bass","Marylou Mccarthy","Mathew Howard","Maurice Jacobson","Mauricio Bautista","Max Smith","Melanie Bridges","Melissa Brandt","Merlin Wu","Michel Simpson","Mickey Kennedy","Mike Sloan","Milton Walsh","Mohamed Allison","Mohammad Christensen","Nadia Macdonald","Naomi Snyder","Ned Lowe","Nettie Leonard","Olive Perkins","Ophelia Morrow","Oren Montes","Orlando Henderson","Owen Buchanan","Paul Norman","Rafael Barrett","Raymond Cochran","Reed Hooper","Reinaldo Houston","Renato Simmons","Rene Calhoun","Reva Hardin","Robert French","Robin Bender","Rodolfo Scott","Roland Blake","Roland Sullivan","Rolf Barnett","Ross Marquez","Ruthie Daugherty","Sandra Potts","Scott Stephenson","Scotty Gonzales","Sean Wiggins","Shana Gallagher","Sharron Montes","Sheryl Lindsey","Socorro Hayden","Solomon Andrade","Stacey Whitehead","Stevie Hale","Stuart Oliver","Stuart Riddle","Tammy Merritt","Theo Wiley","Theresa Murillo","Timothy Roberts","Tony Torres","Tracy Logan","Troy Hoover","Twila Rubio","Velma Everett","Vincent Mccormick","Vincenzo Stafford","Vito Clark","Waldo Spencer","Werner Lowe","Werner Shepard","Wesley Ford","Wm Cantu","Zelma Pierce"]
[null,null,null,null,null,"Elvin Flynn",{"$f":"IF('Resulting List'!F175=\"\",\"\",'Resulting List'!F175)","v":""},null,{"$f":"TRANSPOSE(_xlfn._xlws.SORT(_xlfn.UNIQUE(_xlfn._xlws.FILTER(Customers[Names],ISNUMBER(SEARCH(Customers[[#This Row],[Search Criteria]],Customers[Names])),\"No data.\"))))","v":"Adriana Todd"},"Albert Ramirez","Alex Rubio","Amanda Beck","Amparo Orozco","Amy Todd","Angelina Roberson","April Fox","Arden Ayala","Arnoldo Pennington","Aubrey Giles","Bette Rivers","Brianna Alexander","Brianna Mora","Britt Vazquez","Broderick Gillespie","Brooke Roman","Calvin Buck","Carmela Mullins","Carol Stevenson","Carolina Russell","Carolyn Roberts","Chelsea Gilbert","Cheryl Williamson","Christa Frederick","Christian Armstrong","Christopher Stuart","Chung Krueger","Clare Whitney","Clarissa Archer","Claudio Lam","Cordell Mills","Craig Shepherd","Damien Kramer","Dane Burke","Danielle Stout","Darrel Liu","Darrin Mcneil","Darron Aguilar","Della Huber","Delores Krause","Dena Rosario","Dominick Johnston","Dona Herring","Dorothy Winters","Douglas Wiley","Doyle David","Earlene Hester","Earline Shepherd","Edwin Sparks","Eli Galvan","Elinor Kaufman","Elroy Porter","Elvin Flynn","Emmitt Porter","Erik Parsons","Ethel Forbes","Felicia Ware","Fidel Haynes","Francisco Valenzuela","Frank Hunt","Gabriela Moore","Gabrielle Patrick","Gale Fitzpatrick","Gayle Curtis","Genevieve Lucero","Gerry Oneal","Grady Ellis","Grover Escobar","Hans Patel","Horacio Black","Humberto Compton","Hunter Short","Ilene Mcguire","Imelda Lloyd","Ira Macdonald","Issac Allen","Jacques Velazquez","Janis Mullins","Janna Cowan","Javier Garner","Jayson Abbott","Jeannie Tapia","Jefferson Lee","Jeramy Keith","Jermaine Bradshaw","Jewel Lee","Jimmie Yang","Jodie Wood","John Cline","Josefina Dickerson","Josie Pineda","Judith Griffin","Julius Soto","Kelli Romero","Kerri Joseph","Kim Mccall","Lakeisha Velazquez","Latonya Logan","Lee Schmidt","Lela Atkins","Leland Robertson","Leonardo House","Leroy Mcintyre","Lesley Blevins","Lilia Berg","Lilly Stone","Lincoln Bond","Lindsay Hurst","Lionel Fuller","Lorene Hunter","Louis Kidd","Lucius Warren","Lucy Mejia","Lupe Ingram","Lynette Fuller","Lynnette Wright","Madge Copeland","Madge Tanner","Mae Sawyer","Malcolm Newman","Mamie Wong","Mandy Swanson","Marcella Everett","Marco Bright","Marcos Schaefer","Marcus Hays","Marina Walsh","Marion Savage","Marylou Bass","Marylou Mccarthy","Mathew Howard","Maurice Jacobson","Mauricio Bautista","Max Smith","Melanie Bridges","Melissa Brandt","Merlin Wu","Michel Simpson","Mickey Kennedy","Mike Sloan","Milton Walsh","Mohamed Allison","Mohammad Christensen","Nadia Macdonald","Naomi Snyder","Ned Lowe","Nettie Leonard","Olive Perkins","Ophelia Morrow","Oren Montes","Orlando Henderson","Owen Buchanan","Paul Norman","Rafael Barrett","Raymond Cochran","Reed Hooper","Reinaldo Houston","Renato Simmons","Rene Calhoun","Reva Hardin","Robert French","Robin Bender","Rodolfo Scott","Roland Blake","Roland Sullivan","Rolf Barnett","Ross Marquez","Ruthie Daugherty","Sandra Potts","Scott Stephenson","Scotty Gonzales","Sean Wiggins","Shana Gallagher","Sharron Montes","Sheryl Lindsey","Socorro Hayden","Solomon Andrade","Stacey Whitehead","Stevie Hale","Stuart Oliver","Stuart Riddle","Tammy Merritt","Theo Wiley","Theresa Murillo","Timothy Roberts","Tony Torres","Tracy Logan","Troy Hoover","Twila Rubio","Velma Everett","Vincent Mccormick","Vincenzo Stafford","Vito Clark","Waldo Spencer","Werner Lowe","Werner Shepard","Wesley Ford","Wm Cantu","Zelma Pierce"]
[null,null,null,null,null,"Vincenzo Stafford",{"$f":"IF('Resulting List'!F176=\"\",\"\",'Resulting List'!F176)","v":""},null,{"$f":"TRANSPOSE(_xlfn._xlws.SORT(_xlfn.UNIQUE(_xlfn._xlws.FILTER(Customers[Names],ISNUMBER(SEARCH(Customers[[#This Row],[Search Criteria]],Customers[Names])),\"No data.\"))))","v":"Adriana Todd"},"Albert Ramirez","Alex Rubio","Amanda Beck","Amparo Orozco","Amy Todd","Angelina Roberson","April Fox","Arden Ayala","Arnoldo Pennington","Aubrey Giles","Bette Rivers","Brianna Alexander","Brianna Mora","Britt Vazquez","Broderick Gillespie","Brooke Roman","Calvin Buck","Carmela Mullins","Carol Stevenson","Carolina Russell","Carolyn Roberts","Chelsea Gilbert","Cheryl Williamson","Christa Frederick","Christian Armstrong","Christopher Stuart","Chung Krueger","Clare Whitney","Clarissa Archer","Claudio Lam","Cordell Mills","Craig Shepherd","Damien Kramer","Dane Burke","Danielle Stout","Darrel Liu","Darrin Mcneil","Darron Aguilar","Della Huber","Delores Krause","Dena Rosario","Dominick Johnston","Dona Herring","Dorothy Winters","Douglas Wiley","Doyle David","Earlene Hester","Earline Shepherd","Edwin Sparks","Eli Galvan","Elinor Kaufman","Elroy Porter","Elvin Flynn","Emmitt Porter","Erik Parsons","Ethel Forbes","Felicia Ware","Fidel Haynes","Francisco Valenzuela","Frank Hunt","Gabriela Moore","Gabrielle Patrick","Gale Fitzpatrick","Gayle Curtis","Genevieve Lucero","Gerry Oneal","Grady Ellis","Grover Escobar","Hans Patel","Horacio Black","Humberto Compton","Hunter Short","Ilene Mcguire","Imelda Lloyd","Ira Macdonald","Issac Allen","Jacques Velazquez","Janis Mullins","Janna Cowan","Javier Garner","Jayson Abbott","Jeannie Tapia","Jefferson Lee","Jeramy Keith","Jermaine Bradshaw","Jewel Lee","Jimmie Yang","Jodie Wood","John Cline","Josefina Dickerson","Josie Pineda","Judith Griffin","Julius Soto","Kelli Romero","Kerri Joseph","Kim Mccall","Lakeisha Velazquez","Latonya Logan","Lee Schmidt","Lela Atkins","Leland Robertson","Leonardo House","Leroy Mcintyre","Lesley Blevins","Lilia Berg","Lilly Stone","Lincoln Bond","Lindsay Hurst","Lionel Fuller","Lorene Hunter","Louis Kidd","Lucius Warren","Lucy Mejia","Lupe Ingram","Lynette Fuller","Lynnette Wright","Madge Copeland","Madge Tanner","Mae Sawyer","Malcolm Newman","Mamie Wong","Mandy Swanson","Marcella Everett","Marco Bright","Marcos Schaefer","Marcus Hays","Marina Walsh","Marion Savage","Marylou Bass","Marylou Mccarthy","Mathew Howard","Maurice Jacobson","Mauricio Bautista","Max Smith","Melanie Bridges","Melissa Brandt","Merlin Wu","Michel Simpson","Mickey Kennedy","Mike Sloan","Milton Walsh","Mohamed Allison","Mohammad Christensen","Nadia Macdonald","Naomi Snyder","Ned Lowe","Nettie Leonard","Olive Perkins","Ophelia Morrow","Oren Montes","Orlando Henderson","Owen Buchanan","Paul Norman","Rafael Barrett","Raymond Cochran","Reed Hooper","Reinaldo Houston","Renato Simmons","Rene Calhoun","Reva Hardin","Robert French","Robin Bender","Rodolfo Scott","Roland Blake","Roland Sullivan","Rolf Barnett","Ross Marquez","Ruthie Daugherty","Sandra Potts","Scott Stephenson","Scotty Gonzales","Sean Wiggins","Shana Gallagher","Sharron Montes","Sheryl Lindsey","Socorro Hayden","Solomon Andrade","Stacey Whitehead","Stevie Hale","Stuart Oliver","Stuart Riddle","Tammy Merritt","Theo Wiley","Theresa Murillo","Timothy Roberts","Tony Torres","Tracy Logan","Troy Hoover","Twila Rubio","Velma Everett","Vincent Mccormick","Vincenzo Stafford","Vito Clark","Waldo Spencer","Werner Lowe","Werner Shepard","Wesley Ford","Wm Cantu","Zelma Pierce"]
[null,null,null,null,null,"Jeannie Tapia",{"$f":"IF('Resulting List'!F177=\"\",\"\",'Resulting List'!F177)","v":""},null,{"$f":"TRANSPOSE(_xlfn._xlws.SORT(_xlfn.UNIQUE(_xlfn._xlws.FILTER(Customers[Names],ISNUMBER(SEARCH(Customers[[#This Row],[Search Criteria]],Customers[Names])),\"No data.\"))))","v":"Adriana Todd"},"Albert Ramirez","Alex Rubio","Amanda Beck","Amparo Orozco","Amy Todd","Angelina Roberson","April Fox","Arden Ayala","Arnoldo Pennington","Aubrey Giles","Bette Rivers","Brianna Alexander","Brianna Mora","Britt Vazquez","Broderick Gillespie","Brooke Roman","Calvin Buck","Carmela Mullins","Carol Stevenson","Carolina Russell","Carolyn Roberts","Chelsea Gilbert","Cheryl Williamson","Christa Frederick","Christian Armstrong","Christopher Stuart","Chung Krueger","Clare Whitney","Clarissa Archer","Claudio Lam","Cordell Mills","Craig Shepherd","Damien Kramer","Dane Burke","Danielle Stout","Darrel Liu","Darrin Mcneil","Darron Aguilar","Della Huber","Delores Krause","Dena Rosario","Dominick Johnston","Dona Herring","Dorothy Winters","Douglas Wiley","Doyle David","Earlene Hester","Earline Shepherd","Edwin Sparks","Eli Galvan","Elinor Kaufman","Elroy Porter","Elvin Flynn","Emmitt Porter","Erik Parsons","Ethel Forbes","Felicia Ware","Fidel Haynes","Francisco Valenzuela","Frank Hunt","Gabriela Moore","Gabrielle Patrick","Gale Fitzpatrick","Gayle Curtis","Genevieve Lucero","Gerry Oneal","Grady Ellis","Grover Escobar","Hans Patel","Horacio Black","Humberto Compton","Hunter Short","Ilene Mcguire","Imelda Lloyd","Ira Macdonald","Issac Allen","Jacques Velazquez","Janis Mullins","Janna Cowan","Javier Garner","Jayson Abbott","Jeannie Tapia","Jefferson Lee","Jeramy Keith","Jermaine Bradshaw","Jewel Lee","Jimmie Yang","Jodie Wood","John Cline","Josefina Dickerson","Josie Pineda","Judith Griffin","Julius Soto","Kelli Romero","Kerri Joseph","Kim Mccall","Lakeisha Velazquez","Latonya Logan","Lee Schmidt","Lela Atkins","Leland Robertson","Leonardo House","Leroy Mcintyre","Lesley Blevins","Lilia Berg","Lilly Stone","Lincoln Bond","Lindsay Hurst","Lionel Fuller","Lorene Hunter","Louis Kidd","Lucius Warren","Lucy Mejia","Lupe Ingram","Lynette Fuller","Lynnette Wright","Madge Copeland","Madge Tanner","Mae Sawyer","Malcolm Newman","Mamie Wong","Mandy Swanson","Marcella Everett","Marco Bright","Marcos Schaefer","Marcus Hays","Marina Walsh","Marion Savage","Marylou Bass","Marylou Mccarthy","Mathew Howard","Maurice Jacobson","Mauricio Bautista","Max Smith","Melanie Bridges","Melissa Brandt","Merlin Wu","Michel Simpson","Mickey Kennedy","Mike Sloan","Milton Walsh","Mohamed Allison","Mohammad Christensen","Nadia Macdonald","Naomi Snyder","Ned Lowe","Nettie Leonard","Olive Perkins","Ophelia Morrow","Oren Montes","Orlando Henderson","Owen Buchanan","Paul Norman","Rafael Barrett","Raymond Cochran","Reed Hooper","Reinaldo Houston","Renato Simmons","Rene Calhoun","Reva Hardin","Robert French","Robin Bender","Rodolfo Scott","Roland Blake","Roland Sullivan","Rolf Barnett","Ross Marquez","Ruthie Daugherty","Sandra Potts","Scott Stephenson","Scotty Gonzales","Sean Wiggins","Shana Gallagher","Sharron Montes","Sheryl Lindsey","Socorro Hayden","Solomon Andrade","Stacey Whitehead","Stevie Hale","Stuart Oliver","Stuart Riddle","Tammy Merritt","Theo Wiley","Theresa Murillo","Timothy Roberts","Tony Torres","Tracy Logan","Troy Hoover","Twila Rubio","Velma Everett","Vincent Mccormick","Vincenzo Stafford","Vito Clark","Waldo Spencer","Werner Lowe","Werner Shepard","Wesley Ford","Wm Cantu","Zelma Pierce"]
[null,null,null,null,null,"Lakeisha Velazquez",{"$f":"IF('Resulting List'!F178=\"\",\"\",'Resulting List'!F178)","v":""},null,{"$f":"TRANSPOSE(_xlfn._xlws.SORT(_xlfn.UNIQUE(_xlfn._xlws.FILTER(Customers[Names],ISNUMBER(SEARCH(Customers[[#This Row],[Search Criteria]],Customers[Names])),\"No data.\"))))","v":"Adriana Todd"},"Albert Ramirez","Alex Rubio","Amanda Beck","Amparo Orozco","Amy Todd","Angelina Roberson","April Fox","Arden Ayala","Arnoldo Pennington","Aubrey Giles","Bette Rivers","Brianna Alexander","Brianna Mora","Britt Vazquez","Broderick Gillespie","Brooke Roman","Calvin Buck","Carmela Mullins","Carol Stevenson","Carolina Russell","Carolyn Roberts","Chelsea Gilbert","Cheryl Williamson","Christa Frederick","Christian Armstrong","Christopher Stuart","Chung Krueger","Clare Whitney","Clarissa Archer","Claudio Lam","Cordell Mills","Craig Shepherd","Damien Kramer","Dane Burke","Danielle Stout","Darrel Liu","Darrin Mcneil","Darron Aguilar","Della Huber","Delores Krause","Dena Rosario","Dominick Johnston","Dona Herring","Dorothy Winters","Douglas Wiley","Doyle David","Earlene Hester","Earline Shepherd","Edwin Sparks","Eli Galvan","Elinor Kaufman","Elroy Porter","Elvin Flynn","Emmitt Porter","Erik Parsons","Ethel Forbes","Felicia Ware","Fidel Haynes","Francisco Valenzuela","Frank Hunt","Gabriela Moore","Gabrielle Patrick","Gale Fitzpatrick","Gayle Curtis","Genevieve Lucero","Gerry Oneal","Grady Ellis","Grover Escobar","Hans Patel","Horacio Black","Humberto Compton","Hunter Short","Ilene Mcguire","Imelda Lloyd","Ira Macdonald","Issac Allen","Jacques Velazquez","Janis Mullins","Janna Cowan","Javier Garner","Jayson Abbott","Jeannie Tapia","Jefferson Lee","Jeramy Keith","Jermaine Bradshaw","Jewel Lee","Jimmie Yang","Jodie Wood","John Cline","Josefina Dickerson","Josie Pineda","Judith Griffin","Julius Soto","Kelli Romero","Kerri Joseph","Kim Mccall","Lakeisha Velazquez","Latonya Logan","Lee Schmidt","Lela Atkins","Leland Robertson","Leonardo House","Leroy Mcintyre","Lesley Blevins","Lilia Berg","Lilly Stone","Lincoln Bond","Lindsay Hurst","Lionel Fuller","Lorene Hunter","Louis Kidd","Lucius Warren","Lucy Mejia","Lupe Ingram","Lynette Fuller","Lynnette Wright","Madge Copeland","Madge Tanner","Mae Sawyer","Malcolm Newman","Mamie Wong","Mandy Swanson","Marcella Everett","Marco Bright","Marcos Schaefer","Marcus Hays","Marina Walsh","Marion Savage","Marylou Bass","Marylou Mccarthy","Mathew Howard","Maurice Jacobson","Mauricio Bautista","Max Smith","Melanie Bridges","Melissa Brandt","Merlin Wu","Michel Simpson","Mickey Kennedy","Mike Sloan","Milton Walsh","Mohamed Allison","Mohammad Christensen","Nadia Macdonald","Naomi Snyder","Ned Lowe","Nettie Leonard","Olive Perkins","Ophelia Morrow","Oren Montes","Orlando Henderson","Owen Buchanan","Paul Norman","Rafael Barrett","Raymond Cochran","Reed Hooper","Reinaldo Houston","Renato Simmons","Rene Calhoun","Reva Hardin","Robert French","Robin Bender","Rodolfo Scott","Roland Blake","Roland Sullivan","Rolf Barnett","Ross Marquez","Ruthie Daugherty","Sandra Potts","Scott Stephenson","Scotty Gonzales","Sean Wiggins","Shana Gallagher","Sharron Montes","Sheryl Lindsey","Socorro Hayden","Solomon Andrade","Stacey Whitehead","Stevie Hale","Stuart Oliver","Stuart Riddle","Tammy Merritt","Theo Wiley","Theresa Murillo","Timothy Roberts","Tony Torres","Tracy Logan","Troy Hoover","Twila Rubio","Velma Everett","Vincent Mccormick","Vincenzo Stafford","Vito Clark","Waldo Spencer","Werner Lowe","Werner Shepard","Wesley Ford","Wm Cantu","Zelma Pierce"]
[null,null,null,null,null,"Cordell Mills",{"$f":"IF('Resulting List'!F179=\"\",\"\",'Resulting List'!F179)","v":""},null,{"$f":"TRANSPOSE(_xlfn._xlws.SORT(_xlfn.UNIQUE(_xlfn._xlws.FILTER(Customers[Names],ISNUMBER(SEARCH(Customers[[#This Row],[Search Criteria]],Customers[Names])),\"No data.\"))))","v":"Adriana Todd"},"Albert Ramirez","Alex Rubio","Amanda Beck","Amparo Orozco","Amy Todd","Angelina Roberson","April Fox","Arden Ayala","Arnoldo Pennington","Aubrey Giles","Bette Rivers","Brianna Alexander","Brianna Mora","Britt Vazquez","Broderick Gillespie","Brooke Roman","Calvin Buck","Carmela Mullins","Carol Stevenson","Carolina Russell","Carolyn Roberts","Chelsea Gilbert","Cheryl Williamson","Christa Frederick","Christian Armstrong","Christopher Stuart","Chung Krueger","Clare Whitney","Clarissa Archer","Claudio Lam","Cordell Mills","Craig Shepherd","Damien Kramer","Dane Burke","Danielle Stout","Darrel Liu","Darrin Mcneil","Darron Aguilar","Della Huber","Delores Krause","Dena Rosario","Dominick Johnston","Dona Herring","Dorothy Winters","Douglas Wiley","Doyle David","Earlene Hester","Earline Shepherd","Edwin Sparks","Eli Galvan","Elinor Kaufman","Elroy Porter","Elvin Flynn","Emmitt Porter","Erik Parsons","Ethel Forbes","Felicia Ware","Fidel Haynes","Francisco Valenzuela","Frank Hunt","Gabriela Moore","Gabrielle Patrick","Gale Fitzpatrick","Gayle Curtis","Genevieve Lucero","Gerry Oneal","Grady Ellis","Grover Escobar","Hans Patel","Horacio Black","Humberto Compton","Hunter Short","Ilene Mcguire","Imelda Lloyd","Ira Macdonald","Issac Allen","Jacques Velazquez","Janis Mullins","Janna Cowan","Javier Garner","Jayson Abbott","Jeannie Tapia","Jefferson Lee","Jeramy Keith","Jermaine Bradshaw","Jewel Lee","Jimmie Yang","Jodie Wood","John Cline","Josefina Dickerson","Josie Pineda","Judith Griffin","Julius Soto","Kelli Romero","Kerri Joseph","Kim Mccall","Lakeisha Velazquez","Latonya Logan","Lee Schmidt","Lela Atkins","Leland Robertson","Leonardo House","Leroy Mcintyre","Lesley Blevins","Lilia Berg","Lilly Stone","Lincoln Bond","Lindsay Hurst","Lionel Fuller","Lorene Hunter","Louis Kidd","Lucius Warren","Lucy Mejia","Lupe Ingram","Lynette Fuller","Lynnette Wright","Madge Copeland","Madge Tanner","Mae Sawyer","Malcolm Newman","Mamie Wong","Mandy Swanson","Marcella Everett","Marco Bright","Marcos Schaefer","Marcus Hays","Marina Walsh","Marion Savage","Marylou Bass","Marylou Mccarthy","Mathew Howard","Maurice Jacobson","Mauricio Bautista","Max Smith","Melanie Bridges","Melissa Brandt","Merlin Wu","Michel Simpson","Mickey Kennedy","Mike Sloan","Milton Walsh","Mohamed Allison","Mohammad Christensen","Nadia Macdonald","Naomi Snyder","Ned Lowe","Nettie Leonard","Olive Perkins","Ophelia Morrow","Oren Montes","Orlando Henderson","Owen Buchanan","Paul Norman","Rafael Barrett","Raymond Cochran","Reed Hooper","Reinaldo Houston","Renato Simmons","Rene Calhoun","Reva Hardin","Robert French","Robin Bender","Rodolfo Scott","Roland Blake","Roland Sullivan","Rolf Barnett","Ross Marquez","Ruthie Daugherty","Sandra Potts","Scott Stephenson","Scotty Gonzales","Sean Wiggins","Shana Gallagher","Sharron Montes","Sheryl Lindsey","Socorro Hayden","Solomon Andrade","Stacey Whitehead","Stevie Hale","Stuart Oliver","Stuart Riddle","Tammy Merritt","Theo Wiley","Theresa Murillo","Timothy Roberts","Tony Torres","Tracy Logan","Troy Hoover","Twila Rubio","Velma Everett","Vincent Mccormick","Vincenzo Stafford","Vito Clark","Waldo Spencer","Werner Lowe","Werner Shepard","Wesley Ford","Wm Cantu","Zelma Pierce"]
[null,null,null,null,null,"Nettie Leonard",{"$f":"IF('Resulting List'!F180=\"\",\"\",'Resulting List'!F180)","v":""},null,{"$f":"TRANSPOSE(_xlfn._xlws.SORT(_xlfn.UNIQUE(_xlfn._xlws.FILTER(Customers[Names],ISNUMBER(SEARCH(Customers[[#This Row],[Search Criteria]],Customers[Names])),\"No data.\"))))","v":"Adriana Todd"},"Albert Ramirez","Alex Rubio","Amanda Beck","Amparo Orozco","Amy Todd","Angelina Roberson","April Fox","Arden Ayala","Arnoldo Pennington","Aubrey Giles","Bette Rivers","Brianna Alexander","Brianna Mora","Britt Vazquez","Broderick Gillespie","Brooke Roman","Calvin Buck","Carmela Mullins","Carol Stevenson","Carolina Russell","Carolyn Roberts","Chelsea Gilbert","Cheryl Williamson","Christa Frederick","Christian Armstrong","Christopher Stuart","Chung Krueger","Clare Whitney","Clarissa Archer","Claudio Lam","Cordell Mills","Craig Shepherd","Damien Kramer","Dane Burke","Danielle Stout","Darrel Liu","Darrin Mcneil","Darron Aguilar","Della Huber","Delores Krause","Dena Rosario","Dominick Johnston","Dona Herring","Dorothy Winters","Douglas Wiley","Doyle David","Earlene Hester","Earline Shepherd","Edwin Sparks","Eli Galvan","Elinor Kaufman","Elroy Porter","Elvin Flynn","Emmitt Porter","Erik Parsons","Ethel Forbes","Felicia Ware","Fidel Haynes","Francisco Valenzuela","Frank Hunt","Gabriela Moore","Gabrielle Patrick","Gale Fitzpatrick","Gayle Curtis","Genevieve Lucero","Gerry Oneal","Grady Ellis","Grover Escobar","Hans Patel","Horacio Black","Humberto Compton","Hunter Short","Ilene Mcguire","Imelda Lloyd","Ira Macdonald","Issac Allen","Jacques Velazquez","Janis Mullins","Janna Cowan","Javier Garner","Jayson Abbott","Jeannie Tapia","Jefferson Lee","Jeramy Keith","Jermaine Bradshaw","Jewel Lee","Jimmie Yang","Jodie Wood","John Cline","Josefina Dickerson","Josie Pineda","Judith Griffin","Julius Soto","Kelli Romero","Kerri Joseph","Kim Mccall","Lakeisha Velazquez","Latonya Logan","Lee Schmidt","Lela Atkins","Leland Robertson","Leonardo House","Leroy Mcintyre","Lesley Blevins","Lilia Berg","Lilly Stone","Lincoln Bond","Lindsay Hurst","Lionel Fuller","Lorene Hunter","Louis Kidd","Lucius Warren","Lucy Mejia","Lupe Ingram","Lynette Fuller","Lynnette Wright","Madge Copeland","Madge Tanner","Mae Sawyer","Malcolm Newman","Mamie Wong","Mandy Swanson","Marcella Everett","Marco Bright","Marcos Schaefer","Marcus Hays","Marina Walsh","Marion Savage","Marylou Bass","Marylou Mccarthy","Mathew Howard","Maurice Jacobson","Mauricio Bautista","Max Smith","Melanie Bridges","Melissa Brandt","Merlin Wu","Michel Simpson","Mickey Kennedy","Mike Sloan","Milton Walsh","Mohamed Allison","Mohammad Christensen","Nadia Macdonald","Naomi Snyder","Ned Lowe","Nettie Leonard","Olive Perkins","Ophelia Morrow","Oren Montes","Orlando Henderson","Owen Buchanan","Paul Norman","Rafael Barrett","Raymond Cochran","Reed Hooper","Reinaldo Houston","Renato Simmons","Rene Calhoun","Reva Hardin","Robert French","Robin Bender","Rodolfo Scott","Roland Blake","Roland Sullivan","Rolf Barnett","Ross Marquez","Ruthie Daugherty","Sandra Potts","Scott Stephenson","Scotty Gonzales","Sean Wiggins","Shana Gallagher","Sharron Montes","Sheryl Lindsey","Socorro Hayden","Solomon Andrade","Stacey Whitehead","Stevie Hale","Stuart Oliver","Stuart Riddle","Tammy Merritt","Theo Wiley","Theresa Murillo","Timothy Roberts","Tony Torres","Tracy Logan","Troy Hoover","Twila Rubio","Velma Everett","Vincent Mccormick","Vincenzo Stafford","Vito Clark","Waldo Spencer","Werner Lowe","Werner Shepard","Wesley Ford","Wm Cantu","Zelma Pierce"]
[null,null,null,null,null,"Reinaldo Houston",{"$f":"IF('Resulting List'!F181=\"\",\"\",'Resulting List'!F181)","v":""},null,{"$f":"TRANSPOSE(_xlfn._xlws.SORT(_xlfn.UNIQUE(_xlfn._xlws.FILTER(Customers[Names],ISNUMBER(SEARCH(Customers[[#This Row],[Search Criteria]],Customers[Names])),\"No data.\"))))","v":"Adriana Todd"},"Albert Ramirez","Alex Rubio","Amanda Beck","Amparo Orozco","Amy Todd","Angelina Roberson","April Fox","Arden Ayala","Arnoldo Pennington","Aubrey Giles","Bette Rivers","Brianna Alexander","Brianna Mora","Britt Vazquez","Broderick Gillespie","Brooke Roman","Calvin Buck","Carmela Mullins","Carol Stevenson","Carolina Russell","Carolyn Roberts","Chelsea Gilbert","Cheryl Williamson","Christa Frederick","Christian Armstrong","Christopher Stuart","Chung Krueger","Clare Whitney","Clarissa Archer","Claudio Lam","Cordell Mills","Craig Shepherd","Damien Kramer","Dane Burke","Danielle Stout","Darrel Liu","Darrin Mcneil","Darron Aguilar","Della Huber","Delores Krause","Dena Rosario","Dominick Johnston","Dona Herring","Dorothy Winters","Douglas Wiley","Doyle David","Earlene Hester","Earline Shepherd","Edwin Sparks","Eli Galvan","Elinor Kaufman","Elroy Porter","Elvin Flynn","Emmitt Porter","Erik Parsons","Ethel Forbes","Felicia Ware","Fidel Haynes","Francisco Valenzuela","Frank Hunt","Gabriela Moore","Gabrielle Patrick","Gale Fitzpatrick","Gayle Curtis","Genevieve Lucero","Gerry Oneal","Grady Ellis","Grover Escobar","Hans Patel","Horacio Black","Humberto Compton","Hunter Short","Ilene Mcguire","Imelda Lloyd","Ira Macdonald","Issac Allen","Jacques Velazquez","Janis Mullins","Janna Cowan","Javier Garner","Jayson Abbott","Jeannie Tapia","Jefferson Lee","Jeramy Keith","Jermaine Bradshaw","Jewel Lee","Jimmie Yang","Jodie Wood","John Cline","Josefina Dickerson","Josie Pineda","Judith Griffin","Julius Soto","Kelli Romero","Kerri Joseph","Kim Mccall","Lakeisha Velazquez","Latonya Logan","Lee Schmidt","Lela Atkins","Leland Robertson","Leonardo House","Leroy Mcintyre","Lesley Blevins","Lilia Berg","Lilly Stone","Lincoln Bond","Lindsay Hurst","Lionel Fuller","Lorene Hunter","Louis Kidd","Lucius Warren","Lucy Mejia","Lupe Ingram","Lynette Fuller","Lynnette Wright","Madge Copeland","Madge Tanner","Mae Sawyer","Malcolm Newman","Mamie Wong","Mandy Swanson","Marcella Everett","Marco Bright","Marcos Schaefer","Marcus Hays","Marina Walsh","Marion Savage","Marylou Bass","Marylou Mccarthy","Mathew Howard","Maurice Jacobson","Mauricio Bautista","Max Smith","Melanie Bridges","Melissa Brandt","Merlin Wu","Michel Simpson","Mickey Kennedy","Mike Sloan","Milton Walsh","Mohamed Allison","Mohammad Christensen","Nadia Macdonald","Naomi Snyder","Ned Lowe","Nettie Leonard","Olive Perkins","Ophelia Morrow","Oren Montes","Orlando Henderson","Owen Buchanan","Paul Norman","Rafael Barrett","Raymond Cochran","Reed Hooper","Reinaldo Houston","Renato Simmons","Rene Calhoun","Reva Hardin","Robert French","Robin Bender","Rodolfo Scott","Roland Blake","Roland Sullivan","Rolf Barnett","Ross Marquez","Ruthie Daugherty","Sandra Potts","Scott Stephenson","Scotty Gonzales","Sean Wiggins","Shana Gallagher","Sharron Montes","Sheryl Lindsey","Socorro Hayden","Solomon Andrade","Stacey Whitehead","Stevie Hale","Stuart Oliver","Stuart Riddle","Tammy Merritt","Theo Wiley","Theresa Murillo","Timothy Roberts","Tony Torres","Tracy Logan","Troy Hoover","Twila Rubio","Velma Everett","Vincent Mccormick","Vincenzo Stafford","Vito Clark","Waldo Spencer","Werner Lowe","Werner Shepard","Wesley Ford","Wm Cantu","Zelma Pierce"]
[null,null,null,null,null,"Reva Hardin",{"$f":"IF('Resulting List'!F182=\"\",\"\",'Resulting List'!F182)","v":""},null,{"$f":"TRANSPOSE(_xlfn._xlws.SORT(_xlfn.UNIQUE(_xlfn._xlws.FILTER(Customers[Names],ISNUMBER(SEARCH(Customers[[#This Row],[Search Criteria]],Customers[Names])),\"No data.\"))))","v":"Adriana Todd"},"Albert Ramirez","Alex Rubio","Amanda Beck","Amparo Orozco","Amy Todd","Angelina Roberson","April Fox","Arden Ayala","Arnoldo Pennington","Aubrey Giles","Bette Rivers","Brianna Alexander","Brianna Mora","Britt Vazquez","Broderick Gillespie","Brooke Roman","Calvin Buck","Carmela Mullins","Carol Stevenson","Carolina Russell","Carolyn Roberts","Chelsea Gilbert","Cheryl Williamson","Christa Frederick","Christian Armstrong","Christopher Stuart","Chung Krueger","Clare Whitney","Clarissa Archer","Claudio Lam","Cordell Mills","Craig Shepherd","Damien Kramer","Dane Burke","Danielle Stout","Darrel Liu","Darrin Mcneil","Darron Aguilar","Della Huber","Delores Krause","Dena Rosario","Dominick Johnston","Dona Herring","Dorothy Winters","Douglas Wiley","Doyle David","Earlene Hester","Earline Shepherd","Edwin Sparks","Eli Galvan","Elinor Kaufman","Elroy Porter","Elvin Flynn","Emmitt Porter","Erik Parsons","Ethel Forbes","Felicia Ware","Fidel Haynes","Francisco Valenzuela","Frank Hunt","Gabriela Moore","Gabrielle Patrick","Gale Fitzpatrick","Gayle Curtis","Genevieve Lucero","Gerry Oneal","Grady Ellis","Grover Escobar","Hans Patel","Horacio Black","Humberto Compton","Hunter Short","Ilene Mcguire","Imelda Lloyd","Ira Macdonald","Issac Allen","Jacques Velazquez","Janis Mullins","Janna Cowan","Javier Garner","Jayson Abbott","Jeannie Tapia","Jefferson Lee","Jeramy Keith","Jermaine Bradshaw","Jewel Lee","Jimmie Yang","Jodie Wood","John Cline","Josefina Dickerson","Josie Pineda","Judith Griffin","Julius Soto","Kelli Romero","Kerri Joseph","Kim Mccall","Lakeisha Velazquez","Latonya Logan","Lee Schmidt","Lela Atkins","Leland Robertson","Leonardo House","Leroy Mcintyre","Lesley Blevins","Lilia Berg","Lilly Stone","Lincoln Bond","Lindsay Hurst","Lionel Fuller","Lorene Hunter","Louis Kidd","Lucius Warren","Lucy Mejia","Lupe Ingram","Lynette Fuller","Lynnette Wright","Madge Copeland","Madge Tanner","Mae Sawyer","Malcolm Newman","Mamie Wong","Mandy Swanson","Marcella Everett","Marco Bright","Marcos Schaefer","Marcus Hays","Marina Walsh","Marion Savage","Marylou Bass","Marylou Mccarthy","Mathew Howard","Maurice Jacobson","Mauricio Bautista","Max Smith","Melanie Bridges","Melissa Brandt","Merlin Wu","Michel Simpson","Mickey Kennedy","Mike Sloan","Milton Walsh","Mohamed Allison","Mohammad Christensen","Nadia Macdonald","Naomi Snyder","Ned Lowe","Nettie Leonard","Olive Perkins","Ophelia Morrow","Oren Montes","Orlando Henderson","Owen Buchanan","Paul Norman","Rafael Barrett","Raymond Cochran","Reed Hooper","Reinaldo Houston","Renato Simmons","Rene Calhoun","Reva Hardin","Robert French","Robin Bender","Rodolfo Scott","Roland Blake","Roland Sullivan","Rolf Barnett","Ross Marquez","Ruthie Daugherty","Sandra Potts","Scott Stephenson","Scotty Gonzales","Sean Wiggins","Shana Gallagher","Sharron Montes","Sheryl Lindsey","Socorro Hayden","Solomon Andrade","Stacey Whitehead","Stevie Hale","Stuart Oliver","Stuart Riddle","Tammy Merritt","Theo Wiley","Theresa Murillo","Timothy Roberts","Tony Torres","Tracy Logan","Troy Hoover","Twila Rubio","Velma Everett","Vincent Mccormick","Vincenzo Stafford","Vito Clark","Waldo Spencer","Werner Lowe","Werner Shepard","Wesley Ford","Wm Cantu","Zelma Pierce"]
[null,null,null,null,null,"Gale Fitzpatrick",{"$f":"IF('Resulting List'!F183=\"\",\"\",'Resulting List'!F183)","v":""},null,{"$f":"TRANSPOSE(_xlfn._xlws.SORT(_xlfn.UNIQUE(_xlfn._xlws.FILTER(Customers[Names],ISNUMBER(SEARCH(Customers[[#This Row],[Search Criteria]],Customers[Names])),\"No data.\"))))","v":"Adriana Todd"},"Albert Ramirez","Alex Rubio","Amanda Beck","Amparo Orozco","Amy Todd","Angelina Roberson","April Fox","Arden Ayala","Arnoldo Pennington","Aubrey Giles","Bette Rivers","Brianna Alexander","Brianna Mora","Britt Vazquez","Broderick Gillespie","Brooke Roman","Calvin Buck","Carmela Mullins","Carol Stevenson","Carolina Russell","Carolyn Roberts","Chelsea Gilbert","Cheryl Williamson","Christa Frederick","Christian Armstrong","Christopher Stuart","Chung Krueger","Clare Whitney","Clarissa Archer","Claudio Lam","Cordell Mills","Craig Shepherd","Damien Kramer","Dane Burke","Danielle Stout","Darrel Liu","Darrin Mcneil","Darron Aguilar","Della Huber","Delores Krause","Dena Rosario","Dominick Johnston","Dona Herring","Dorothy Winters","Douglas Wiley","Doyle David","Earlene Hester","Earline Shepherd","Edwin Sparks","Eli Galvan","Elinor Kaufman","Elroy Porter","Elvin Flynn","Emmitt Porter","Erik Parsons","Ethel Forbes","Felicia Ware","Fidel Haynes","Francisco Valenzuela","Frank Hunt","Gabriela Moore","Gabrielle Patrick","Gale Fitzpatrick","Gayle Curtis","Genevieve Lucero","Gerry Oneal","Grady Ellis","Grover Escobar","Hans Patel","Horacio Black","Humberto Compton","Hunter Short","Ilene Mcguire","Imelda Lloyd","Ira Macdonald","Issac Allen","Jacques Velazquez","Janis Mullins","Janna Cowan","Javier Garner","Jayson Abbott","Jeannie Tapia","Jefferson Lee","Jeramy Keith","Jermaine Bradshaw","Jewel Lee","Jimmie Yang","Jodie Wood","John Cline","Josefina Dickerson","Josie Pineda","Judith Griffin","Julius Soto","Kelli Romero","Kerri Joseph","Kim Mccall","Lakeisha Velazquez","Latonya Logan","Lee Schmidt","Lela Atkins","Leland Robertson","Leonardo House","Leroy Mcintyre","Lesley Blevins","Lilia Berg","Lilly Stone","Lincoln Bond","Lindsay Hurst","Lionel Fuller","Lorene Hunter","Louis Kidd","Lucius Warren","Lucy Mejia","Lupe Ingram","Lynette Fuller","Lynnette Wright","Madge Copeland","Madge Tanner","Mae Sawyer","Malcolm Newman","Mamie Wong","Mandy Swanson","Marcella Everett","Marco Bright","Marcos Schaefer","Marcus Hays","Marina Walsh","Marion Savage","Marylou Bass","Marylou Mccarthy","Mathew Howard","Maurice Jacobson","Mauricio Bautista","Max Smith","Melanie Bridges","Melissa Brandt","Merlin Wu","Michel Simpson","Mickey Kennedy","Mike Sloan","Milton Walsh","Mohamed Allison","Mohammad Christensen","Nadia Macdonald","Naomi Snyder","Ned Lowe","Nettie Leonard","Olive Perkins","Ophelia Morrow","Oren Montes","Orlando Henderson","Owen Buchanan","Paul Norman","Rafael Barrett","Raymond Cochran","Reed Hooper","Reinaldo Houston","Renato Simmons","Rene Calhoun","Reva Hardin","Robert French","Robin Bender","Rodolfo Scott","Roland Blake","Roland Sullivan","Rolf Barnett","Ross Marquez","Ruthie Daugherty","Sandra Potts","Scott Stephenson","Scotty Gonzales","Sean Wiggins","Shana Gallagher","Sharron Montes","Sheryl Lindsey","Socorro Hayden","Solomon Andrade","Stacey Whitehead","Stevie Hale","Stuart Oliver","Stuart Riddle","Tammy Merritt","Theo Wiley","Theresa Murillo","Timothy Roberts","Tony Torres","Tracy Logan","Troy Hoover","Twila Rubio","Velma Everett","Vincent Mccormick","Vincenzo Stafford","Vito Clark","Waldo Spencer","Werner Lowe","Werner Shepard","Wesley Ford","Wm Cantu","Zelma Pierce"]
[null,null,null,null,null,"Lilia Berg",{"$f":"IF('Resulting List'!F184=\"\",\"\",'Resulting List'!F184)","v":""},null,{"$f":"TRANSPOSE(_xlfn._xlws.SORT(_xlfn.UNIQUE(_xlfn._xlws.FILTER(Customers[Names],ISNUMBER(SEARCH(Customers[[#This Row],[Search Criteria]],Customers[Names])),\"No data.\"))))","v":"Adriana Todd"},"Albert Ramirez","Alex Rubio","Amanda Beck","Amparo Orozco","Amy Todd","Angelina Roberson","April Fox","Arden Ayala","Arnoldo Pennington","Aubrey Giles","Bette Rivers","Brianna Alexander","Brianna Mora","Britt Vazquez","Broderick Gillespie","Brooke Roman","Calvin Buck","Carmela Mullins","Carol Stevenson","Carolina Russell","Carolyn Roberts","Chelsea Gilbert","Cheryl Williamson","Christa Frederick","Christian Armstrong","Christopher Stuart","Chung Krueger","Clare Whitney","Clarissa Archer","Claudio Lam","Cordell Mills","Craig Shepherd","Damien Kramer","Dane Burke","Danielle Stout","Darrel Liu","Darrin Mcneil","Darron Aguilar","Della Huber","Delores Krause","Dena Rosario","Dominick Johnston","Dona Herring","Dorothy Winters","Douglas Wiley","Doyle David","Earlene Hester","Earline Shepherd","Edwin Sparks","Eli Galvan","Elinor Kaufman","Elroy Porter","Elvin Flynn","Emmitt Porter","Erik Parsons","Ethel Forbes","Felicia Ware","Fidel Haynes","Francisco Valenzuela","Frank Hunt","Gabriela Moore","Gabrielle Patrick","Gale Fitzpatrick","Gayle Curtis","Genevieve Lucero","Gerry Oneal","Grady Ellis","Grover Escobar","Hans Patel","Horacio Black","Humberto Compton","Hunter Short","Ilene Mcguire","Imelda Lloyd","Ira Macdonald","Issac Allen","Jacques Velazquez","Janis Mullins","Janna Cowan","Javier Garner","Jayson Abbott","Jeannie Tapia","Jefferson Lee","Jeramy Keith","Jermaine Bradshaw","Jewel Lee","Jimmie Yang","Jodie Wood","John Cline","Josefina Dickerson","Josie Pineda","Judith Griffin","Julius Soto","Kelli Romero","Kerri Joseph","Kim Mccall","Lakeisha Velazquez","Latonya Logan","Lee Schmidt","Lela Atkins","Leland Robertson","Leonardo House","Leroy Mcintyre","Lesley Blevins","Lilia Berg","Lilly Stone","Lincoln Bond","Lindsay Hurst","Lionel Fuller","Lorene Hunter","Louis Kidd","Lucius Warren","Lucy Mejia","Lupe Ingram","Lynette Fuller","Lynnette Wright","Madge Copeland","Madge Tanner","Mae Sawyer","Malcolm Newman","Mamie Wong","Mandy Swanson","Marcella Everett","Marco Bright","Marcos Schaefer","Marcus Hays","Marina Walsh","Marion Savage","Marylou Bass","Marylou Mccarthy","Mathew Howard","Maurice Jacobson","Mauricio Bautista","Max Smith","Melanie Bridges","Melissa Brandt","Merlin Wu","Michel Simpson","Mickey Kennedy","Mike Sloan","Milton Walsh","Mohamed Allison","Mohammad Christensen","Nadia Macdonald","Naomi Snyder","Ned Lowe","Nettie Leonard","Olive Perkins","Ophelia Morrow","Oren Montes","Orlando Henderson","Owen Buchanan","Paul Norman","Rafael Barrett","Raymond Cochran","Reed Hooper","Reinaldo Houston","Renato Simmons","Rene Calhoun","Reva Hardin","Robert French","Robin Bender","Rodolfo Scott","Roland Blake","Roland Sullivan","Rolf Barnett","Ross Marquez","Ruthie Daugherty","Sandra Potts","Scott Stephenson","Scotty Gonzales","Sean Wiggins","Shana Gallagher","Sharron Montes","Sheryl Lindsey","Socorro Hayden","Solomon Andrade","Stacey Whitehead","Stevie Hale","Stuart Oliver","Stuart Riddle","Tammy Merritt","Theo Wiley","Theresa Murillo","Timothy Roberts","Tony Torres","Tracy Logan","Troy Hoover","Twila Rubio","Velma Everett","Vincent Mccormick","Vincenzo Stafford","Vito Clark","Waldo Spencer","Werner Lowe","Werner Shepard","Wesley Ford","Wm Cantu","Zelma Pierce"]
[null,null,null,null,null,"Earline Shepherd",{"$f":"IF('Resulting List'!F185=\"\",\"\",'Resulting List'!F185)","v":""},null,{"$f":"TRANSPOSE(_xlfn._xlws.SORT(_xlfn.UNIQUE(_xlfn._xlws.FILTER(Customers[Names],ISNUMBER(SEARCH(Customers[[#This Row],[Search Criteria]],Customers[Names])),\"No data.\"))))","v":"Adriana Todd"},"Albert Ramirez","Alex Rubio","Amanda Beck","Amparo Orozco","Amy Todd","Angelina Roberson","April Fox","Arden Ayala","Arnoldo Pennington","Aubrey Giles","Bette Rivers","Brianna Alexander","Brianna Mora","Britt Vazquez","Broderick Gillespie","Brooke Roman","Calvin Buck","Carmela Mullins","Carol Stevenson","Carolina Russell","Carolyn Roberts","Chelsea Gilbert","Cheryl Williamson","Christa Frederick","Christian Armstrong","Christopher Stuart","Chung Krueger","Clare Whitney","Clarissa Archer","Claudio Lam","Cordell Mills","Craig Shepherd","Damien Kramer","Dane Burke","Danielle Stout","Darrel Liu","Darrin Mcneil","Darron Aguilar","Della Huber","Delores Krause","Dena Rosario","Dominick Johnston","Dona Herring","Dorothy Winters","Douglas Wiley","Doyle David","Earlene Hester","Earline Shepherd","Edwin Sparks","Eli Galvan","Elinor Kaufman","Elroy Porter","Elvin Flynn","Emmitt Porter","Erik Parsons","Ethel Forbes","Felicia Ware","Fidel Haynes","Francisco Valenzuela","Frank Hunt","Gabriela Moore","Gabrielle Patrick","Gale Fitzpatrick","Gayle Curtis","Genevieve Lucero","Gerry Oneal","Grady Ellis","Grover Escobar","Hans Patel","Horacio Black","Humberto Compton","Hunter Short","Ilene Mcguire","Imelda Lloyd","Ira Macdonald","Issac Allen","Jacques Velazquez","Janis Mullins","Janna Cowan","Javier Garner","Jayson Abbott","Jeannie Tapia","Jefferson Lee","Jeramy Keith","Jermaine Bradshaw","Jewel Lee","Jimmie Yang","Jodie Wood","John Cline","Josefina Dickerson","Josie Pineda","Judith Griffin","Julius Soto","Kelli Romero","Kerri Joseph","Kim Mccall","Lakeisha Velazquez","Latonya Logan","Lee Schmidt","Lela Atkins","Leland Robertson","Leonardo House","Leroy Mcintyre","Lesley Blevins","Lilia Berg","Lilly Stone","Lincoln Bond","Lindsay Hurst","Lionel Fuller","Lorene Hunter","Louis Kidd","Lucius Warren","Lucy Mejia","Lupe Ingram","Lynette Fuller","Lynnette Wright","Madge Copeland","Madge Tanner","Mae Sawyer","Malcolm Newman","Mamie Wong","Mandy Swanson","Marcella Everett","Marco Bright","Marcos Schaefer","Marcus Hays","Marina Walsh","Marion Savage","Marylou Bass","Marylou Mccarthy","Mathew Howard","Maurice Jacobson","Mauricio Bautista","Max Smith","Melanie Bridges","Melissa Brandt","Merlin Wu","Michel Simpson","Mickey Kennedy","Mike Sloan","Milton Walsh","Mohamed Allison","Mohammad Christensen","Nadia Macdonald","Naomi Snyder","Ned Lowe","Nettie Leonard","Olive Perkins","Ophelia Morrow","Oren Montes","Orlando Henderson","Owen Buchanan","Paul Norman","Rafael Barrett","Raymond Cochran","Reed Hooper","Reinaldo Houston","Renato Simmons","Rene Calhoun","Reva Hardin","Robert French","Robin Bender","Rodolfo Scott","Roland Blake","Roland Sullivan","Rolf Barnett","Ross Marquez","Ruthie Daugherty","Sandra Potts","Scott Stephenson","Scotty Gonzales","Sean Wiggins","Shana Gallagher","Sharron Montes","Sheryl Lindsey","Socorro Hayden","Solomon Andrade","Stacey Whitehead","Stevie Hale","Stuart Oliver","Stuart Riddle","Tammy Merritt","Theo Wiley","Theresa Murillo","Timothy Roberts","Tony Torres","Tracy Logan","Troy Hoover","Twila Rubio","Velma Everett","Vincent Mccormick","Vincenzo Stafford","Vito Clark","Waldo Spencer","Werner Lowe","Werner Shepard","Wesley Ford","Wm Cantu","Zelma Pierce"]
[null,null,null,null,null,"Brianna Mora",{"$f":"IF('Resulting List'!F186=\"\",\"\",'Resulting List'!F186)","v":""},null,{"$f":"TRANSPOSE(_xlfn._xlws.SORT(_xlfn.UNIQUE(_xlfn._xlws.FILTER(Customers[Names],ISNUMBER(SEARCH(Customers[[#This Row],[Search Criteria]],Customers[Names])),\"No data.\"))))","v":"Adriana Todd"},"Albert Ramirez","Alex Rubio","Amanda Beck","Amparo Orozco","Amy Todd","Angelina Roberson","April Fox","Arden Ayala","Arnoldo Pennington","Aubrey Giles","Bette Rivers","Brianna Alexander","Brianna Mora","Britt Vazquez","Broderick Gillespie","Brooke Roman","Calvin Buck","Carmela Mullins","Carol Stevenson","Carolina Russell","Carolyn Roberts","Chelsea Gilbert","Cheryl Williamson","Christa Frederick","Christian Armstrong","Christopher Stuart","Chung Krueger","Clare Whitney","Clarissa Archer","Claudio Lam","Cordell Mills","Craig Shepherd","Damien Kramer","Dane Burke","Danielle Stout","Darrel Liu","Darrin Mcneil","Darron Aguilar","Della Huber","Delores Krause","Dena Rosario","Dominick Johnston","Dona Herring","Dorothy Winters","Douglas Wiley","Doyle David","Earlene Hester","Earline Shepherd","Edwin Sparks","Eli Galvan","Elinor Kaufman","Elroy Porter","Elvin Flynn","Emmitt Porter","Erik Parsons","Ethel Forbes","Felicia Ware","Fidel Haynes","Francisco Valenzuela","Frank Hunt","Gabriela Moore","Gabrielle Patrick","Gale Fitzpatrick","Gayle Curtis","Genevieve Lucero","Gerry Oneal","Grady Ellis","Grover Escobar","Hans Patel","Horacio Black","Humberto Compton","Hunter Short","Ilene Mcguire","Imelda Lloyd","Ira Macdonald","Issac Allen","Jacques Velazquez","Janis Mullins","Janna Cowan","Javier Garner","Jayson Abbott","Jeannie Tapia","Jefferson Lee","Jeramy Keith","Jermaine Bradshaw","Jewel Lee","Jimmie Yang","Jodie Wood","John Cline","Josefina Dickerson","Josie Pineda","Judith Griffin","Julius Soto","Kelli Romero","Kerri Joseph","Kim Mccall","Lakeisha Velazquez","Latonya Logan","Lee Schmidt","Lela Atkins","Leland Robertson","Leonardo House","Leroy Mcintyre","Lesley Blevins","Lilia Berg","Lilly Stone","Lincoln Bond","Lindsay Hurst","Lionel Fuller","Lorene Hunter","Louis Kidd","Lucius Warren","Lucy Mejia","Lupe Ingram","Lynette Fuller","Lynnette Wright","Madge Copeland","Madge Tanner","Mae Sawyer","Malcolm Newman","Mamie Wong","Mandy Swanson","Marcella Everett","Marco Bright","Marcos Schaefer","Marcus Hays","Marina Walsh","Marion Savage","Marylou Bass","Marylou Mccarthy","Mathew Howard","Maurice Jacobson","Mauricio Bautista","Max Smith","Melanie Bridges","Melissa Brandt","Merlin Wu","Michel Simpson","Mickey Kennedy","Mike Sloan","Milton Walsh","Mohamed Allison","Mohammad Christensen","Nadia Macdonald","Naomi Snyder","Ned Lowe","Nettie Leonard","Olive Perkins","Ophelia Morrow","Oren Montes","Orlando Henderson","Owen Buchanan","Paul Norman","Rafael Barrett","Raymond Cochran","Reed Hooper","Reinaldo Houston","Renato Simmons","Rene Calhoun","Reva Hardin","Robert French","Robin Bender","Rodolfo Scott","Roland Blake","Roland Sullivan","Rolf Barnett","Ross Marquez","Ruthie Daugherty","Sandra Potts","Scott Stephenson","Scotty Gonzales","Sean Wiggins","Shana Gallagher","Sharron Montes","Sheryl Lindsey","Socorro Hayden","Solomon Andrade","Stacey Whitehead","Stevie Hale","Stuart Oliver","Stuart Riddle","Tammy Merritt","Theo Wiley","Theresa Murillo","Timothy Roberts","Tony Torres","Tracy Logan","Troy Hoover","Twila Rubio","Velma Everett","Vincent Mccormick","Vincenzo Stafford","Vito Clark","Waldo Spencer","Werner Lowe","Werner Shepard","Wesley Ford","Wm Cantu","Zelma Pierce"]
[null,null,null,null,null,"Julius Soto",{"$f":"IF('Resulting List'!F187=\"\",\"\",'Resulting List'!F187)","v":""},null,{"$f":"TRANSPOSE(_xlfn._xlws.SORT(_xlfn.UNIQUE(_xlfn._xlws.FILTER(Customers[Names],ISNUMBER(SEARCH(Customers[[#This Row],[Search Criteria]],Customers[Names])),\"No data.\"))))","v":"Adriana Todd"},"Albert Ramirez","Alex Rubio","Amanda Beck","Amparo Orozco","Amy Todd","Angelina Roberson","April Fox","Arden Ayala","Arnoldo Pennington","Aubrey Giles","Bette Rivers","Brianna Alexander","Brianna Mora","Britt Vazquez","Broderick Gillespie","Brooke Roman","Calvin Buck","Carmela Mullins","Carol Stevenson","Carolina Russell","Carolyn Roberts","Chelsea Gilbert","Cheryl Williamson","Christa Frederick","Christian Armstrong","Christopher Stuart","Chung Krueger","Clare Whitney","Clarissa Archer","Claudio Lam","Cordell Mills","Craig Shepherd","Damien Kramer","Dane Burke","Danielle Stout","Darrel Liu","Darrin Mcneil","Darron Aguilar","Della Huber","Delores Krause","Dena Rosario","Dominick Johnston","Dona Herring","Dorothy Winters","Douglas Wiley","Doyle David","Earlene Hester","Earline Shepherd","Edwin Sparks","Eli Galvan","Elinor Kaufman","Elroy Porter","Elvin Flynn","Emmitt Porter","Erik Parsons","Ethel Forbes","Felicia Ware","Fidel Haynes","Francisco Valenzuela","Frank Hunt","Gabriela Moore","Gabrielle Patrick","Gale Fitzpatrick","Gayle Curtis","Genevieve Lucero","Gerry Oneal","Grady Ellis","Grover Escobar","Hans Patel","Horacio Black","Humberto Compton","Hunter Short","Ilene Mcguire","Imelda Lloyd","Ira Macdonald","Issac Allen","Jacques Velazquez","Janis Mullins","Janna Cowan","Javier Garner","Jayson Abbott","Jeannie Tapia","Jefferson Lee","Jeramy Keith","Jermaine Bradshaw","Jewel Lee","Jimmie Yang","Jodie Wood","John Cline","Josefina Dickerson","Josie Pineda","Judith Griffin","Julius Soto","Kelli Romero","Kerri Joseph","Kim Mccall","Lakeisha Velazquez","Latonya Logan","Lee Schmidt","Lela Atkins","Leland Robertson","Leonardo House","Leroy Mcintyre","Lesley Blevins","Lilia Berg","Lilly Stone","Lincoln Bond","Lindsay Hurst","Lionel Fuller","Lorene Hunter","Louis Kidd","Lucius Warren","Lucy Mejia","Lupe Ingram","Lynette Fuller","Lynnette Wright","Madge Copeland","Madge Tanner","Mae Sawyer","Malcolm Newman","Mamie Wong","Mandy Swanson","Marcella Everett","Marco Bright","Marcos Schaefer","Marcus Hays","Marina Walsh","Marion Savage","Marylou Bass","Marylou Mccarthy","Mathew Howard","Maurice Jacobson","Mauricio Bautista","Max Smith","Melanie Bridges","Melissa Brandt","Merlin Wu","Michel Simpson","Mickey Kennedy","Mike Sloan","Milton Walsh","Mohamed Allison","Mohammad Christensen","Nadia Macdonald","Naomi Snyder","Ned Lowe","Nettie Leonard","Olive Perkins","Ophelia Morrow","Oren Montes","Orlando Henderson","Owen Buchanan","Paul Norman","Rafael Barrett","Raymond Cochran","Reed Hooper","Reinaldo Houston","Renato Simmons","Rene Calhoun","Reva Hardin","Robert French","Robin Bender","Rodolfo Scott","Roland Blake","Roland Sullivan","Rolf Barnett","Ross Marquez","Ruthie Daugherty","Sandra Potts","Scott Stephenson","Scotty Gonzales","Sean Wiggins","Shana Gallagher","Sharron Montes","Sheryl Lindsey","Socorro Hayden","Solomon Andrade","Stacey Whitehead","Stevie Hale","Stuart Oliver","Stuart Riddle","Tammy Merritt","Theo Wiley","Theresa Murillo","Timothy Roberts","Tony Torres","Tracy Logan","Troy Hoover","Twila Rubio","Velma Everett","Vincent Mccormick","Vincenzo Stafford","Vito Clark","Waldo Spencer","Werner Lowe","Werner Shepard","Wesley Ford","Wm Cantu","Zelma Pierce"]
[null,null,null,null,null,"Mauricio Bautista",{"$f":"IF('Resulting List'!F188=\"\",\"\",'Resulting List'!F188)","v":""},null,{"$f":"TRANSPOSE(_xlfn._xlws.SORT(_xlfn.UNIQUE(_xlfn._xlws.FILTER(Customers[Names],ISNUMBER(SEARCH(Customers[[#This Row],[Search Criteria]],Customers[Names])),\"No data.\"))))","v":"Adriana Todd"},"Albert Ramirez","Alex Rubio","Amanda Beck","Amparo Orozco","Amy Todd","Angelina Roberson","April Fox","Arden Ayala","Arnoldo Pennington","Aubrey Giles","Bette Rivers","Brianna Alexander","Brianna Mora","Britt Vazquez","Broderick Gillespie","Brooke Roman","Calvin Buck","Carmela Mullins","Carol Stevenson","Carolina Russell","Carolyn Roberts","Chelsea Gilbert","Cheryl Williamson","Christa Frederick","Christian Armstrong","Christopher Stuart","Chung Krueger","Clare Whitney","Clarissa Archer","Claudio Lam","Cordell Mills","Craig Shepherd","Damien Kramer","Dane Burke","Danielle Stout","Darrel Liu","Darrin Mcneil","Darron Aguilar","Della Huber","Delores Krause","Dena Rosario","Dominick Johnston","Dona Herring","Dorothy Winters","Douglas Wiley","Doyle David","Earlene Hester","Earline Shepherd","Edwin Sparks","Eli Galvan","Elinor Kaufman","Elroy Porter","Elvin Flynn","Emmitt Porter","Erik Parsons","Ethel Forbes","Felicia Ware","Fidel Haynes","Francisco Valenzuela","Frank Hunt","Gabriela Moore","Gabrielle Patrick","Gale Fitzpatrick","Gayle Curtis","Genevieve Lucero","Gerry Oneal","Grady Ellis","Grover Escobar","Hans Patel","Horacio Black","Humberto Compton","Hunter Short","Ilene Mcguire","Imelda Lloyd","Ira Macdonald","Issac Allen","Jacques Velazquez","Janis Mullins","Janna Cowan","Javier Garner","Jayson Abbott","Jeannie Tapia","Jefferson Lee","Jeramy Keith","Jermaine Bradshaw","Jewel Lee","Jimmie Yang","Jodie Wood","John Cline","Josefina Dickerson","Josie Pineda","Judith Griffin","Julius Soto","Kelli Romero","Kerri Joseph","Kim Mccall","Lakeisha Velazquez","Latonya Logan","Lee Schmidt","Lela Atkins","Leland Robertson","Leonardo House","Leroy Mcintyre","Lesley Blevins","Lilia Berg","Lilly Stone","Lincoln Bond","Lindsay Hurst","Lionel Fuller","Lorene Hunter","Louis Kidd","Lucius Warren","Lucy Mejia","Lupe Ingram","Lynette Fuller","Lynnette Wright","Madge Copeland","Madge Tanner","Mae Sawyer","Malcolm Newman","Mamie Wong","Mandy Swanson","Marcella Everett","Marco Bright","Marcos Schaefer","Marcus Hays","Marina Walsh","Marion Savage","Marylou Bass","Marylou Mccarthy","Mathew Howard","Maurice Jacobson","Mauricio Bautista","Max Smith","Melanie Bridges","Melissa Brandt","Merlin Wu","Michel Simpson","Mickey Kennedy","Mike Sloan","Milton Walsh","Mohamed Allison","Mohammad Christensen","Nadia Macdonald","Naomi Snyder","Ned Lowe","Nettie Leonard","Olive Perkins","Ophelia Morrow","Oren Montes","Orlando Henderson","Owen Buchanan","Paul Norman","Rafael Barrett","Raymond Cochran","Reed Hooper","Reinaldo Houston","Renato Simmons","Rene Calhoun","Reva Hardin","Robert French","Robin Bender","Rodolfo Scott","Roland Blake","Roland Sullivan","Rolf Barnett","Ross Marquez","Ruthie Daugherty","Sandra Potts","Scott Stephenson","Scotty Gonzales","Sean Wiggins","Shana Gallagher","Sharron Montes","Sheryl Lindsey","Socorro Hayden","Solomon Andrade","Stacey Whitehead","Stevie Hale","Stuart Oliver","Stuart Riddle","Tammy Merritt","Theo Wiley","Theresa Murillo","Timothy Roberts","Tony Torres","Tracy Logan","Troy Hoover","Twila Rubio","Velma Everett","Vincent Mccormick","Vincenzo Stafford","Vito Clark","Waldo Spencer","Werner Lowe","Werner Shepard","Wesley Ford","Wm Cantu","Zelma Pierce"]
[null,null,null,null,null,"Socorro Hayden",{"$f":"IF('Resulting List'!F189=\"\",\"\",'Resulting List'!F189)","v":""},null,{"$f":"TRANSPOSE(_xlfn._xlws.SORT(_xlfn.UNIQUE(_xlfn._xlws.FILTER(Customers[Names],ISNUMBER(SEARCH(Customers[[#This Row],[Search Criteria]],Customers[Names])),\"No data.\"))))","v":"Adriana Todd"},"Albert Ramirez","Alex Rubio","Amanda Beck","Amparo Orozco","Amy Todd","Angelina Roberson","April Fox","Arden Ayala","Arnoldo Pennington","Aubrey Giles","Bette Rivers","Brianna Alexander","Brianna Mora","Britt Vazquez","Broderick Gillespie","Brooke Roman","Calvin Buck","Carmela Mullins","Carol Stevenson","Carolina Russell","Carolyn Roberts","Chelsea Gilbert","Cheryl Williamson","Christa Frederick","Christian Armstrong","Christopher Stuart","Chung Krueger","Clare Whitney","Clarissa Archer","Claudio Lam","Cordell Mills","Craig Shepherd","Damien Kramer","Dane Burke","Danielle Stout","Darrel Liu","Darrin Mcneil","Darron Aguilar","Della Huber","Delores Krause","Dena Rosario","Dominick Johnston","Dona Herring","Dorothy Winters","Douglas Wiley","Doyle David","Earlene Hester","Earline Shepherd","Edwin Sparks","Eli Galvan","Elinor Kaufman","Elroy Porter","Elvin Flynn","Emmitt Porter","Erik Parsons","Ethel Forbes","Felicia Ware","Fidel Haynes","Francisco Valenzuela","Frank Hunt","Gabriela Moore","Gabrielle Patrick","Gale Fitzpatrick","Gayle Curtis","Genevieve Lucero","Gerry Oneal","Grady Ellis","Grover Escobar","Hans Patel","Horacio Black","Humberto Compton","Hunter Short","Ilene Mcguire","Imelda Lloyd","Ira Macdonald","Issac Allen","Jacques Velazquez","Janis Mullins","Janna Cowan","Javier Garner","Jayson Abbott","Jeannie Tapia","Jefferson Lee","Jeramy Keith","Jermaine Bradshaw","Jewel Lee","Jimmie Yang","Jodie Wood","John Cline","Josefina Dickerson","Josie Pineda","Judith Griffin","Julius Soto","Kelli Romero","Kerri Joseph","Kim Mccall","Lakeisha Velazquez","Latonya Logan","Lee Schmidt","Lela Atkins","Leland Robertson","Leonardo House","Leroy Mcintyre","Lesley Blevins","Lilia Berg","Lilly Stone","Lincoln Bond","Lindsay Hurst","Lionel Fuller","Lorene Hunter","Louis Kidd","Lucius Warren","Lucy Mejia","Lupe Ingram","Lynette Fuller","Lynnette Wright","Madge Copeland","Madge Tanner","Mae Sawyer","Malcolm Newman","Mamie Wong","Mandy Swanson","Marcella Everett","Marco Bright","Marcos Schaefer","Marcus Hays","Marina Walsh","Marion Savage","Marylou Bass","Marylou Mccarthy","Mathew Howard","Maurice Jacobson","Mauricio Bautista","Max Smith","Melanie Bridges","Melissa Brandt","Merlin Wu","Michel Simpson","Mickey Kennedy","Mike Sloan","Milton Walsh","Mohamed Allison","Mohammad Christensen","Nadia Macdonald","Naomi Snyder","Ned Lowe","Nettie Leonard","Olive Perkins","Ophelia Morrow","Oren Montes","Orlando Henderson","Owen Buchanan","Paul Norman","Rafael Barrett","Raymond Cochran","Reed Hooper","Reinaldo Houston","Renato Simmons","Rene Calhoun","Reva Hardin","Robert French","Robin Bender","Rodolfo Scott","Roland Blake","Roland Sullivan","Rolf Barnett","Ross Marquez","Ruthie Daugherty","Sandra Potts","Scott Stephenson","Scotty Gonzales","Sean Wiggins","Shana Gallagher","Sharron Montes","Sheryl Lindsey","Socorro Hayden","Solomon Andrade","Stacey Whitehead","Stevie Hale","Stuart Oliver","Stuart Riddle","Tammy Merritt","Theo Wiley","Theresa Murillo","Timothy Roberts","Tony Torres","Tracy Logan","Troy Hoover","Twila Rubio","Velma Everett","Vincent Mccormick","Vincenzo Stafford","Vito Clark","Waldo Spencer","Werner Lowe","Werner Shepard","Wesley Ford","Wm Cantu","Zelma Pierce"]
[null,null,null,null,null,"Theo Wiley",{"$f":"IF('Resulting List'!F190=\"\",\"\",'Resulting List'!F190)","v":""},null,{"$f":"TRANSPOSE(_xlfn._xlws.SORT(_xlfn.UNIQUE(_xlfn._xlws.FILTER(Customers[Names],ISNUMBER(SEARCH(Customers[[#This Row],[Search Criteria]],Customers[Names])),\"No data.\"))))","v":"Adriana Todd"},"Albert Ramirez","Alex Rubio","Amanda Beck","Amparo Orozco","Amy Todd","Angelina Roberson","April Fox","Arden Ayala","Arnoldo Pennington","Aubrey Giles","Bette Rivers","Brianna Alexander","Brianna Mora","Britt Vazquez","Broderick Gillespie","Brooke Roman","Calvin Buck","Carmela Mullins","Carol Stevenson","Carolina Russell","Carolyn Roberts","Chelsea Gilbert","Cheryl Williamson","Christa Frederick","Christian Armstrong","Christopher Stuart","Chung Krueger","Clare Whitney","Clarissa Archer","Claudio Lam","Cordell Mills","Craig Shepherd","Damien Kramer","Dane Burke","Danielle Stout","Darrel Liu","Darrin Mcneil","Darron Aguilar","Della Huber","Delores Krause","Dena Rosario","Dominick Johnston","Dona Herring","Dorothy Winters","Douglas Wiley","Doyle David","Earlene Hester","Earline Shepherd","Edwin Sparks","Eli Galvan","Elinor Kaufman","Elroy Porter","Elvin Flynn","Emmitt Porter","Erik Parsons","Ethel Forbes","Felicia Ware","Fidel Haynes","Francisco Valenzuela","Frank Hunt","Gabriela Moore","Gabrielle Patrick","Gale Fitzpatrick","Gayle Curtis","Genevieve Lucero","Gerry Oneal","Grady Ellis","Grover Escobar","Hans Patel","Horacio Black","Humberto Compton","Hunter Short","Ilene Mcguire","Imelda Lloyd","Ira Macdonald","Issac Allen","Jacques Velazquez","Janis Mullins","Janna Cowan","Javier Garner","Jayson Abbott","Jeannie Tapia","Jefferson Lee","Jeramy Keith","Jermaine Bradshaw","Jewel Lee","Jimmie Yang","Jodie Wood","John Cline","Josefina Dickerson","Josie Pineda","Judith Griffin","Julius Soto","Kelli Romero","Kerri Joseph","Kim Mccall","Lakeisha Velazquez","Latonya Logan","Lee Schmidt","Lela Atkins","Leland Robertson","Leonardo House","Leroy Mcintyre","Lesley Blevins","Lilia Berg","Lilly Stone","Lincoln Bond","Lindsay Hurst","Lionel Fuller","Lorene Hunter","Louis Kidd","Lucius Warren","Lucy Mejia","Lupe Ingram","Lynette Fuller","Lynnette Wright","Madge Copeland","Madge Tanner","Mae Sawyer","Malcolm Newman","Mamie Wong","Mandy Swanson","Marcella Everett","Marco Bright","Marcos Schaefer","Marcus Hays","Marina Walsh","Marion Savage","Marylou Bass","Marylou Mccarthy","Mathew Howard","Maurice Jacobson","Mauricio Bautista","Max Smith","Melanie Bridges","Melissa Brandt","Merlin Wu","Michel Simpson","Mickey Kennedy","Mike Sloan","Milton Walsh","Mohamed Allison","Mohammad Christensen","Nadia Macdonald","Naomi Snyder","Ned Lowe","Nettie Leonard","Olive Perkins","Ophelia Morrow","Oren Montes","Orlando Henderson","Owen Buchanan","Paul Norman","Rafael Barrett","Raymond Cochran","Reed Hooper","Reinaldo Houston","Renato Simmons","Rene Calhoun","Reva Hardin","Robert French","Robin Bender","Rodolfo Scott","Roland Blake","Roland Sullivan","Rolf Barnett","Ross Marquez","Ruthie Daugherty","Sandra Potts","Scott Stephenson","Scotty Gonzales","Sean Wiggins","Shana Gallagher","Sharron Montes","Sheryl Lindsey","Socorro Hayden","Solomon Andrade","Stacey Whitehead","Stevie Hale","Stuart Oliver","Stuart Riddle","Tammy Merritt","Theo Wiley","Theresa Murillo","Timothy Roberts","Tony Torres","Tracy Logan","Troy Hoover","Twila Rubio","Velma Everett","Vincent Mccormick","Vincenzo Stafford","Vito Clark","Waldo Spencer","Werner Lowe","Werner Shepard","Wesley Ford","Wm Cantu","Zelma Pierce"]
[null,null,null,null,null,"Werner Shepard",{"$f":"IF('Resulting List'!F191=\"\",\"\",'Resulting List'!F191)","v":""},null,{"$f":"TRANSPOSE(_xlfn._xlws.SORT(_xlfn.UNIQUE(_xlfn._xlws.FILTER(Customers[Names],ISNUMBER(SEARCH(Customers[[#This Row],[Search Criteria]],Customers[Names])),\"No data.\"))))","v":"Adriana Todd"},"Albert Ramirez","Alex Rubio","Amanda Beck","Amparo Orozco","Amy Todd","Angelina Roberson","April Fox","Arden Ayala","Arnoldo Pennington","Aubrey Giles","Bette Rivers","Brianna Alexander","Brianna Mora","Britt Vazquez","Broderick Gillespie","Brooke Roman","Calvin Buck","Carmela Mullins","Carol Stevenson","Carolina Russell","Carolyn Roberts","Chelsea Gilbert","Cheryl Williamson","Christa Frederick","Christian Armstrong","Christopher Stuart","Chung Krueger","Clare Whitney","Clarissa Archer","Claudio Lam","Cordell Mills","Craig Shepherd","Damien Kramer","Dane Burke","Danielle Stout","Darrel Liu","Darrin Mcneil","Darron Aguilar","Della Huber","Delores Krause","Dena Rosario","Dominick Johnston","Dona Herring","Dorothy Winters","Douglas Wiley","Doyle David","Earlene Hester","Earline Shepherd","Edwin Sparks","Eli Galvan","Elinor Kaufman","Elroy Porter","Elvin Flynn","Emmitt Porter","Erik Parsons","Ethel Forbes","Felicia Ware","Fidel Haynes","Francisco Valenzuela","Frank Hunt","Gabriela Moore","Gabrielle Patrick","Gale Fitzpatrick","Gayle Curtis","Genevieve Lucero","Gerry Oneal","Grady Ellis","Grover Escobar","Hans Patel","Horacio Black","Humberto Compton","Hunter Short","Ilene Mcguire","Imelda Lloyd","Ira Macdonald","Issac Allen","Jacques Velazquez","Janis Mullins","Janna Cowan","Javier Garner","Jayson Abbott","Jeannie Tapia","Jefferson Lee","Jeramy Keith","Jermaine Bradshaw","Jewel Lee","Jimmie Yang","Jodie Wood","John Cline","Josefina Dickerson","Josie Pineda","Judith Griffin","Julius Soto","Kelli Romero","Kerri Joseph","Kim Mccall","Lakeisha Velazquez","Latonya Logan","Lee Schmidt","Lela Atkins","Leland Robertson","Leonardo House","Leroy Mcintyre","Lesley Blevins","Lilia Berg","Lilly Stone","Lincoln Bond","Lindsay Hurst","Lionel Fuller","Lorene Hunter","Louis Kidd","Lucius Warren","Lucy Mejia","Lupe Ingram","Lynette Fuller","Lynnette Wright","Madge Copeland","Madge Tanner","Mae Sawyer","Malcolm Newman","Mamie Wong","Mandy Swanson","Marcella Everett","Marco Bright","Marcos Schaefer","Marcus Hays","Marina Walsh","Marion Savage","Marylou Bass","Marylou Mccarthy","Mathew Howard","Maurice Jacobson","Mauricio Bautista","Max Smith","Melanie Bridges","Melissa Brandt","Merlin Wu","Michel Simpson","Mickey Kennedy","Mike Sloan","Milton Walsh","Mohamed Allison","Mohammad Christensen","Nadia Macdonald","Naomi Snyder","Ned Lowe","Nettie Leonard","Olive Perkins","Ophelia Morrow","Oren Montes","Orlando Henderson","Owen Buchanan","Paul Norman","Rafael Barrett","Raymond Cochran","Reed Hooper","Reinaldo Houston","Renato Simmons","Rene Calhoun","Reva Hardin","Robert French","Robin Bender","Rodolfo Scott","Roland Blake","Roland Sullivan","Rolf Barnett","Ross Marquez","Ruthie Daugherty","Sandra Potts","Scott Stephenson","Scotty Gonzales","Sean Wiggins","Shana Gallagher","Sharron Montes","Sheryl Lindsey","Socorro Hayden","Solomon Andrade","Stacey Whitehead","Stevie Hale","Stuart Oliver","Stuart Riddle","Tammy Merritt","Theo Wiley","Theresa Murillo","Timothy Roberts","Tony Torres","Tracy Logan","Troy Hoover","Twila Rubio","Velma Everett","Vincent Mccormick","Vincenzo Stafford","Vito Clark","Waldo Spencer","Werner Lowe","Werner Shepard","Wesley Ford","Wm Cantu","Zelma Pierce"]
[null,null,null,null,null,"Ilene Mcguire",{"$f":"IF('Resulting List'!F192=\"\",\"\",'Resulting List'!F192)","v":""},null,{"$f":"TRANSPOSE(_xlfn._xlws.SORT(_xlfn.UNIQUE(_xlfn._xlws.FILTER(Customers[Names],ISNUMBER(SEARCH(Customers[[#This Row],[Search Criteria]],Customers[Names])),\"No data.\"))))","v":"Adriana Todd"},"Albert Ramirez","Alex Rubio","Amanda Beck","Amparo Orozco","Amy Todd","Angelina Roberson","April Fox","Arden Ayala","Arnoldo Pennington","Aubrey Giles","Bette Rivers","Brianna Alexander","Brianna Mora","Britt Vazquez","Broderick Gillespie","Brooke Roman","Calvin Buck","Carmela Mullins","Carol Stevenson","Carolina Russell","Carolyn Roberts","Chelsea Gilbert","Cheryl Williamson","Christa Frederick","Christian Armstrong","Christopher Stuart","Chung Krueger","Clare Whitney","Clarissa Archer","Claudio Lam","Cordell Mills","Craig Shepherd","Damien Kramer","Dane Burke","Danielle Stout","Darrel Liu","Darrin Mcneil","Darron Aguilar","Della Huber","Delores Krause","Dena Rosario","Dominick Johnston","Dona Herring","Dorothy Winters","Douglas Wiley","Doyle David","Earlene Hester","Earline Shepherd","Edwin Sparks","Eli Galvan","Elinor Kaufman","Elroy Porter","Elvin Flynn","Emmitt Porter","Erik Parsons","Ethel Forbes","Felicia Ware","Fidel Haynes","Francisco Valenzuela","Frank Hunt","Gabriela Moore","Gabrielle Patrick","Gale Fitzpatrick","Gayle Curtis","Genevieve Lucero","Gerry Oneal","Grady Ellis","Grover Escobar","Hans Patel","Horacio Black","Humberto Compton","Hunter Short","Ilene Mcguire","Imelda Lloyd","Ira Macdonald","Issac Allen","Jacques Velazquez","Janis Mullins","Janna Cowan","Javier Garner","Jayson Abbott","Jeannie Tapia","Jefferson Lee","Jeramy Keith","Jermaine Bradshaw","Jewel Lee","Jimmie Yang","Jodie Wood","John Cline","Josefina Dickerson","Josie Pineda","Judith Griffin","Julius Soto","Kelli Romero","Kerri Joseph","Kim Mccall","Lakeisha Velazquez","Latonya Logan","Lee Schmidt","Lela Atkins","Leland Robertson","Leonardo House","Leroy Mcintyre","Lesley Blevins","Lilia Berg","Lilly Stone","Lincoln Bond","Lindsay Hurst","Lionel Fuller","Lorene Hunter","Louis Kidd","Lucius Warren","Lucy Mejia","Lupe Ingram","Lynette Fuller","Lynnette Wright","Madge Copeland","Madge Tanner","Mae Sawyer","Malcolm Newman","Mamie Wong","Mandy Swanson","Marcella Everett","Marco Bright","Marcos Schaefer","Marcus Hays","Marina Walsh","Marion Savage","Marylou Bass","Marylou Mccarthy","Mathew Howard","Maurice Jacobson","Mauricio Bautista","Max Smith","Melanie Bridges","Melissa Brandt","Merlin Wu","Michel Simpson","Mickey Kennedy","Mike Sloan","Milton Walsh","Mohamed Allison","Mohammad Christensen","Nadia Macdonald","Naomi Snyder","Ned Lowe","Nettie Leonard","Olive Perkins","Ophelia Morrow","Oren Montes","Orlando Henderson","Owen Buchanan","Paul Norman","Rafael Barrett","Raymond Cochran","Reed Hooper","Reinaldo Houston","Renato Simmons","Rene Calhoun","Reva Hardin","Robert French","Robin Bender","Rodolfo Scott","Roland Blake","Roland Sullivan","Rolf Barnett","Ross Marquez","Ruthie Daugherty","Sandra Potts","Scott Stephenson","Scotty Gonzales","Sean Wiggins","Shana Gallagher","Sharron Montes","Sheryl Lindsey","Socorro Hayden","Solomon Andrade","Stacey Whitehead","Stevie Hale","Stuart Oliver","Stuart Riddle","Tammy Merritt","Theo Wiley","Theresa Murillo","Timothy Roberts","Tony Torres","Tracy Logan","Troy Hoover","Twila Rubio","Velma Everett","Vincent Mccormick","Vincenzo Stafford","Vito Clark","Waldo Spencer","Werner Lowe","Werner Shepard","Wesley Ford","Wm Cantu","Zelma Pierce"]
[null,null,null,null,null,"Vincent Mccormick",{"$f":"IF('Resulting List'!F193=\"\",\"\",'Resulting List'!F193)","v":""},null,{"$f":"TRANSPOSE(_xlfn._xlws.SORT(_xlfn.UNIQUE(_xlfn._xlws.FILTER(Customers[Names],ISNUMBER(SEARCH(Customers[[#This Row],[Search Criteria]],Customers[Names])),\"No data.\"))))","v":"Adriana Todd"},"Albert Ramirez","Alex Rubio","Amanda Beck","Amparo Orozco","Amy Todd","Angelina Roberson","April Fox","Arden Ayala","Arnoldo Pennington","Aubrey Giles","Bette Rivers","Brianna Alexander","Brianna Mora","Britt Vazquez","Broderick Gillespie","Brooke Roman","Calvin Buck","Carmela Mullins","Carol Stevenson","Carolina Russell","Carolyn Roberts","Chelsea Gilbert","Cheryl Williamson","Christa Frederick","Christian Armstrong","Christopher Stuart","Chung Krueger","Clare Whitney","Clarissa Archer","Claudio Lam","Cordell Mills","Craig Shepherd","Damien Kramer","Dane Burke","Danielle Stout","Darrel Liu","Darrin Mcneil","Darron Aguilar","Della Huber","Delores Krause","Dena Rosario","Dominick Johnston","Dona Herring","Dorothy Winters","Douglas Wiley","Doyle David","Earlene Hester","Earline Shepherd","Edwin Sparks","Eli Galvan","Elinor Kaufman","Elroy Porter","Elvin Flynn","Emmitt Porter","Erik Parsons","Ethel Forbes","Felicia Ware","Fidel Haynes","Francisco Valenzuela","Frank Hunt","Gabriela Moore","Gabrielle Patrick","Gale Fitzpatrick","Gayle Curtis","Genevieve Lucero","Gerry Oneal","Grady Ellis","Grover Escobar","Hans Patel","Horacio Black","Humberto Compton","Hunter Short","Ilene Mcguire","Imelda Lloyd","Ira Macdonald","Issac Allen","Jacques Velazquez","Janis Mullins","Janna Cowan","Javier Garner","Jayson Abbott","Jeannie Tapia","Jefferson Lee","Jeramy Keith","Jermaine Bradshaw","Jewel Lee","Jimmie Yang","Jodie Wood","John Cline","Josefina Dickerson","Josie Pineda","Judith Griffin","Julius Soto","Kelli Romero","Kerri Joseph","Kim Mccall","Lakeisha Velazquez","Latonya Logan","Lee Schmidt","Lela Atkins","Leland Robertson","Leonardo House","Leroy Mcintyre","Lesley Blevins","Lilia Berg","Lilly Stone","Lincoln Bond","Lindsay Hurst","Lionel Fuller","Lorene Hunter","Louis Kidd","Lucius Warren","Lucy Mejia","Lupe Ingram","Lynette Fuller","Lynnette Wright","Madge Copeland","Madge Tanner","Mae Sawyer","Malcolm Newman","Mamie Wong","Mandy Swanson","Marcella Everett","Marco Bright","Marcos Schaefer","Marcus Hays","Marina Walsh","Marion Savage","Marylou Bass","Marylou Mccarthy","Mathew Howard","Maurice Jacobson","Mauricio Bautista","Max Smith","Melanie Bridges","Melissa Brandt","Merlin Wu","Michel Simpson","Mickey Kennedy","Mike Sloan","Milton Walsh","Mohamed Allison","Mohammad Christensen","Nadia Macdonald","Naomi Snyder","Ned Lowe","Nettie Leonard","Olive Perkins","Ophelia Morrow","Oren Montes","Orlando Henderson","Owen Buchanan","Paul Norman","Rafael Barrett","Raymond Cochran","Reed Hooper","Reinaldo Houston","Renato Simmons","Rene Calhoun","Reva Hardin","Robert French","Robin Bender","Rodolfo Scott","Roland Blake","Roland Sullivan","Rolf Barnett","Ross Marquez","Ruthie Daugherty","Sandra Potts","Scott Stephenson","Scotty Gonzales","Sean Wiggins","Shana Gallagher","Sharron Montes","Sheryl Lindsey","Socorro Hayden","Solomon Andrade","Stacey Whitehead","Stevie Hale","Stuart Oliver","Stuart Riddle","Tammy Merritt","Theo Wiley","Theresa Murillo","Timothy Roberts","Tony Torres","Tracy Logan","Troy Hoover","Twila Rubio","Velma Everett","Vincent Mccormick","Vincenzo Stafford","Vito Clark","Waldo Spencer","Werner Lowe","Werner Shepard","Wesley Ford","Wm Cantu","Zelma Pierce"]
[null,null,null,null,null,"Humberto Compton",{"$f":"IF('Resulting List'!F194=\"\",\"\",'Resulting List'!F194)","v":""},null,{"$f":"TRANSPOSE(_xlfn._xlws.SORT(_xlfn.UNIQUE(_xlfn._xlws.FILTER(Customers[Names],ISNUMBER(SEARCH(Customers[[#This Row],[Search Criteria]],Customers[Names])),\"No data.\"))))","v":"Adriana Todd"},"Albert Ramirez","Alex Rubio","Amanda Beck","Amparo Orozco","Amy Todd","Angelina Roberson","April Fox","Arden Ayala","Arnoldo Pennington","Aubrey Giles","Bette Rivers","Brianna Alexander","Brianna Mora","Britt Vazquez","Broderick Gillespie","Brooke Roman","Calvin Buck","Carmela Mullins","Carol Stevenson","Carolina Russell","Carolyn Roberts","Chelsea Gilbert","Cheryl Williamson","Christa Frederick","Christian Armstrong","Christopher Stuart","Chung Krueger","Clare Whitney","Clarissa Archer","Claudio Lam","Cordell Mills","Craig Shepherd","Damien Kramer","Dane Burke","Danielle Stout","Darrel Liu","Darrin Mcneil","Darron Aguilar","Della Huber","Delores Krause","Dena Rosario","Dominick Johnston","Dona Herring","Dorothy Winters","Douglas Wiley","Doyle David","Earlene Hester","Earline Shepherd","Edwin Sparks","Eli Galvan","Elinor Kaufman","Elroy Porter","Elvin Flynn","Emmitt Porter","Erik Parsons","Ethel Forbes","Felicia Ware","Fidel Haynes","Francisco Valenzuela","Frank Hunt","Gabriela Moore","Gabrielle Patrick","Gale Fitzpatrick","Gayle Curtis","Genevieve Lucero","Gerry Oneal","Grady Ellis","Grover Escobar","Hans Patel","Horacio Black","Humberto Compton","Hunter Short","Ilene Mcguire","Imelda Lloyd","Ira Macdonald","Issac Allen","Jacques Velazquez","Janis Mullins","Janna Cowan","Javier Garner","Jayson Abbott","Jeannie Tapia","Jefferson Lee","Jeramy Keith","Jermaine Bradshaw","Jewel Lee","Jimmie Yang","Jodie Wood","John Cline","Josefina Dickerson","Josie Pineda","Judith Griffin","Julius Soto","Kelli Romero","Kerri Joseph","Kim Mccall","Lakeisha Velazquez","Latonya Logan","Lee Schmidt","Lela Atkins","Leland Robertson","Leonardo House","Leroy Mcintyre","Lesley Blevins","Lilia Berg","Lilly Stone","Lincoln Bond","Lindsay Hurst","Lionel Fuller","Lorene Hunter","Louis Kidd","Lucius Warren","Lucy Mejia","Lupe Ingram","Lynette Fuller","Lynnette Wright","Madge Copeland","Madge Tanner","Mae Sawyer","Malcolm Newman","Mamie Wong","Mandy Swanson","Marcella Everett","Marco Bright","Marcos Schaefer","Marcus Hays","Marina Walsh","Marion Savage","Marylou Bass","Marylou Mccarthy","Mathew Howard","Maurice Jacobson","Mauricio Bautista","Max Smith","Melanie Bridges","Melissa Brandt","Merlin Wu","Michel Simpson","Mickey Kennedy","Mike Sloan","Milton Walsh","Mohamed Allison","Mohammad Christensen","Nadia Macdonald","Naomi Snyder","Ned Lowe","Nettie Leonard","Olive Perkins","Ophelia Morrow","Oren Montes","Orlando Henderson","Owen Buchanan","Paul Norman","Rafael Barrett","Raymond Cochran","Reed Hooper","Reinaldo Houston","Renato Simmons","Rene Calhoun","Reva Hardin","Robert French","Robin Bender","Rodolfo Scott","Roland Blake","Roland Sullivan","Rolf Barnett","Ross Marquez","Ruthie Daugherty","Sandra Potts","Scott Stephenson","Scotty Gonzales","Sean Wiggins","Shana Gallagher","Sharron Montes","Sheryl Lindsey","Socorro Hayden","Solomon Andrade","Stacey Whitehead","Stevie Hale","Stuart Oliver","Stuart Riddle","Tammy Merritt","Theo Wiley","Theresa Murillo","Timothy Roberts","Tony Torres","Tracy Logan","Troy Hoover","Twila Rubio","Velma Everett","Vincent Mccormick","Vincenzo Stafford","Vito Clark","Waldo Spencer","Werner Lowe","Werner Shepard","Wesley Ford","Wm Cantu","Zelma Pierce"]
[null,null,null,null,null,"Ophelia Morrow",{"$f":"IF('Resulting List'!F195=\"\",\"\",'Resulting List'!F195)","v":""},null,{"$f":"TRANSPOSE(_xlfn._xlws.SORT(_xlfn.UNIQUE(_xlfn._xlws.FILTER(Customers[Names],ISNUMBER(SEARCH(Customers[[#This Row],[Search Criteria]],Customers[Names])),\"No data.\"))))","v":"Adriana Todd"},"Albert Ramirez","Alex Rubio","Amanda Beck","Amparo Orozco","Amy Todd","Angelina Roberson","April Fox","Arden Ayala","Arnoldo Pennington","Aubrey Giles","Bette Rivers","Brianna Alexander","Brianna Mora","Britt Vazquez","Broderick Gillespie","Brooke Roman","Calvin Buck","Carmela Mullins","Carol Stevenson","Carolina Russell","Carolyn Roberts","Chelsea Gilbert","Cheryl Williamson","Christa Frederick","Christian Armstrong","Christopher Stuart","Chung Krueger","Clare Whitney","Clarissa Archer","Claudio Lam","Cordell Mills","Craig Shepherd","Damien Kramer","Dane Burke","Danielle Stout","Darrel Liu","Darrin Mcneil","Darron Aguilar","Della Huber","Delores Krause","Dena Rosario","Dominick Johnston","Dona Herring","Dorothy Winters","Douglas Wiley","Doyle David","Earlene Hester","Earline Shepherd","Edwin Sparks","Eli Galvan","Elinor Kaufman","Elroy Porter","Elvin Flynn","Emmitt Porter","Erik Parsons","Ethel Forbes","Felicia Ware","Fidel Haynes","Francisco Valenzuela","Frank Hunt","Gabriela Moore","Gabrielle Patrick","Gale Fitzpatrick","Gayle Curtis","Genevieve Lucero","Gerry Oneal","Grady Ellis","Grover Escobar","Hans Patel","Horacio Black","Humberto Compton","Hunter Short","Ilene Mcguire","Imelda Lloyd","Ira Macdonald","Issac Allen","Jacques Velazquez","Janis Mullins","Janna Cowan","Javier Garner","Jayson Abbott","Jeannie Tapia","Jefferson Lee","Jeramy Keith","Jermaine Bradshaw","Jewel Lee","Jimmie Yang","Jodie Wood","John Cline","Josefina Dickerson","Josie Pineda","Judith Griffin","Julius Soto","Kelli Romero","Kerri Joseph","Kim Mccall","Lakeisha Velazquez","Latonya Logan","Lee Schmidt","Lela Atkins","Leland Robertson","Leonardo House","Leroy Mcintyre","Lesley Blevins","Lilia Berg","Lilly Stone","Lincoln Bond","Lindsay Hurst","Lionel Fuller","Lorene Hunter","Louis Kidd","Lucius Warren","Lucy Mejia","Lupe Ingram","Lynette Fuller","Lynnette Wright","Madge Copeland","Madge Tanner","Mae Sawyer","Malcolm Newman","Mamie Wong","Mandy Swanson","Marcella Everett","Marco Bright","Marcos Schaefer","Marcus Hays","Marina Walsh","Marion Savage","Marylou Bass","Marylou Mccarthy","Mathew Howard","Maurice Jacobson","Mauricio Bautista","Max Smith","Melanie Bridges","Melissa Brandt","Merlin Wu","Michel Simpson","Mickey Kennedy","Mike Sloan","Milton Walsh","Mohamed Allison","Mohammad Christensen","Nadia Macdonald","Naomi Snyder","Ned Lowe","Nettie Leonard","Olive Perkins","Ophelia Morrow","Oren Montes","Orlando Henderson","Owen Buchanan","Paul Norman","Rafael Barrett","Raymond Cochran","Reed Hooper","Reinaldo Houston","Renato Simmons","Rene Calhoun","Reva Hardin","Robert French","Robin Bender","Rodolfo Scott","Roland Blake","Roland Sullivan","Rolf Barnett","Ross Marquez","Ruthie Daugherty","Sandra Potts","Scott Stephenson","Scotty Gonzales","Sean Wiggins","Shana Gallagher","Sharron Montes","Sheryl Lindsey","Socorro Hayden","Solomon Andrade","Stacey Whitehead","Stevie Hale","Stuart Oliver","Stuart Riddle","Tammy Merritt","Theo Wiley","Theresa Murillo","Timothy Roberts","Tony Torres","Tracy Logan","Troy Hoover","Twila Rubio","Velma Everett","Vincent Mccormick","Vincenzo Stafford","Vito Clark","Waldo Spencer","Werner Lowe","Werner Shepard","Wesley Ford","Wm Cantu","Zelma Pierce"]
[null,null,null,null,null,"Dane Burke",{"$f":"IF('Resulting List'!F196=\"\",\"\",'Resulting List'!F196)","v":""},null,{"$f":"TRANSPOSE(_xlfn._xlws.SORT(_xlfn.UNIQUE(_xlfn._xlws.FILTER(Customers[Names],ISNUMBER(SEARCH(Customers[[#This Row],[Search Criteria]],Customers[Names])),\"No data.\"))))","v":"Adriana Todd"},"Albert Ramirez","Alex Rubio","Amanda Beck","Amparo Orozco","Amy Todd","Angelina Roberson","April Fox","Arden Ayala","Arnoldo Pennington","Aubrey Giles","Bette Rivers","Brianna Alexander","Brianna Mora","Britt Vazquez","Broderick Gillespie","Brooke Roman","Calvin Buck","Carmela Mullins","Carol Stevenson","Carolina Russell","Carolyn Roberts","Chelsea Gilbert","Cheryl Williamson","Christa Frederick","Christian Armstrong","Christopher Stuart","Chung Krueger","Clare Whitney","Clarissa Archer","Claudio Lam","Cordell Mills","Craig Shepherd","Damien Kramer","Dane Burke","Danielle Stout","Darrel Liu","Darrin Mcneil","Darron Aguilar","Della Huber","Delores Krause","Dena Rosario","Dominick Johnston","Dona Herring","Dorothy Winters","Douglas Wiley","Doyle David","Earlene Hester","Earline Shepherd","Edwin Sparks","Eli Galvan","Elinor Kaufman","Elroy Porter","Elvin Flynn","Emmitt Porter","Erik Parsons","Ethel Forbes","Felicia Ware","Fidel Haynes","Francisco Valenzuela","Frank Hunt","Gabriela Moore","Gabrielle Patrick","Gale Fitzpatrick","Gayle Curtis","Genevieve Lucero","Gerry Oneal","Grady Ellis","Grover Escobar","Hans Patel","Horacio Black","Humberto Compton","Hunter Short","Ilene Mcguire","Imelda Lloyd","Ira Macdonald","Issac Allen","Jacques Velazquez","Janis Mullins","Janna Cowan","Javier Garner","Jayson Abbott","Jeannie Tapia","Jefferson Lee","Jeramy Keith","Jermaine Bradshaw","Jewel Lee","Jimmie Yang","Jodie Wood","John Cline","Josefina Dickerson","Josie Pineda","Judith Griffin","Julius Soto","Kelli Romero","Kerri Joseph","Kim Mccall","Lakeisha Velazquez","Latonya Logan","Lee Schmidt","Lela Atkins","Leland Robertson","Leonardo House","Leroy Mcintyre","Lesley Blevins","Lilia Berg","Lilly Stone","Lincoln Bond","Lindsay Hurst","Lionel Fuller","Lorene Hunter","Louis Kidd","Lucius Warren","Lucy Mejia","Lupe Ingram","Lynette Fuller","Lynnette Wright","Madge Copeland","Madge Tanner","Mae Sawyer","Malcolm Newman","Mamie Wong","Mandy Swanson","Marcella Everett","Marco Bright","Marcos Schaefer","Marcus Hays","Marina Walsh","Marion Savage","Marylou Bass","Marylou Mccarthy","Mathew Howard","Maurice Jacobson","Mauricio Bautista","Max Smith","Melanie Bridges","Melissa Brandt","Merlin Wu","Michel Simpson","Mickey Kennedy","Mike Sloan","Milton Walsh","Mohamed Allison","Mohammad Christensen","Nadia Macdonald","Naomi Snyder","Ned Lowe","Nettie Leonard","Olive Perkins","Ophelia Morrow","Oren Montes","Orlando Henderson","Owen Buchanan","Paul Norman","Rafael Barrett","Raymond Cochran","Reed Hooper","Reinaldo Houston","Renato Simmons","Rene Calhoun","Reva Hardin","Robert French","Robin Bender","Rodolfo Scott","Roland Blake","Roland Sullivan","Rolf Barnett","Ross Marquez","Ruthie Daugherty","Sandra Potts","Scott Stephenson","Scotty Gonzales","Sean Wiggins","Shana Gallagher","Sharron Montes","Sheryl Lindsey","Socorro Hayden","Solomon Andrade","Stacey Whitehead","Stevie Hale","Stuart Oliver","Stuart Riddle","Tammy Merritt","Theo Wiley","Theresa Murillo","Timothy Roberts","Tony Torres","Tracy Logan","Troy Hoover","Twila Rubio","Velma Everett","Vincent Mccormick","Vincenzo Stafford","Vito Clark","Waldo Spencer","Werner Lowe","Werner Shepard","Wesley Ford","Wm Cantu","Zelma Pierce"]
[null,null,null,null,null,"Marco Bright",{"$f":"IF('Resulting List'!F197=\"\",\"\",'Resulting List'!F197)","v":""},null,{"$f":"TRANSPOSE(_xlfn._xlws.SORT(_xlfn.UNIQUE(_xlfn._xlws.FILTER(Customers[Names],ISNUMBER(SEARCH(Customers[[#This Row],[Search Criteria]],Customers[Names])),\"No data.\"))))","v":"Adriana Todd"},"Albert Ramirez","Alex Rubio","Amanda Beck","Amparo Orozco","Amy Todd","Angelina Roberson","April Fox","Arden Ayala","Arnoldo Pennington","Aubrey Giles","Bette Rivers","Brianna Alexander","Brianna Mora","Britt Vazquez","Broderick Gillespie","Brooke Roman","Calvin Buck","Carmela Mullins","Carol Stevenson","Carolina Russell","Carolyn Roberts","Chelsea Gilbert","Cheryl Williamson","Christa Frederick","Christian Armstrong","Christopher Stuart","Chung Krueger","Clare Whitney","Clarissa Archer","Claudio Lam","Cordell Mills","Craig Shepherd","Damien Kramer","Dane Burke","Danielle Stout","Darrel Liu","Darrin Mcneil","Darron Aguilar","Della Huber","Delores Krause","Dena Rosario","Dominick Johnston","Dona Herring","Dorothy Winters","Douglas Wiley","Doyle David","Earlene Hester","Earline Shepherd","Edwin Sparks","Eli Galvan","Elinor Kaufman","Elroy Porter","Elvin Flynn","Emmitt Porter","Erik Parsons","Ethel Forbes","Felicia Ware","Fidel Haynes","Francisco Valenzuela","Frank Hunt","Gabriela Moore","Gabrielle Patrick","Gale Fitzpatrick","Gayle Curtis","Genevieve Lucero","Gerry Oneal","Grady Ellis","Grover Escobar","Hans Patel","Horacio Black","Humberto Compton","Hunter Short","Ilene Mcguire","Imelda Lloyd","Ira Macdonald","Issac Allen","Jacques Velazquez","Janis Mullins","Janna Cowan","Javier Garner","Jayson Abbott","Jeannie Tapia","Jefferson Lee","Jeramy Keith","Jermaine Bradshaw","Jewel Lee","Jimmie Yang","Jodie Wood","John Cline","Josefina Dickerson","Josie Pineda","Judith Griffin","Julius Soto","Kelli Romero","Kerri Joseph","Kim Mccall","Lakeisha Velazquez","Latonya Logan","Lee Schmidt","Lela Atkins","Leland Robertson","Leonardo House","Leroy Mcintyre","Lesley Blevins","Lilia Berg","Lilly Stone","Lincoln Bond","Lindsay Hurst","Lionel Fuller","Lorene Hunter","Louis Kidd","Lucius Warren","Lucy Mejia","Lupe Ingram","Lynette Fuller","Lynnette Wright","Madge Copeland","Madge Tanner","Mae Sawyer","Malcolm Newman","Mamie Wong","Mandy Swanson","Marcella Everett","Marco Bright","Marcos Schaefer","Marcus Hays","Marina Walsh","Marion Savage","Marylou Bass","Marylou Mccarthy","Mathew Howard","Maurice Jacobson","Mauricio Bautista","Max Smith","Melanie Bridges","Melissa Brandt","Merlin Wu","Michel Simpson","Mickey Kennedy","Mike Sloan","Milton Walsh","Mohamed Allison","Mohammad Christensen","Nadia Macdonald","Naomi Snyder","Ned Lowe","Nettie Leonard","Olive Perkins","Ophelia Morrow","Oren Montes","Orlando Henderson","Owen Buchanan","Paul Norman","Rafael Barrett","Raymond Cochran","Reed Hooper","Reinaldo Houston","Renato Simmons","Rene Calhoun","Reva Hardin","Robert French","Robin Bender","Rodolfo Scott","Roland Blake","Roland Sullivan","Rolf Barnett","Ross Marquez","Ruthie Daugherty","Sandra Potts","Scott Stephenson","Scotty Gonzales","Sean Wiggins","Shana Gallagher","Sharron Montes","Sheryl Lindsey","Socorro Hayden","Solomon Andrade","Stacey Whitehead","Stevie Hale","Stuart Oliver","Stuart Riddle","Tammy Merritt","Theo Wiley","Theresa Murillo","Timothy Roberts","Tony Torres","Tracy Logan","Troy Hoover","Twila Rubio","Velma Everett","Vincent Mccormick","Vincenzo Stafford","Vito Clark","Waldo Spencer","Werner Lowe","Werner Shepard","Wesley Ford","Wm Cantu","Zelma Pierce"]
[null,null,null,null,null,"Jodie Wood",{"$f":"IF('Resulting List'!F198=\"\",\"\",'Resulting List'!F198)","v":""},null,{"$f":"TRANSPOSE(_xlfn._xlws.SORT(_xlfn.UNIQUE(_xlfn._xlws.FILTER(Customers[Names],ISNUMBER(SEARCH(Customers[[#This Row],[Search Criteria]],Customers[Names])),\"No data.\"))))","v":"Adriana Todd"},"Albert Ramirez","Alex Rubio","Amanda Beck","Amparo Orozco","Amy Todd","Angelina Roberson","April Fox","Arden Ayala","Arnoldo Pennington","Aubrey Giles","Bette Rivers","Brianna Alexander","Brianna Mora","Britt Vazquez","Broderick Gillespie","Brooke Roman","Calvin Buck","Carmela Mullins","Carol Stevenson","Carolina Russell","Carolyn Roberts","Chelsea Gilbert","Cheryl Williamson","Christa Frederick","Christian Armstrong","Christopher Stuart","Chung Krueger","Clare Whitney","Clarissa Archer","Claudio Lam","Cordell Mills","Craig Shepherd","Damien Kramer","Dane Burke","Danielle Stout","Darrel Liu","Darrin Mcneil","Darron Aguilar","Della Huber","Delores Krause","Dena Rosario","Dominick Johnston","Dona Herring","Dorothy Winters","Douglas Wiley","Doyle David","Earlene Hester","Earline Shepherd","Edwin Sparks","Eli Galvan","Elinor Kaufman","Elroy Porter","Elvin Flynn","Emmitt Porter","Erik Parsons","Ethel Forbes","Felicia Ware","Fidel Haynes","Francisco Valenzuela","Frank Hunt","Gabriela Moore","Gabrielle Patrick","Gale Fitzpatrick","Gayle Curtis","Genevieve Lucero","Gerry Oneal","Grady Ellis","Grover Escobar","Hans Patel","Horacio Black","Humberto Compton","Hunter Short","Ilene Mcguire","Imelda Lloyd","Ira Macdonald","Issac Allen","Jacques Velazquez","Janis Mullins","Janna Cowan","Javier Garner","Jayson Abbott","Jeannie Tapia","Jefferson Lee","Jeramy Keith","Jermaine Bradshaw","Jewel Lee","Jimmie Yang","Jodie Wood","John Cline","Josefina Dickerson","Josie Pineda","Judith Griffin","Julius Soto","Kelli Romero","Kerri Joseph","Kim Mccall","Lakeisha Velazquez","Latonya Logan","Lee Schmidt","Lela Atkins","Leland Robertson","Leonardo House","Leroy Mcintyre","Lesley Blevins","Lilia Berg","Lilly Stone","Lincoln Bond","Lindsay Hurst","Lionel Fuller","Lorene Hunter","Louis Kidd","Lucius Warren","Lucy Mejia","Lupe Ingram","Lynette Fuller","Lynnette Wright","Madge Copeland","Madge Tanner","Mae Sawyer","Malcolm Newman","Mamie Wong","Mandy Swanson","Marcella Everett","Marco Bright","Marcos Schaefer","Marcus Hays","Marina Walsh","Marion Savage","Marylou Bass","Marylou Mccarthy","Mathew Howard","Maurice Jacobson","Mauricio Bautista","Max Smith","Melanie Bridges","Melissa Brandt","Merlin Wu","Michel Simpson","Mickey Kennedy","Mike Sloan","Milton Walsh","Mohamed Allison","Mohammad Christensen","Nadia Macdonald","Naomi Snyder","Ned Lowe","Nettie Leonard","Olive Perkins","Ophelia Morrow","Oren Montes","Orlando Henderson","Owen Buchanan","Paul Norman","Rafael Barrett","Raymond Cochran","Reed Hooper","Reinaldo Houston","Renato Simmons","Rene Calhoun","Reva Hardin","Robert French","Robin Bender","Rodolfo Scott","Roland Blake","Roland Sullivan","Rolf Barnett","Ross Marquez","Ruthie Daugherty","Sandra Potts","Scott Stephenson","Scotty Gonzales","Sean Wiggins","Shana Gallagher","Sharron Montes","Sheryl Lindsey","Socorro Hayden","Solomon Andrade","Stacey Whitehead","Stevie Hale","Stuart Oliver","Stuart Riddle","Tammy Merritt","Theo Wiley","Theresa Murillo","Timothy Roberts","Tony Torres","Tracy Logan","Troy Hoover","Twila Rubio","Velma Everett","Vincent Mccormick","Vincenzo Stafford","Vito Clark","Waldo Spencer","Werner Lowe","Werner Shepard","Wesley Ford","Wm Cantu","Zelma Pierce"]
[null,null,null,null,null,"Lucius Warren",{"$f":"IF('Resulting List'!F199=\"\",\"\",'Resulting List'!F199)","v":""},null,{"$f":"TRANSPOSE(_xlfn._xlws.SORT(_xlfn.UNIQUE(_xlfn._xlws.FILTER(Customers[Names],ISNUMBER(SEARCH(Customers[[#This Row],[Search Criteria]],Customers[Names])),\"No data.\"))))","v":"Adriana Todd"},"Albert Ramirez","Alex Rubio","Amanda Beck","Amparo Orozco","Amy Todd","Angelina Roberson","April Fox","Arden Ayala","Arnoldo Pennington","Aubrey Giles","Bette Rivers","Brianna Alexander","Brianna Mora","Britt Vazquez","Broderick Gillespie","Brooke Roman","Calvin Buck","Carmela Mullins","Carol Stevenson","Carolina Russell","Carolyn Roberts","Chelsea Gilbert","Cheryl Williamson","Christa Frederick","Christian Armstrong","Christopher Stuart","Chung Krueger","Clare Whitney","Clarissa Archer","Claudio Lam","Cordell Mills","Craig Shepherd","Damien Kramer","Dane Burke","Danielle Stout","Darrel Liu","Darrin Mcneil","Darron Aguilar","Della Huber","Delores Krause","Dena Rosario","Dominick Johnston","Dona Herring","Dorothy Winters","Douglas Wiley","Doyle David","Earlene Hester","Earline Shepherd","Edwin Sparks","Eli Galvan","Elinor Kaufman","Elroy Porter","Elvin Flynn","Emmitt Porter","Erik Parsons","Ethel Forbes","Felicia Ware","Fidel Haynes","Francisco Valenzuela","Frank Hunt","Gabriela Moore","Gabrielle Patrick","Gale Fitzpatrick","Gayle Curtis","Genevieve Lucero","Gerry Oneal","Grady Ellis","Grover Escobar","Hans Patel","Horacio Black","Humberto Compton","Hunter Short","Ilene Mcguire","Imelda Lloyd","Ira Macdonald","Issac Allen","Jacques Velazquez","Janis Mullins","Janna Cowan","Javier Garner","Jayson Abbott","Jeannie Tapia","Jefferson Lee","Jeramy Keith","Jermaine Bradshaw","Jewel Lee","Jimmie Yang","Jodie Wood","John Cline","Josefina Dickerson","Josie Pineda","Judith Griffin","Julius Soto","Kelli Romero","Kerri Joseph","Kim Mccall","Lakeisha Velazquez","Latonya Logan","Lee Schmidt","Lela Atkins","Leland Robertson","Leonardo House","Leroy Mcintyre","Lesley Blevins","Lilia Berg","Lilly Stone","Lincoln Bond","Lindsay Hurst","Lionel Fuller","Lorene Hunter","Louis Kidd","Lucius Warren","Lucy Mejia","Lupe Ingram","Lynette Fuller","Lynnette Wright","Madge Copeland","Madge Tanner","Mae Sawyer","Malcolm Newman","Mamie Wong","Mandy Swanson","Marcella Everett","Marco Bright","Marcos Schaefer","Marcus Hays","Marina Walsh","Marion Savage","Marylou Bass","Marylou Mccarthy","Mathew Howard","Maurice Jacobson","Mauricio Bautista","Max Smith","Melanie Bridges","Melissa Brandt","Merlin Wu","Michel Simpson","Mickey Kennedy","Mike Sloan","Milton Walsh","Mohamed Allison","Mohammad Christensen","Nadia Macdonald","Naomi Snyder","Ned Lowe","Nettie Leonard","Olive Perkins","Ophelia Morrow","Oren Montes","Orlando Henderson","Owen Buchanan","Paul Norman","Rafael Barrett","Raymond Cochran","Reed Hooper","Reinaldo Houston","Renato Simmons","Rene Calhoun","Reva Hardin","Robert French","Robin Bender","Rodolfo Scott","Roland Blake","Roland Sullivan","Rolf Barnett","Ross Marquez","Ruthie Daugherty","Sandra Potts","Scott Stephenson","Scotty Gonzales","Sean Wiggins","Shana Gallagher","Sharron Montes","Sheryl Lindsey","Socorro Hayden","Solomon Andrade","Stacey Whitehead","Stevie Hale","Stuart Oliver","Stuart Riddle","Tammy Merritt","Theo Wiley","Theresa Murillo","Timothy Roberts","Tony Torres","Tracy Logan","Troy Hoover","Twila Rubio","Velma Everett","Vincent Mccormick","Vincenzo Stafford","Vito Clark","Waldo Spencer","Werner Lowe","Werner Shepard","Wesley Ford","Wm Cantu","Zelma Pierce"]
[null,null,null,null,null,"Roland Blake",{"$f":"IF('Resulting List'!F200=\"\",\"\",'Resulting List'!F200)","v":""},null,{"$f":"TRANSPOSE(_xlfn._xlws.SORT(_xlfn.UNIQUE(_xlfn._xlws.FILTER(Customers[Names],ISNUMBER(SEARCH(Customers[[#This Row],[Search Criteria]],Customers[Names])),\"No data.\"))))","v":"Adriana Todd"},"Albert Ramirez","Alex Rubio","Amanda Beck","Amparo Orozco","Amy Todd","Angelina Roberson","April Fox","Arden Ayala","Arnoldo Pennington","Aubrey Giles","Bette Rivers","Brianna Alexander","Brianna Mora","Britt Vazquez","Broderick Gillespie","Brooke Roman","Calvin Buck","Carmela Mullins","Carol Stevenson","Carolina Russell","Carolyn Roberts","Chelsea Gilbert","Cheryl Williamson","Christa Frederick","Christian Armstrong","Christopher Stuart","Chung Krueger","Clare Whitney","Clarissa Archer","Claudio Lam","Cordell Mills","Craig Shepherd","Damien Kramer","Dane Burke","Danielle Stout","Darrel Liu","Darrin Mcneil","Darron Aguilar","Della Huber","Delores Krause","Dena Rosario","Dominick Johnston","Dona Herring","Dorothy Winters","Douglas Wiley","Doyle David","Earlene Hester","Earline Shepherd","Edwin Sparks","Eli Galvan","Elinor Kaufman","Elroy Porter","Elvin Flynn","Emmitt Porter","Erik Parsons","Ethel Forbes","Felicia Ware","Fidel Haynes","Francisco Valenzuela","Frank Hunt","Gabriela Moore","Gabrielle Patrick","Gale Fitzpatrick","Gayle Curtis","Genevieve Lucero","Gerry Oneal","Grady Ellis","Grover Escobar","Hans Patel","Horacio Black","Humberto Compton","Hunter Short","Ilene Mcguire","Imelda Lloyd","Ira Macdonald","Issac Allen","Jacques Velazquez","Janis Mullins","Janna Cowan","Javier Garner","Jayson Abbott","Jeannie Tapia","Jefferson Lee","Jeramy Keith","Jermaine Bradshaw","Jewel Lee","Jimmie Yang","Jodie Wood","John Cline","Josefina Dickerson","Josie Pineda","Judith Griffin","Julius Soto","Kelli Romero","Kerri Joseph","Kim Mccall","Lakeisha Velazquez","Latonya Logan","Lee Schmidt","Lela Atkins","Leland Robertson","Leonardo House","Leroy Mcintyre","Lesley Blevins","Lilia Berg","Lilly Stone","Lincoln Bond","Lindsay Hurst","Lionel Fuller","Lorene Hunter","Louis Kidd","Lucius Warren","Lucy Mejia","Lupe Ingram","Lynette Fuller","Lynnette Wright","Madge Copeland","Madge Tanner","Mae Sawyer","Malcolm Newman","Mamie Wong","Mandy Swanson","Marcella Everett","Marco Bright","Marcos Schaefer","Marcus Hays","Marina Walsh","Marion Savage","Marylou Bass","Marylou Mccarthy","Mathew Howard","Maurice Jacobson","Mauricio Bautista","Max Smith","Melanie Bridges","Melissa Brandt","Merlin Wu","Michel Simpson","Mickey Kennedy","Mike Sloan","Milton Walsh","Mohamed Allison","Mohammad Christensen","Nadia Macdonald","Naomi Snyder","Ned Lowe","Nettie Leonard","Olive Perkins","Ophelia Morrow","Oren Montes","Orlando Henderson","Owen Buchanan","Paul Norman","Rafael Barrett","Raymond Cochran","Reed Hooper","Reinaldo Houston","Renato Simmons","Rene Calhoun","Reva Hardin","Robert French","Robin Bender","Rodolfo Scott","Roland Blake","Roland Sullivan","Rolf Barnett","Ross Marquez","Ruthie Daugherty","Sandra Potts","Scott Stephenson","Scotty Gonzales","Sean Wiggins","Shana Gallagher","Sharron Montes","Sheryl Lindsey","Socorro Hayden","Solomon Andrade","Stacey Whitehead","Stevie Hale","Stuart Oliver","Stuart Riddle","Tammy Merritt","Theo Wiley","Theresa Murillo","Timothy Roberts","Tony Torres","Tracy Logan","Troy Hoover","Twila Rubio","Velma Everett","Vincent Mccormick","Vincenzo Stafford","Vito Clark","Waldo Spencer","Werner Lowe","Werner Shepard","Wesley Ford","Wm Cantu","Zelma Pierce"]
[null,null,null,null,null,"Delores Krause",{"$f":"IF('Resulting List'!F201=\"\",\"\",'Resulting List'!F201)","v":""},null,{"$f":"TRANSPOSE(_xlfn._xlws.SORT(_xlfn.UNIQUE(_xlfn._xlws.FILTER(Customers[Names],ISNUMBER(SEARCH(Customers[[#This Row],[Search Criteria]],Customers[Names])),\"No data.\"))))","v":"Adriana Todd"},"Albert Ramirez","Alex Rubio","Amanda Beck","Amparo Orozco","Amy Todd","Angelina Roberson","April Fox","Arden Ayala","Arnoldo Pennington","Aubrey Giles","Bette Rivers","Brianna Alexander","Brianna Mora","Britt Vazquez","Broderick Gillespie","Brooke Roman","Calvin Buck","Carmela Mullins","Carol Stevenson","Carolina Russell","Carolyn Roberts","Chelsea Gilbert","Cheryl Williamson","Christa Frederick","Christian Armstrong","Christopher Stuart","Chung Krueger","Clare Whitney","Clarissa Archer","Claudio Lam","Cordell Mills","Craig Shepherd","Damien Kramer","Dane Burke","Danielle Stout","Darrel Liu","Darrin Mcneil","Darron Aguilar","Della Huber","Delores Krause","Dena Rosario","Dominick Johnston","Dona Herring","Dorothy Winters","Douglas Wiley","Doyle David","Earlene Hester","Earline Shepherd","Edwin Sparks","Eli Galvan","Elinor Kaufman","Elroy Porter","Elvin Flynn","Emmitt Porter","Erik Parsons","Ethel Forbes","Felicia Ware","Fidel Haynes","Francisco Valenzuela","Frank Hunt","Gabriela Moore","Gabrielle Patrick","Gale Fitzpatrick","Gayle Curtis","Genevieve Lucero","Gerry Oneal","Grady Ellis","Grover Escobar","Hans Patel","Horacio Black","Humberto Compton","Hunter Short","Ilene Mcguire","Imelda Lloyd","Ira Macdonald","Issac Allen","Jacques Velazquez","Janis Mullins","Janna Cowan","Javier Garner","Jayson Abbott","Jeannie Tapia","Jefferson Lee","Jeramy Keith","Jermaine Bradshaw","Jewel Lee","Jimmie Yang","Jodie Wood","John Cline","Josefina Dickerson","Josie Pineda","Judith Griffin","Julius Soto","Kelli Romero","Kerri Joseph","Kim Mccall","Lakeisha Velazquez","Latonya Logan","Lee Schmidt","Lela Atkins","Leland Robertson","Leonardo House","Leroy Mcintyre","Lesley Blevins","Lilia Berg","Lilly Stone","Lincoln Bond","Lindsay Hurst","Lionel Fuller","Lorene Hunter","Louis Kidd","Lucius Warren","Lucy Mejia","Lupe Ingram","Lynette Fuller","Lynnette Wright","Madge Copeland","Madge Tanner","Mae Sawyer","Malcolm Newman","Mamie Wong","Mandy Swanson","Marcella Everett","Marco Bright","Marcos Schaefer","Marcus Hays","Marina Walsh","Marion Savage","Marylou Bass","Marylou Mccarthy","Mathew Howard","Maurice Jacobson","Mauricio Bautista","Max Smith","Melanie Bridges","Melissa Brandt","Merlin Wu","Michel Simpson","Mickey Kennedy","Mike Sloan","Milton Walsh","Mohamed Allison","Mohammad Christensen","Nadia Macdonald","Naomi Snyder","Ned Lowe","Nettie Leonard","Olive Perkins","Ophelia Morrow","Oren Montes","Orlando Henderson","Owen Buchanan","Paul Norman","Rafael Barrett","Raymond Cochran","Reed Hooper","Reinaldo Houston","Renato Simmons","Rene Calhoun","Reva Hardin","Robert French","Robin Bender","Rodolfo Scott","Roland Blake","Roland Sullivan","Rolf Barnett","Ross Marquez","Ruthie Daugherty","Sandra Potts","Scott Stephenson","Scotty Gonzales","Sean Wiggins","Shana Gallagher","Sharron Montes","Sheryl Lindsey","Socorro Hayden","Solomon Andrade","Stacey Whitehead","Stevie Hale","Stuart Oliver","Stuart Riddle","Tammy Merritt","Theo Wiley","Theresa Murillo","Timothy Roberts","Tony Torres","Tracy Logan","Troy Hoover","Twila Rubio","Velma Everett","Vincent Mccormick","Vincenzo Stafford","Vito Clark","Waldo Spencer","Werner Lowe","Werner Shepard","Wesley Ford","Wm Cantu","Zelma Pierce"]
[null,null,null,null,null,"Dena Rosario",{"$f":"IF('Resulting List'!F202=\"\",\"\",'Resulting List'!F202)","v":""},null,{"$f":"TRANSPOSE(_xlfn._xlws.SORT(_xlfn.UNIQUE(_xlfn._xlws.FILTER(Customers[Names],ISNUMBER(SEARCH(Customers[[#This Row],[Search Criteria]],Customers[Names])),\"No data.\"))))","v":"Adriana Todd"},"Albert Ramirez","Alex Rubio","Amanda Beck","Amparo Orozco","Amy Todd","Angelina Roberson","April Fox","Arden Ayala","Arnoldo Pennington","Aubrey Giles","Bette Rivers","Brianna Alexander","Brianna Mora","Britt Vazquez","Broderick Gillespie","Brooke Roman","Calvin Buck","Carmela Mullins","Carol Stevenson","Carolina Russell","Carolyn Roberts","Chelsea Gilbert","Cheryl Williamson","Christa Frederick","Christian Armstrong","Christopher Stuart","Chung Krueger","Clare Whitney","Clarissa Archer","Claudio Lam","Cordell Mills","Craig Shepherd","Damien Kramer","Dane Burke","Danielle Stout","Darrel Liu","Darrin Mcneil","Darron Aguilar","Della Huber","Delores Krause","Dena Rosario","Dominick Johnston","Dona Herring","Dorothy Winters","Douglas Wiley","Doyle David","Earlene Hester","Earline Shepherd","Edwin Sparks","Eli Galvan","Elinor Kaufman","Elroy Porter","Elvin Flynn","Emmitt Porter","Erik Parsons","Ethel Forbes","Felicia Ware","Fidel Haynes","Francisco Valenzuela","Frank Hunt","Gabriela Moore","Gabrielle Patrick","Gale Fitzpatrick","Gayle Curtis","Genevieve Lucero","Gerry Oneal","Grady Ellis","Grover Escobar","Hans Patel","Horacio Black","Humberto Compton","Hunter Short","Ilene Mcguire","Imelda Lloyd","Ira Macdonald","Issac Allen","Jacques Velazquez","Janis Mullins","Janna Cowan","Javier Garner","Jayson Abbott","Jeannie Tapia","Jefferson Lee","Jeramy Keith","Jermaine Bradshaw","Jewel Lee","Jimmie Yang","Jodie Wood","John Cline","Josefina Dickerson","Josie Pineda","Judith Griffin","Julius Soto","Kelli Romero","Kerri Joseph","Kim Mccall","Lakeisha Velazquez","Latonya Logan","Lee Schmidt","Lela Atkins","Leland Robertson","Leonardo House","Leroy Mcintyre","Lesley Blevins","Lilia Berg","Lilly Stone","Lincoln Bond","Lindsay Hurst","Lionel Fuller","Lorene Hunter","Louis Kidd","Lucius Warren","Lucy Mejia","Lupe Ingram","Lynette Fuller","Lynnette Wright","Madge Copeland","Madge Tanner","Mae Sawyer","Malcolm Newman","Mamie Wong","Mandy Swanson","Marcella Everett","Marco Bright","Marcos Schaefer","Marcus Hays","Marina Walsh","Marion Savage","Marylou Bass","Marylou Mccarthy","Mathew Howard","Maurice Jacobson","Mauricio Bautista","Max Smith","Melanie Bridges","Melissa Brandt","Merlin Wu","Michel Simpson","Mickey Kennedy","Mike Sloan","Milton Walsh","Mohamed Allison","Mohammad Christensen","Nadia Macdonald","Naomi Snyder","Ned Lowe","Nettie Leonard","Olive Perkins","Ophelia Morrow","Oren Montes","Orlando Henderson","Owen Buchanan","Paul Norman","Rafael Barrett","Raymond Cochran","Reed Hooper","Reinaldo Houston","Renato Simmons","Rene Calhoun","Reva Hardin","Robert French","Robin Bender","Rodolfo Scott","Roland Blake","Roland Sullivan","Rolf Barnett","Ross Marquez","Ruthie Daugherty","Sandra Potts","Scott Stephenson","Scotty Gonzales","Sean Wiggins","Shana Gallagher","Sharron Montes","Sheryl Lindsey","Socorro Hayden","Solomon Andrade","Stacey Whitehead","Stevie Hale","Stuart Oliver","Stuart Riddle","Tammy Merritt","Theo Wiley","Theresa Murillo","Timothy Roberts","Tony Torres","Tracy Logan","Troy Hoover","Twila Rubio","Velma Everett","Vincent Mccormick","Vincenzo Stafford","Vito Clark","Waldo Spencer","Werner Lowe","Werner Shepard","Wesley Ford","Wm Cantu","Zelma Pierce"]
[null,null,null,null,null,"Rafael Barrett",{"$f":"IF('Resulting List'!F203=\"\",\"\",'Resulting List'!F203)","v":""},null,{"$f":"TRANSPOSE(_xlfn._xlws.SORT(_xlfn.UNIQUE(_xlfn._xlws.FILTER(Customers[Names],ISNUMBER(SEARCH(Customers[[#This Row],[Search Criteria]],Customers[Names])),\"No data.\"))))","v":"Adriana Todd"},"Albert Ramirez","Alex Rubio","Amanda Beck","Amparo Orozco","Amy Todd","Angelina Roberson","April Fox","Arden Ayala","Arnoldo Pennington","Aubrey Giles","Bette Rivers","Brianna Alexander","Brianna Mora","Britt Vazquez","Broderick Gillespie","Brooke Roman","Calvin Buck","Carmela Mullins","Carol Stevenson","Carolina Russell","Carolyn Roberts","Chelsea Gilbert","Cheryl Williamson","Christa Frederick","Christian Armstrong","Christopher Stuart","Chung Krueger","Clare Whitney","Clarissa Archer","Claudio Lam","Cordell Mills","Craig Shepherd","Damien Kramer","Dane Burke","Danielle Stout","Darrel Liu","Darrin Mcneil","Darron Aguilar","Della Huber","Delores Krause","Dena Rosario","Dominick Johnston","Dona Herring","Dorothy Winters","Douglas Wiley","Doyle David","Earlene Hester","Earline Shepherd","Edwin Sparks","Eli Galvan","Elinor Kaufman","Elroy Porter","Elvin Flynn","Emmitt Porter","Erik Parsons","Ethel Forbes","Felicia Ware","Fidel Haynes","Francisco Valenzuela","Frank Hunt","Gabriela Moore","Gabrielle Patrick","Gale Fitzpatrick","Gayle Curtis","Genevieve Lucero","Gerry Oneal","Grady Ellis","Grover Escobar","Hans Patel","Horacio Black","Humberto Compton","Hunter Short","Ilene Mcguire","Imelda Lloyd","Ira Macdonald","Issac Allen","Jacques Velazquez","Janis Mullins","Janna Cowan","Javier Garner","Jayson Abbott","Jeannie Tapia","Jefferson Lee","Jeramy Keith","Jermaine Bradshaw","Jewel Lee","Jimmie Yang","Jodie Wood","John Cline","Josefina Dickerson","Josie Pineda","Judith Griffin","Julius Soto","Kelli Romero","Kerri Joseph","Kim Mccall","Lakeisha Velazquez","Latonya Logan","Lee Schmidt","Lela Atkins","Leland Robertson","Leonardo House","Leroy Mcintyre","Lesley Blevins","Lilia Berg","Lilly Stone","Lincoln Bond","Lindsay Hurst","Lionel Fuller","Lorene Hunter","Louis Kidd","Lucius Warren","Lucy Mejia","Lupe Ingram","Lynette Fuller","Lynnette Wright","Madge Copeland","Madge Tanner","Mae Sawyer","Malcolm Newman","Mamie Wong","Mandy Swanson","Marcella Everett","Marco Bright","Marcos Schaefer","Marcus Hays","Marina Walsh","Marion Savage","Marylou Bass","Marylou Mccarthy","Mathew Howard","Maurice Jacobson","Mauricio Bautista","Max Smith","Melanie Bridges","Melissa Brandt","Merlin Wu","Michel Simpson","Mickey Kennedy","Mike Sloan","Milton Walsh","Mohamed Allison","Mohammad Christensen","Nadia Macdonald","Naomi Snyder","Ned Lowe","Nettie Leonard","Olive Perkins","Ophelia Morrow","Oren Montes","Orlando Henderson","Owen Buchanan","Paul Norman","Rafael Barrett","Raymond Cochran","Reed Hooper","Reinaldo Houston","Renato Simmons","Rene Calhoun","Reva Hardin","Robert French","Robin Bender","Rodolfo Scott","Roland Blake","Roland Sullivan","Rolf Barnett","Ross Marquez","Ruthie Daugherty","Sandra Potts","Scott Stephenson","Scotty Gonzales","Sean Wiggins","Shana Gallagher","Sharron Montes","Sheryl Lindsey","Socorro Hayden","Solomon Andrade","Stacey Whitehead","Stevie Hale","Stuart Oliver","Stuart Riddle","Tammy Merritt","Theo Wiley","Theresa Murillo","Timothy Roberts","Tony Torres","Tracy Logan","Troy Hoover","Twila Rubio","Velma Everett","Vincent Mccormick","Vincenzo Stafford","Vito Clark","Waldo Spencer","Werner Lowe","Werner Shepard","Wesley Ford","Wm Cantu","Zelma Pierce"]
[null,null,null,null,null,"Lesley Blevins",{"$f":"IF('Resulting List'!F204=\"\",\"\",'Resulting List'!F204)","v":""},null,{"$f":"TRANSPOSE(_xlfn._xlws.SORT(_xlfn.UNIQUE(_xlfn._xlws.FILTER(Customers[Names],ISNUMBER(SEARCH(Customers[[#This Row],[Search Criteria]],Customers[Names])),\"No data.\"))))","v":"Adriana Todd"},"Albert Ramirez","Alex Rubio","Amanda Beck","Amparo Orozco","Amy Todd","Angelina Roberson","April Fox","Arden Ayala","Arnoldo Pennington","Aubrey Giles","Bette Rivers","Brianna Alexander","Brianna Mora","Britt Vazquez","Broderick Gillespie","Brooke Roman","Calvin Buck","Carmela Mullins","Carol Stevenson","Carolina Russell","Carolyn Roberts","Chelsea Gilbert","Cheryl Williamson","Christa Frederick","Christian Armstrong","Christopher Stuart","Chung Krueger","Clare Whitney","Clarissa Archer","Claudio Lam","Cordell Mills","Craig Shepherd","Damien Kramer","Dane Burke","Danielle Stout","Darrel Liu","Darrin Mcneil","Darron Aguilar","Della Huber","Delores Krause","Dena Rosario","Dominick Johnston","Dona Herring","Dorothy Winters","Douglas Wiley","Doyle David","Earlene Hester","Earline Shepherd","Edwin Sparks","Eli Galvan","Elinor Kaufman","Elroy Porter","Elvin Flynn","Emmitt Porter","Erik Parsons","Ethel Forbes","Felicia Ware","Fidel Haynes","Francisco Valenzuela","Frank Hunt","Gabriela Moore","Gabrielle Patrick","Gale Fitzpatrick","Gayle Curtis","Genevieve Lucero","Gerry Oneal","Grady Ellis","Grover Escobar","Hans Patel","Horacio Black","Humberto Compton","Hunter Short","Ilene Mcguire","Imelda Lloyd","Ira Macdonald","Issac Allen","Jacques Velazquez","Janis Mullins","Janna Cowan","Javier Garner","Jayson Abbott","Jeannie Tapia","Jefferson Lee","Jeramy Keith","Jermaine Bradshaw","Jewel Lee","Jimmie Yang","Jodie Wood","John Cline","Josefina Dickerson","Josie Pineda","Judith Griffin","Julius Soto","Kelli Romero","Kerri Joseph","Kim Mccall","Lakeisha Velazquez","Latonya Logan","Lee Schmidt","Lela Atkins","Leland Robertson","Leonardo House","Leroy Mcintyre","Lesley Blevins","Lilia Berg","Lilly Stone","Lincoln Bond","Lindsay Hurst","Lionel Fuller","Lorene Hunter","Louis Kidd","Lucius Warren","Lucy Mejia","Lupe Ingram","Lynette Fuller","Lynnette Wright","Madge Copeland","Madge Tanner","Mae Sawyer","Malcolm Newman","Mamie Wong","Mandy Swanson","Marcella Everett","Marco Bright","Marcos Schaefer","Marcus Hays","Marina Walsh","Marion Savage","Marylou Bass","Marylou Mccarthy","Mathew Howard","Maurice Jacobson","Mauricio Bautista","Max Smith","Melanie Bridges","Melissa Brandt","Merlin Wu","Michel Simpson","Mickey Kennedy","Mike Sloan","Milton Walsh","Mohamed Allison","Mohammad Christensen","Nadia Macdonald","Naomi Snyder","Ned Lowe","Nettie Leonard","Olive Perkins","Ophelia Morrow","Oren Montes","Orlando Henderson","Owen Buchanan","Paul Norman","Rafael Barrett","Raymond Cochran","Reed Hooper","Reinaldo Houston","Renato Simmons","Rene Calhoun","Reva Hardin","Robert French","Robin Bender","Rodolfo Scott","Roland Blake","Roland Sullivan","Rolf Barnett","Ross Marquez","Ruthie Daugherty","Sandra Potts","Scott Stephenson","Scotty Gonzales","Sean Wiggins","Shana Gallagher","Sharron Montes","Sheryl Lindsey","Socorro Hayden","Solomon Andrade","Stacey Whitehead","Stevie Hale","Stuart Oliver","Stuart Riddle","Tammy Merritt","Theo Wiley","Theresa Murillo","Timothy Roberts","Tony Torres","Tracy Logan","Troy Hoover","Twila Rubio","Velma Everett","Vincent Mccormick","Vincenzo Stafford","Vito Clark","Waldo Spencer","Werner Lowe","Werner Shepard","Wesley Ford","Wm Cantu","Zelma Pierce"]
[null,null,null,null,null,"Mathew Howard",{"$f":"IF('Resulting List'!F205=\"\",\"\",'Resulting List'!F205)","v":""},null,{"$f":"TRANSPOSE(_xlfn._xlws.SORT(_xlfn.UNIQUE(_xlfn._xlws.FILTER(Customers[Names],ISNUMBER(SEARCH(Customers[[#This Row],[Search Criteria]],Customers[Names])),\"No data.\"))))","v":"Adriana Todd"},"Albert Ramirez","Alex Rubio","Amanda Beck","Amparo Orozco","Amy Todd","Angelina Roberson","April Fox","Arden Ayala","Arnoldo Pennington","Aubrey Giles","Bette Rivers","Brianna Alexander","Brianna Mora","Britt Vazquez","Broderick Gillespie","Brooke Roman","Calvin Buck","Carmela Mullins","Carol Stevenson","Carolina Russell","Carolyn Roberts","Chelsea Gilbert","Cheryl Williamson","Christa Frederick","Christian Armstrong","Christopher Stuart","Chung Krueger","Clare Whitney","Clarissa Archer","Claudio Lam","Cordell Mills","Craig Shepherd","Damien Kramer","Dane Burke","Danielle Stout","Darrel Liu","Darrin Mcneil","Darron Aguilar","Della Huber","Delores Krause","Dena Rosario","Dominick Johnston","Dona Herring","Dorothy Winters","Douglas Wiley","Doyle David","Earlene Hester","Earline Shepherd","Edwin Sparks","Eli Galvan","Elinor Kaufman","Elroy Porter","Elvin Flynn","Emmitt Porter","Erik Parsons","Ethel Forbes","Felicia Ware","Fidel Haynes","Francisco Valenzuela","Frank Hunt","Gabriela Moore","Gabrielle Patrick","Gale Fitzpatrick","Gayle Curtis","Genevieve Lucero","Gerry Oneal","Grady Ellis","Grover Escobar","Hans Patel","Horacio Black","Humberto Compton","Hunter Short","Ilene Mcguire","Imelda Lloyd","Ira Macdonald","Issac Allen","Jacques Velazquez","Janis Mullins","Janna Cowan","Javier Garner","Jayson Abbott","Jeannie Tapia","Jefferson Lee","Jeramy Keith","Jermaine Bradshaw","Jewel Lee","Jimmie Yang","Jodie Wood","John Cline","Josefina Dickerson","Josie Pineda","Judith Griffin","Julius Soto","Kelli Romero","Kerri Joseph","Kim Mccall","Lakeisha Velazquez","Latonya Logan","Lee Schmidt","Lela Atkins","Leland Robertson","Leonardo House","Leroy Mcintyre","Lesley Blevins","Lilia Berg","Lilly Stone","Lincoln Bond","Lindsay Hurst","Lionel Fuller","Lorene Hunter","Louis Kidd","Lucius Warren","Lucy Mejia","Lupe Ingram","Lynette Fuller","Lynnette Wright","Madge Copeland","Madge Tanner","Mae Sawyer","Malcolm Newman","Mamie Wong","Mandy Swanson","Marcella Everett","Marco Bright","Marcos Schaefer","Marcus Hays","Marina Walsh","Marion Savage","Marylou Bass","Marylou Mccarthy","Mathew Howard","Maurice Jacobson","Mauricio Bautista","Max Smith","Melanie Bridges","Melissa Brandt","Merlin Wu","Michel Simpson","Mickey Kennedy","Mike Sloan","Milton Walsh","Mohamed Allison","Mohammad Christensen","Nadia Macdonald","Naomi Snyder","Ned Lowe","Nettie Leonard","Olive Perkins","Ophelia Morrow","Oren Montes","Orlando Henderson","Owen Buchanan","Paul Norman","Rafael Barrett","Raymond Cochran","Reed Hooper","Reinaldo Houston","Renato Simmons","Rene Calhoun","Reva Hardin","Robert French","Robin Bender","Rodolfo Scott","Roland Blake","Roland Sullivan","Rolf Barnett","Ross Marquez","Ruthie Daugherty","Sandra Potts","Scott Stephenson","Scotty Gonzales","Sean Wiggins","Shana Gallagher","Sharron Montes","Sheryl Lindsey","Socorro Hayden","Solomon Andrade","Stacey Whitehead","Stevie Hale","Stuart Oliver","Stuart Riddle","Tammy Merritt","Theo Wiley","Theresa Murillo","Timothy Roberts","Tony Torres","Tracy Logan","Troy Hoover","Twila Rubio","Velma Everett","Vincent Mccormick","Vincenzo Stafford","Vito Clark","Waldo Spencer","Werner Lowe","Werner Shepard","Wesley Ford","Wm Cantu","Zelma Pierce"]
[null,null,null,null,null,"Rodolfo Scott",{"$f":"IF('Resulting List'!F206=\"\",\"\",'Resulting List'!F206)","v":""},null,{"$f":"TRANSPOSE(_xlfn._xlws.SORT(_xlfn.UNIQUE(_xlfn._xlws.FILTER(Customers[Names],ISNUMBER(SEARCH(Customers[[#This Row],[Search Criteria]],Customers[Names])),\"No data.\"))))","v":"Adriana Todd"},"Albert Ramirez","Alex Rubio","Amanda Beck","Amparo Orozco","Amy Todd","Angelina Roberson","April Fox","Arden Ayala","Arnoldo Pennington","Aubrey Giles","Bette Rivers","Brianna Alexander","Brianna Mora","Britt Vazquez","Broderick Gillespie","Brooke Roman","Calvin Buck","Carmela Mullins","Carol Stevenson","Carolina Russell","Carolyn Roberts","Chelsea Gilbert","Cheryl Williamson","Christa Frederick","Christian Armstrong","Christopher Stuart","Chung Krueger","Clare Whitney","Clarissa Archer","Claudio Lam","Cordell Mills","Craig Shepherd","Damien Kramer","Dane Burke","Danielle Stout","Darrel Liu","Darrin Mcneil","Darron Aguilar","Della Huber","Delores Krause","Dena Rosario","Dominick Johnston","Dona Herring","Dorothy Winters","Douglas Wiley","Doyle David","Earlene Hester","Earline Shepherd","Edwin Sparks","Eli Galvan","Elinor Kaufman","Elroy Porter","Elvin Flynn","Emmitt Porter","Erik Parsons","Ethel Forbes","Felicia Ware","Fidel Haynes","Francisco Valenzuela","Frank Hunt","Gabriela Moore","Gabrielle Patrick","Gale Fitzpatrick","Gayle Curtis","Genevieve Lucero","Gerry Oneal","Grady Ellis","Grover Escobar","Hans Patel","Horacio Black","Humberto Compton","Hunter Short","Ilene Mcguire","Imelda Lloyd","Ira Macdonald","Issac Allen","Jacques Velazquez","Janis Mullins","Janna Cowan","Javier Garner","Jayson Abbott","Jeannie Tapia","Jefferson Lee","Jeramy Keith","Jermaine Bradshaw","Jewel Lee","Jimmie Yang","Jodie Wood","John Cline","Josefina Dickerson","Josie Pineda","Judith Griffin","Julius Soto","Kelli Romero","Kerri Joseph","Kim Mccall","Lakeisha Velazquez","Latonya Logan","Lee Schmidt","Lela Atkins","Leland Robertson","Leonardo House","Leroy Mcintyre","Lesley Blevins","Lilia Berg","Lilly Stone","Lincoln Bond","Lindsay Hurst","Lionel Fuller","Lorene Hunter","Louis Kidd","Lucius Warren","Lucy Mejia","Lupe Ingram","Lynette Fuller","Lynnette Wright","Madge Copeland","Madge Tanner","Mae Sawyer","Malcolm Newman","Mamie Wong","Mandy Swanson","Marcella Everett","Marco Bright","Marcos Schaefer","Marcus Hays","Marina Walsh","Marion Savage","Marylou Bass","Marylou Mccarthy","Mathew Howard","Maurice Jacobson","Mauricio Bautista","Max Smith","Melanie Bridges","Melissa Brandt","Merlin Wu","Michel Simpson","Mickey Kennedy","Mike Sloan","Milton Walsh","Mohamed Allison","Mohammad Christensen","Nadia Macdonald","Naomi Snyder","Ned Lowe","Nettie Leonard","Olive Perkins","Ophelia Morrow","Oren Montes","Orlando Henderson","Owen Buchanan","Paul Norman","Rafael Barrett","Raymond Cochran","Reed Hooper","Reinaldo Houston","Renato Simmons","Rene Calhoun","Reva Hardin","Robert French","Robin Bender","Rodolfo Scott","Roland Blake","Roland Sullivan","Rolf Barnett","Ross Marquez","Ruthie Daugherty","Sandra Potts","Scott Stephenson","Scotty Gonzales","Sean Wiggins","Shana Gallagher","Sharron Montes","Sheryl Lindsey","Socorro Hayden","Solomon Andrade","Stacey Whitehead","Stevie Hale","Stuart Oliver","Stuart Riddle","Tammy Merritt","Theo Wiley","Theresa Murillo","Timothy Roberts","Tony Torres","Tracy Logan","Troy Hoover","Twila Rubio","Velma Everett","Vincent Mccormick","Vincenzo Stafford","Vito Clark","Waldo Spencer","Werner Lowe","Werner Shepard","Wesley Ford","Wm Cantu","Zelma Pierce"]
[null,null,null,null,null,"Jayson Abbott",{"$f":"IF('Resulting List'!F207=\"\",\"\",'Resulting List'!F207)","v":""},null,{"$f":"TRANSPOSE(_xlfn._xlws.SORT(_xlfn.UNIQUE(_xlfn._xlws.FILTER(Customers[Names],ISNUMBER(SEARCH(Customers[[#This Row],[Search Criteria]],Customers[Names])),\"No data.\"))))","v":"Adriana Todd"},"Albert Ramirez","Alex Rubio","Amanda Beck","Amparo Orozco","Amy Todd","Angelina Roberson","April Fox","Arden Ayala","Arnoldo Pennington","Aubrey Giles","Bette Rivers","Brianna Alexander","Brianna Mora","Britt Vazquez","Broderick Gillespie","Brooke Roman","Calvin Buck","Carmela Mullins","Carol Stevenson","Carolina Russell","Carolyn Roberts","Chelsea Gilbert","Cheryl Williamson","Christa Frederick","Christian Armstrong","Christopher Stuart","Chung Krueger","Clare Whitney","Clarissa Archer","Claudio Lam","Cordell Mills","Craig Shepherd","Damien Kramer","Dane Burke","Danielle Stout","Darrel Liu","Darrin Mcneil","Darron Aguilar","Della Huber","Delores Krause","Dena Rosario","Dominick Johnston","Dona Herring","Dorothy Winters","Douglas Wiley","Doyle David","Earlene Hester","Earline Shepherd","Edwin Sparks","Eli Galvan","Elinor Kaufman","Elroy Porter","Elvin Flynn","Emmitt Porter","Erik Parsons","Ethel Forbes","Felicia Ware","Fidel Haynes","Francisco Valenzuela","Frank Hunt","Gabriela Moore","Gabrielle Patrick","Gale Fitzpatrick","Gayle Curtis","Genevieve Lucero","Gerry Oneal","Grady Ellis","Grover Escobar","Hans Patel","Horacio Black","Humberto Compton","Hunter Short","Ilene Mcguire","Imelda Lloyd","Ira Macdonald","Issac Allen","Jacques Velazquez","Janis Mullins","Janna Cowan","Javier Garner","Jayson Abbott","Jeannie Tapia","Jefferson Lee","Jeramy Keith","Jermaine Bradshaw","Jewel Lee","Jimmie Yang","Jodie Wood","John Cline","Josefina Dickerson","Josie Pineda","Judith Griffin","Julius Soto","Kelli Romero","Kerri Joseph","Kim Mccall","Lakeisha Velazquez","Latonya Logan","Lee Schmidt","Lela Atkins","Leland Robertson","Leonardo House","Leroy Mcintyre","Lesley Blevins","Lilia Berg","Lilly Stone","Lincoln Bond","Lindsay Hurst","Lionel Fuller","Lorene Hunter","Louis Kidd","Lucius Warren","Lucy Mejia","Lupe Ingram","Lynette Fuller","Lynnette Wright","Madge Copeland","Madge Tanner","Mae Sawyer","Malcolm Newman","Mamie Wong","Mandy Swanson","Marcella Everett","Marco Bright","Marcos Schaefer","Marcus Hays","Marina Walsh","Marion Savage","Marylou Bass","Marylou Mccarthy","Mathew Howard","Maurice Jacobson","Mauricio Bautista","Max Smith","Melanie Bridges","Melissa Brandt","Merlin Wu","Michel Simpson","Mickey Kennedy","Mike Sloan","Milton Walsh","Mohamed Allison","Mohammad Christensen","Nadia Macdonald","Naomi Snyder","Ned Lowe","Nettie Leonard","Olive Perkins","Ophelia Morrow","Oren Montes","Orlando Henderson","Owen Buchanan","Paul Norman","Rafael Barrett","Raymond Cochran","Reed Hooper","Reinaldo Houston","Renato Simmons","Rene Calhoun","Reva Hardin","Robert French","Robin Bender","Rodolfo Scott","Roland Blake","Roland Sullivan","Rolf Barnett","Ross Marquez","Ruthie Daugherty","Sandra Potts","Scott Stephenson","Scotty Gonzales","Sean Wiggins","Shana Gallagher","Sharron Montes","Sheryl Lindsey","Socorro Hayden","Solomon Andrade","Stacey Whitehead","Stevie Hale","Stuart Oliver","Stuart Riddle","Tammy Merritt","Theo Wiley","Theresa Murillo","Timothy Roberts","Tony Torres","Tracy Logan","Troy Hoover","Twila Rubio","Velma Everett","Vincent Mccormick","Vincenzo Stafford","Vito Clark","Waldo Spencer","Werner Lowe","Werner Shepard","Wesley Ford","Wm Cantu","Zelma Pierce"]
[null,null,null,null,null,"Angelina Roberson",{"$f":"IF('Resulting List'!F208=\"\",\"\",'Resulting List'!F208)","v":""},null,{"$f":"TRANSPOSE(_xlfn._xlws.SORT(_xlfn.UNIQUE(_xlfn._xlws.FILTER(Customers[Names],ISNUMBER(SEARCH(Customers[[#This Row],[Search Criteria]],Customers[Names])),\"No data.\"))))","v":"Adriana Todd"},"Albert Ramirez","Alex Rubio","Amanda Beck","Amparo Orozco","Amy Todd","Angelina Roberson","April Fox","Arden Ayala","Arnoldo Pennington","Aubrey Giles","Bette Rivers","Brianna Alexander","Brianna Mora","Britt Vazquez","Broderick Gillespie","Brooke Roman","Calvin Buck","Carmela Mullins","Carol Stevenson","Carolina Russell","Carolyn Roberts","Chelsea Gilbert","Cheryl Williamson","Christa Frederick","Christian Armstrong","Christopher Stuart","Chung Krueger","Clare Whitney","Clarissa Archer","Claudio Lam","Cordell Mills","Craig Shepherd","Damien Kramer","Dane Burke","Danielle Stout","Darrel Liu","Darrin Mcneil","Darron Aguilar","Della Huber","Delores Krause","Dena Rosario","Dominick Johnston","Dona Herring","Dorothy Winters","Douglas Wiley","Doyle David","Earlene Hester","Earline Shepherd","Edwin Sparks","Eli Galvan","Elinor Kaufman","Elroy Porter","Elvin Flynn","Emmitt Porter","Erik Parsons","Ethel Forbes","Felicia Ware","Fidel Haynes","Francisco Valenzuela","Frank Hunt","Gabriela Moore","Gabrielle Patrick","Gale Fitzpatrick","Gayle Curtis","Genevieve Lucero","Gerry Oneal","Grady Ellis","Grover Escobar","Hans Patel","Horacio Black","Humberto Compton","Hunter Short","Ilene Mcguire","Imelda Lloyd","Ira Macdonald","Issac Allen","Jacques Velazquez","Janis Mullins","Janna Cowan","Javier Garner","Jayson Abbott","Jeannie Tapia","Jefferson Lee","Jeramy Keith","Jermaine Bradshaw","Jewel Lee","Jimmie Yang","Jodie Wood","John Cline","Josefina Dickerson","Josie Pineda","Judith Griffin","Julius Soto","Kelli Romero","Kerri Joseph","Kim Mccall","Lakeisha Velazquez","Latonya Logan","Lee Schmidt","Lela Atkins","Leland Robertson","Leonardo House","Leroy Mcintyre","Lesley Blevins","Lilia Berg","Lilly Stone","Lincoln Bond","Lindsay Hurst","Lionel Fuller","Lorene Hunter","Louis Kidd","Lucius Warren","Lucy Mejia","Lupe Ingram","Lynette Fuller","Lynnette Wright","Madge Copeland","Madge Tanner","Mae Sawyer","Malcolm Newman","Mamie Wong","Mandy Swanson","Marcella Everett","Marco Bright","Marcos Schaefer","Marcus Hays","Marina Walsh","Marion Savage","Marylou Bass","Marylou Mccarthy","Mathew Howard","Maurice Jacobson","Mauricio Bautista","Max Smith","Melanie Bridges","Melissa Brandt","Merlin Wu","Michel Simpson","Mickey Kennedy","Mike Sloan","Milton Walsh","Mohamed Allison","Mohammad Christensen","Nadia Macdonald","Naomi Snyder","Ned Lowe","Nettie Leonard","Olive Perkins","Ophelia Morrow","Oren Montes","Orlando Henderson","Owen Buchanan","Paul Norman","Rafael Barrett","Raymond Cochran","Reed Hooper","Reinaldo Houston","Renato Simmons","Rene Calhoun","Reva Hardin","Robert French","Robin Bender","Rodolfo Scott","Roland Blake","Roland Sullivan","Rolf Barnett","Ross Marquez","Ruthie Daugherty","Sandra Potts","Scott Stephenson","Scotty Gonzales","Sean Wiggins","Shana Gallagher","Sharron Montes","Sheryl Lindsey","Socorro Hayden","Solomon Andrade","Stacey Whitehead","Stevie Hale","Stuart Oliver","Stuart Riddle","Tammy Merritt","Theo Wiley","Theresa Murillo","Timothy Roberts","Tony Torres","Tracy Logan","Troy Hoover","Twila Rubio","Velma Everett","Vincent Mccormick","Vincenzo Stafford","Vito Clark","Waldo Spencer","Werner Lowe","Werner Shepard","Wesley Ford","Wm Cantu","Zelma Pierce"]
[null,null,null,null,null,"Marylou Bass",{"$f":"IF('Resulting List'!F209=\"\",\"\",'Resulting List'!F209)","v":""},null,{"$f":"TRANSPOSE(_xlfn._xlws.SORT(_xlfn.UNIQUE(_xlfn._xlws.FILTER(Customers[Names],ISNUMBER(SEARCH(Customers[[#This Row],[Search Criteria]],Customers[Names])),\"No data.\"))))","v":"Adriana Todd"},"Albert Ramirez","Alex Rubio","Amanda Beck","Amparo Orozco","Amy Todd","Angelina Roberson","April Fox","Arden Ayala","Arnoldo Pennington","Aubrey Giles","Bette Rivers","Brianna Alexander","Brianna Mora","Britt Vazquez","Broderick Gillespie","Brooke Roman","Calvin Buck","Carmela Mullins","Carol Stevenson","Carolina Russell","Carolyn Roberts","Chelsea Gilbert","Cheryl Williamson","Christa Frederick","Christian Armstrong","Christopher Stuart","Chung Krueger","Clare Whitney","Clarissa Archer","Claudio Lam","Cordell Mills","Craig Shepherd","Damien Kramer","Dane Burke","Danielle Stout","Darrel Liu","Darrin Mcneil","Darron Aguilar","Della Huber","Delores Krause","Dena Rosario","Dominick Johnston","Dona Herring","Dorothy Winters","Douglas Wiley","Doyle David","Earlene Hester","Earline Shepherd","Edwin Sparks","Eli Galvan","Elinor Kaufman","Elroy Porter","Elvin Flynn","Emmitt Porter","Erik Parsons","Ethel Forbes","Felicia Ware","Fidel Haynes","Francisco Valenzuela","Frank Hunt","Gabriela Moore","Gabrielle Patrick","Gale Fitzpatrick","Gayle Curtis","Genevieve Lucero","Gerry Oneal","Grady Ellis","Grover Escobar","Hans Patel","Horacio Black","Humberto Compton","Hunter Short","Ilene Mcguire","Imelda Lloyd","Ira Macdonald","Issac Allen","Jacques Velazquez","Janis Mullins","Janna Cowan","Javier Garner","Jayson Abbott","Jeannie Tapia","Jefferson Lee","Jeramy Keith","Jermaine Bradshaw","Jewel Lee","Jimmie Yang","Jodie Wood","John Cline","Josefina Dickerson","Josie Pineda","Judith Griffin","Julius Soto","Kelli Romero","Kerri Joseph","Kim Mccall","Lakeisha Velazquez","Latonya Logan","Lee Schmidt","Lela Atkins","Leland Robertson","Leonardo House","Leroy Mcintyre","Lesley Blevins","Lilia Berg","Lilly Stone","Lincoln Bond","Lindsay Hurst","Lionel Fuller","Lorene Hunter","Louis Kidd","Lucius Warren","Lucy Mejia","Lupe Ingram","Lynette Fuller","Lynnette Wright","Madge Copeland","Madge Tanner","Mae Sawyer","Malcolm Newman","Mamie Wong","Mandy Swanson","Marcella Everett","Marco Bright","Marcos Schaefer","Marcus Hays","Marina Walsh","Marion Savage","Marylou Bass","Marylou Mccarthy","Mathew Howard","Maurice Jacobson","Mauricio Bautista","Max Smith","Melanie Bridges","Melissa Brandt","Merlin Wu","Michel Simpson","Mickey Kennedy","Mike Sloan","Milton Walsh","Mohamed Allison","Mohammad Christensen","Nadia Macdonald","Naomi Snyder","Ned Lowe","Nettie Leonard","Olive Perkins","Ophelia Morrow","Oren Montes","Orlando Henderson","Owen Buchanan","Paul Norman","Rafael Barrett","Raymond Cochran","Reed Hooper","Reinaldo Houston","Renato Simmons","Rene Calhoun","Reva Hardin","Robert French","Robin Bender","Rodolfo Scott","Roland Blake","Roland Sullivan","Rolf Barnett","Ross Marquez","Ruthie Daugherty","Sandra Potts","Scott Stephenson","Scotty Gonzales","Sean Wiggins","Shana Gallagher","Sharron Montes","Sheryl Lindsey","Socorro Hayden","Solomon Andrade","Stacey Whitehead","Stevie Hale","Stuart Oliver","Stuart Riddle","Tammy Merritt","Theo Wiley","Theresa Murillo","Timothy Roberts","Tony Torres","Tracy Logan","Troy Hoover","Twila Rubio","Velma Everett","Vincent Mccormick","Vincenzo Stafford","Vito Clark","Waldo Spencer","Werner Lowe","Werner Shepard","Wesley Ford","Wm Cantu","Zelma Pierce"]
[null,null,null,null,null,"Marcella Everett",{"$f":"IF('Resulting List'!F210=\"\",\"\",'Resulting List'!F210)","v":""},null,{"$f":"TRANSPOSE(_xlfn._xlws.SORT(_xlfn.UNIQUE(_xlfn._xlws.FILTER(Customers[Names],ISNUMBER(SEARCH(Customers[[#This Row],[Search Criteria]],Customers[Names])),\"No data.\"))))","v":"Adriana Todd"},"Albert Ramirez","Alex Rubio","Amanda Beck","Amparo Orozco","Amy Todd","Angelina Roberson","April Fox","Arden Ayala","Arnoldo Pennington","Aubrey Giles","Bette Rivers","Brianna Alexander","Brianna Mora","Britt Vazquez","Broderick Gillespie","Brooke Roman","Calvin Buck","Carmela Mullins","Carol Stevenson","Carolina Russell","Carolyn Roberts","Chelsea Gilbert","Cheryl Williamson","Christa Frederick","Christian Armstrong","Christopher Stuart","Chung Krueger","Clare Whitney","Clarissa Archer","Claudio Lam","Cordell Mills","Craig Shepherd","Damien Kramer","Dane Burke","Danielle Stout","Darrel Liu","Darrin Mcneil","Darron Aguilar","Della Huber","Delores Krause","Dena Rosario","Dominick Johnston","Dona Herring","Dorothy Winters","Douglas Wiley","Doyle David","Earlene Hester","Earline Shepherd","Edwin Sparks","Eli Galvan","Elinor Kaufman","Elroy Porter","Elvin Flynn","Emmitt Porter","Erik Parsons","Ethel Forbes","Felicia Ware","Fidel Haynes","Francisco Valenzuela","Frank Hunt","Gabriela Moore","Gabrielle Patrick","Gale Fitzpatrick","Gayle Curtis","Genevieve Lucero","Gerry Oneal","Grady Ellis","Grover Escobar","Hans Patel","Horacio Black","Humberto Compton","Hunter Short","Ilene Mcguire","Imelda Lloyd","Ira Macdonald","Issac Allen","Jacques Velazquez","Janis Mullins","Janna Cowan","Javier Garner","Jayson Abbott","Jeannie Tapia","Jefferson Lee","Jeramy Keith","Jermaine Bradshaw","Jewel Lee","Jimmie Yang","Jodie Wood","John Cline","Josefina Dickerson","Josie Pineda","Judith Griffin","Julius Soto","Kelli Romero","Kerri Joseph","Kim Mccall","Lakeisha Velazquez","Latonya Logan","Lee Schmidt","Lela Atkins","Leland Robertson","Leonardo House","Leroy Mcintyre","Lesley Blevins","Lilia Berg","Lilly Stone","Lincoln Bond","Lindsay Hurst","Lionel Fuller","Lorene Hunter","Louis Kidd","Lucius Warren","Lucy Mejia","Lupe Ingram","Lynette Fuller","Lynnette Wright","Madge Copeland","Madge Tanner","Mae Sawyer","Malcolm Newman","Mamie Wong","Mandy Swanson","Marcella Everett","Marco Bright","Marcos Schaefer","Marcus Hays","Marina Walsh","Marion Savage","Marylou Bass","Marylou Mccarthy","Mathew Howard","Maurice Jacobson","Mauricio Bautista","Max Smith","Melanie Bridges","Melissa Brandt","Merlin Wu","Michel Simpson","Mickey Kennedy","Mike Sloan","Milton Walsh","Mohamed Allison","Mohammad Christensen","Nadia Macdonald","Naomi Snyder","Ned Lowe","Nettie Leonard","Olive Perkins","Ophelia Morrow","Oren Montes","Orlando Henderson","Owen Buchanan","Paul Norman","Rafael Barrett","Raymond Cochran","Reed Hooper","Reinaldo Houston","Renato Simmons","Rene Calhoun","Reva Hardin","Robert French","Robin Bender","Rodolfo Scott","Roland Blake","Roland Sullivan","Rolf Barnett","Ross Marquez","Ruthie Daugherty","Sandra Potts","Scott Stephenson","Scotty Gonzales","Sean Wiggins","Shana Gallagher","Sharron Montes","Sheryl Lindsey","Socorro Hayden","Solomon Andrade","Stacey Whitehead","Stevie Hale","Stuart Oliver","Stuart Riddle","Tammy Merritt","Theo Wiley","Theresa Murillo","Timothy Roberts","Tony Torres","Tracy Logan","Troy Hoover","Twila Rubio","Velma Everett","Vincent Mccormick","Vincenzo Stafford","Vito Clark","Waldo Spencer","Werner Lowe","Werner Shepard","Wesley Ford","Wm Cantu","Zelma Pierce"]
[null,null,null,null,null,"Calvin Buck",{"$f":"IF('Resulting List'!F211=\"\",\"\",'Resulting List'!F211)","v":""},null,{"$f":"TRANSPOSE(_xlfn._xlws.SORT(_xlfn.UNIQUE(_xlfn._xlws.FILTER(Customers[Names],ISNUMBER(SEARCH(Customers[[#This Row],[Search Criteria]],Customers[Names])),\"No data.\"))))","v":"Adriana Todd"},"Albert Ramirez","Alex Rubio","Amanda Beck","Amparo Orozco","Amy Todd","Angelina Roberson","April Fox","Arden Ayala","Arnoldo Pennington","Aubrey Giles","Bette Rivers","Brianna Alexander","Brianna Mora","Britt Vazquez","Broderick Gillespie","Brooke Roman","Calvin Buck","Carmela Mullins","Carol Stevenson","Carolina Russell","Carolyn Roberts","Chelsea Gilbert","Cheryl Williamson","Christa Frederick","Christian Armstrong","Christopher Stuart","Chung Krueger","Clare Whitney","Clarissa Archer","Claudio Lam","Cordell Mills","Craig Shepherd","Damien Kramer","Dane Burke","Danielle Stout","Darrel Liu","Darrin Mcneil","Darron Aguilar","Della Huber","Delores Krause","Dena Rosario","Dominick Johnston","Dona Herring","Dorothy Winters","Douglas Wiley","Doyle David","Earlene Hester","Earline Shepherd","Edwin Sparks","Eli Galvan","Elinor Kaufman","Elroy Porter","Elvin Flynn","Emmitt Porter","Erik Parsons","Ethel Forbes","Felicia Ware","Fidel Haynes","Francisco Valenzuela","Frank Hunt","Gabriela Moore","Gabrielle Patrick","Gale Fitzpatrick","Gayle Curtis","Genevieve Lucero","Gerry Oneal","Grady Ellis","Grover Escobar","Hans Patel","Horacio Black","Humberto Compton","Hunter Short","Ilene Mcguire","Imelda Lloyd","Ira Macdonald","Issac Allen","Jacques Velazquez","Janis Mullins","Janna Cowan","Javier Garner","Jayson Abbott","Jeannie Tapia","Jefferson Lee","Jeramy Keith","Jermaine Bradshaw","Jewel Lee","Jimmie Yang","Jodie Wood","John Cline","Josefina Dickerson","Josie Pineda","Judith Griffin","Julius Soto","Kelli Romero","Kerri Joseph","Kim Mccall","Lakeisha Velazquez","Latonya Logan","Lee Schmidt","Lela Atkins","Leland Robertson","Leonardo House","Leroy Mcintyre","Lesley Blevins","Lilia Berg","Lilly Stone","Lincoln Bond","Lindsay Hurst","Lionel Fuller","Lorene Hunter","Louis Kidd","Lucius Warren","Lucy Mejia","Lupe Ingram","Lynette Fuller","Lynnette Wright","Madge Copeland","Madge Tanner","Mae Sawyer","Malcolm Newman","Mamie Wong","Mandy Swanson","Marcella Everett","Marco Bright","Marcos Schaefer","Marcus Hays","Marina Walsh","Marion Savage","Marylou Bass","Marylou Mccarthy","Mathew Howard","Maurice Jacobson","Mauricio Bautista","Max Smith","Melanie Bridges","Melissa Brandt","Merlin Wu","Michel Simpson","Mickey Kennedy","Mike Sloan","Milton Walsh","Mohamed Allison","Mohammad Christensen","Nadia Macdonald","Naomi Snyder","Ned Lowe","Nettie Leonard","Olive Perkins","Ophelia Morrow","Oren Montes","Orlando Henderson","Owen Buchanan","Paul Norman","Rafael Barrett","Raymond Cochran","Reed Hooper","Reinaldo Houston","Renato Simmons","Rene Calhoun","Reva Hardin","Robert French","Robin Bender","Rodolfo Scott","Roland Blake","Roland Sullivan","Rolf Barnett","Ross Marquez","Ruthie Daugherty","Sandra Potts","Scott Stephenson","Scotty Gonzales","Sean Wiggins","Shana Gallagher","Sharron Montes","Sheryl Lindsey","Socorro Hayden","Solomon Andrade","Stacey Whitehead","Stevie Hale","Stuart Oliver","Stuart Riddle","Tammy Merritt","Theo Wiley","Theresa Murillo","Timothy Roberts","Tony Torres","Tracy Logan","Troy Hoover","Twila Rubio","Velma Everett","Vincent Mccormick","Vincenzo Stafford","Vito Clark","Waldo Spencer","Werner Lowe","Werner Shepard","Wesley Ford","Wm Cantu","Zelma Pierce"]
[null,null,null,null,null,"Raymond Cochran",{"$f":"IF('Resulting List'!F212=\"\",\"\",'Resulting List'!F212)","v":""},null,{"$f":"TRANSPOSE(_xlfn._xlws.SORT(_xlfn.UNIQUE(_xlfn._xlws.FILTER(Customers[Names],ISNUMBER(SEARCH(Customers[[#This Row],[Search Criteria]],Customers[Names])),\"No data.\"))))","v":"Adriana Todd"},"Albert Ramirez","Alex Rubio","Amanda Beck","Amparo Orozco","Amy Todd","Angelina Roberson","April Fox","Arden Ayala","Arnoldo Pennington","Aubrey Giles","Bette Rivers","Brianna Alexander","Brianna Mora","Britt Vazquez","Broderick Gillespie","Brooke Roman","Calvin Buck","Carmela Mullins","Carol Stevenson","Carolina Russell","Carolyn Roberts","Chelsea Gilbert","Cheryl Williamson","Christa Frederick","Christian Armstrong","Christopher Stuart","Chung Krueger","Clare Whitney","Clarissa Archer","Claudio Lam","Cordell Mills","Craig Shepherd","Damien Kramer","Dane Burke","Danielle Stout","Darrel Liu","Darrin Mcneil","Darron Aguilar","Della Huber","Delores Krause","Dena Rosario","Dominick Johnston","Dona Herring","Dorothy Winters","Douglas Wiley","Doyle David","Earlene Hester","Earline Shepherd","Edwin Sparks","Eli Galvan","Elinor Kaufman","Elroy Porter","Elvin Flynn","Emmitt Porter","Erik Parsons","Ethel Forbes","Felicia Ware","Fidel Haynes","Francisco Valenzuela","Frank Hunt","Gabriela Moore","Gabrielle Patrick","Gale Fitzpatrick","Gayle Curtis","Genevieve Lucero","Gerry Oneal","Grady Ellis","Grover Escobar","Hans Patel","Horacio Black","Humberto Compton","Hunter Short","Ilene Mcguire","Imelda Lloyd","Ira Macdonald","Issac Allen","Jacques Velazquez","Janis Mullins","Janna Cowan","Javier Garner","Jayson Abbott","Jeannie Tapia","Jefferson Lee","Jeramy Keith","Jermaine Bradshaw","Jewel Lee","Jimmie Yang","Jodie Wood","John Cline","Josefina Dickerson","Josie Pineda","Judith Griffin","Julius Soto","Kelli Romero","Kerri Joseph","Kim Mccall","Lakeisha Velazquez","Latonya Logan","Lee Schmidt","Lela Atkins","Leland Robertson","Leonardo House","Leroy Mcintyre","Lesley Blevins","Lilia Berg","Lilly Stone","Lincoln Bond","Lindsay Hurst","Lionel Fuller","Lorene Hunter","Louis Kidd","Lucius Warren","Lucy Mejia","Lupe Ingram","Lynette Fuller","Lynnette Wright","Madge Copeland","Madge Tanner","Mae Sawyer","Malcolm Newman","Mamie Wong","Mandy Swanson","Marcella Everett","Marco Bright","Marcos Schaefer","Marcus Hays","Marina Walsh","Marion Savage","Marylou Bass","Marylou Mccarthy","Mathew Howard","Maurice Jacobson","Mauricio Bautista","Max Smith","Melanie Bridges","Melissa Brandt","Merlin Wu","Michel Simpson","Mickey Kennedy","Mike Sloan","Milton Walsh","Mohamed Allison","Mohammad Christensen","Nadia Macdonald","Naomi Snyder","Ned Lowe","Nettie Leonard","Olive Perkins","Ophelia Morrow","Oren Montes","Orlando Henderson","Owen Buchanan","Paul Norman","Rafael Barrett","Raymond Cochran","Reed Hooper","Reinaldo Houston","Renato Simmons","Rene Calhoun","Reva Hardin","Robert French","Robin Bender","Rodolfo Scott","Roland Blake","Roland Sullivan","Rolf Barnett","Ross Marquez","Ruthie Daugherty","Sandra Potts","Scott Stephenson","Scotty Gonzales","Sean Wiggins","Shana Gallagher","Sharron Montes","Sheryl Lindsey","Socorro Hayden","Solomon Andrade","Stacey Whitehead","Stevie Hale","Stuart Oliver","Stuart Riddle","Tammy Merritt","Theo Wiley","Theresa Murillo","Timothy Roberts","Tony Torres","Tracy Logan","Troy Hoover","Twila Rubio","Velma Everett","Vincent Mccormick","Vincenzo Stafford","Vito Clark","Waldo Spencer","Werner Lowe","Werner Shepard","Wesley Ford","Wm Cantu","Zelma Pierce"]
[null,null,null,null,null,"Amanda Beck",{"$f":"IF('Resulting List'!F213=\"\",\"\",'Resulting List'!F213)","v":""},null,{"$f":"TRANSPOSE(_xlfn._xlws.SORT(_xlfn.UNIQUE(_xlfn._xlws.FILTER(Customers[Names],ISNUMBER(SEARCH(Customers[[#This Row],[Search Criteria]],Customers[Names])),\"No data.\"))))","v":"Adriana Todd"},"Albert Ramirez","Alex Rubio","Amanda Beck","Amparo Orozco","Amy Todd","Angelina Roberson","April Fox","Arden Ayala","Arnoldo Pennington","Aubrey Giles","Bette Rivers","Brianna Alexander","Brianna Mora","Britt Vazquez","Broderick Gillespie","Brooke Roman","Calvin Buck","Carmela Mullins","Carol Stevenson","Carolina Russell","Carolyn Roberts","Chelsea Gilbert","Cheryl Williamson","Christa Frederick","Christian Armstrong","Christopher Stuart","Chung Krueger","Clare Whitney","Clarissa Archer","Claudio Lam","Cordell Mills","Craig Shepherd","Damien Kramer","Dane Burke","Danielle Stout","Darrel Liu","Darrin Mcneil","Darron Aguilar","Della Huber","Delores Krause","Dena Rosario","Dominick Johnston","Dona Herring","Dorothy Winters","Douglas Wiley","Doyle David","Earlene Hester","Earline Shepherd","Edwin Sparks","Eli Galvan","Elinor Kaufman","Elroy Porter","Elvin Flynn","Emmitt Porter","Erik Parsons","Ethel Forbes","Felicia Ware","Fidel Haynes","Francisco Valenzuela","Frank Hunt","Gabriela Moore","Gabrielle Patrick","Gale Fitzpatrick","Gayle Curtis","Genevieve Lucero","Gerry Oneal","Grady Ellis","Grover Escobar","Hans Patel","Horacio Black","Humberto Compton","Hunter Short","Ilene Mcguire","Imelda Lloyd","Ira Macdonald","Issac Allen","Jacques Velazquez","Janis Mullins","Janna Cowan","Javier Garner","Jayson Abbott","Jeannie Tapia","Jefferson Lee","Jeramy Keith","Jermaine Bradshaw","Jewel Lee","Jimmie Yang","Jodie Wood","John Cline","Josefina Dickerson","Josie Pineda","Judith Griffin","Julius Soto","Kelli Romero","Kerri Joseph","Kim Mccall","Lakeisha Velazquez","Latonya Logan","Lee Schmidt","Lela Atkins","Leland Robertson","Leonardo House","Leroy Mcintyre","Lesley Blevins","Lilia Berg","Lilly Stone","Lincoln Bond","Lindsay Hurst","Lionel Fuller","Lorene Hunter","Louis Kidd","Lucius Warren","Lucy Mejia","Lupe Ingram","Lynette Fuller","Lynnette Wright","Madge Copeland","Madge Tanner","Mae Sawyer","Malcolm Newman","Mamie Wong","Mandy Swanson","Marcella Everett","Marco Bright","Marcos Schaefer","Marcus Hays","Marina Walsh","Marion Savage","Marylou Bass","Marylou Mccarthy","Mathew Howard","Maurice Jacobson","Mauricio Bautista","Max Smith","Melanie Bridges","Melissa Brandt","Merlin Wu","Michel Simpson","Mickey Kennedy","Mike Sloan","Milton Walsh","Mohamed Allison","Mohammad Christensen","Nadia Macdonald","Naomi Snyder","Ned Lowe","Nettie Leonard","Olive Perkins","Ophelia Morrow","Oren Montes","Orlando Henderson","Owen Buchanan","Paul Norman","Rafael Barrett","Raymond Cochran","Reed Hooper","Reinaldo Houston","Renato Simmons","Rene Calhoun","Reva Hardin","Robert French","Robin Bender","Rodolfo Scott","Roland Blake","Roland Sullivan","Rolf Barnett","Ross Marquez","Ruthie Daugherty","Sandra Potts","Scott Stephenson","Scotty Gonzales","Sean Wiggins","Shana Gallagher","Sharron Montes","Sheryl Lindsey","Socorro Hayden","Solomon Andrade","Stacey Whitehead","Stevie Hale","Stuart Oliver","Stuart Riddle","Tammy Merritt","Theo Wiley","Theresa Murillo","Timothy Roberts","Tony Torres","Tracy Logan","Troy Hoover","Twila Rubio","Velma Everett","Vincent Mccormick","Vincenzo Stafford","Vito Clark","Waldo Spencer","Werner Lowe","Werner Shepard","Wesley Ford","Wm Cantu","Zelma Pierce"]
[null,null,null,null,null,"Lela Atkins",{"$f":"IF('Resulting List'!F214=\"\",\"\",'Resulting List'!F214)","v":""},null,{"$f":"TRANSPOSE(_xlfn._xlws.SORT(_xlfn.UNIQUE(_xlfn._xlws.FILTER(Customers[Names],ISNUMBER(SEARCH(Customers[[#This Row],[Search Criteria]],Customers[Names])),\"No data.\"))))","v":"Adriana Todd"},"Albert Ramirez","Alex Rubio","Amanda Beck","Amparo Orozco","Amy Todd","Angelina Roberson","April Fox","Arden Ayala","Arnoldo Pennington","Aubrey Giles","Bette Rivers","Brianna Alexander","Brianna Mora","Britt Vazquez","Broderick Gillespie","Brooke Roman","Calvin Buck","Carmela Mullins","Carol Stevenson","Carolina Russell","Carolyn Roberts","Chelsea Gilbert","Cheryl Williamson","Christa Frederick","Christian Armstrong","Christopher Stuart","Chung Krueger","Clare Whitney","Clarissa Archer","Claudio Lam","Cordell Mills","Craig Shepherd","Damien Kramer","Dane Burke","Danielle Stout","Darrel Liu","Darrin Mcneil","Darron Aguilar","Della Huber","Delores Krause","Dena Rosario","Dominick Johnston","Dona Herring","Dorothy Winters","Douglas Wiley","Doyle David","Earlene Hester","Earline Shepherd","Edwin Sparks","Eli Galvan","Elinor Kaufman","Elroy Porter","Elvin Flynn","Emmitt Porter","Erik Parsons","Ethel Forbes","Felicia Ware","Fidel Haynes","Francisco Valenzuela","Frank Hunt","Gabriela Moore","Gabrielle Patrick","Gale Fitzpatrick","Gayle Curtis","Genevieve Lucero","Gerry Oneal","Grady Ellis","Grover Escobar","Hans Patel","Horacio Black","Humberto Compton","Hunter Short","Ilene Mcguire","Imelda Lloyd","Ira Macdonald","Issac Allen","Jacques Velazquez","Janis Mullins","Janna Cowan","Javier Garner","Jayson Abbott","Jeannie Tapia","Jefferson Lee","Jeramy Keith","Jermaine Bradshaw","Jewel Lee","Jimmie Yang","Jodie Wood","John Cline","Josefina Dickerson","Josie Pineda","Judith Griffin","Julius Soto","Kelli Romero","Kerri Joseph","Kim Mccall","Lakeisha Velazquez","Latonya Logan","Lee Schmidt","Lela Atkins","Leland Robertson","Leonardo House","Leroy Mcintyre","Lesley Blevins","Lilia Berg","Lilly Stone","Lincoln Bond","Lindsay Hurst","Lionel Fuller","Lorene Hunter","Louis Kidd","Lucius Warren","Lucy Mejia","Lupe Ingram","Lynette Fuller","Lynnette Wright","Madge Copeland","Madge Tanner","Mae Sawyer","Malcolm Newman","Mamie Wong","Mandy Swanson","Marcella Everett","Marco Bright","Marcos Schaefer","Marcus Hays","Marina Walsh","Marion Savage","Marylou Bass","Marylou Mccarthy","Mathew Howard","Maurice Jacobson","Mauricio Bautista","Max Smith","Melanie Bridges","Melissa Brandt","Merlin Wu","Michel Simpson","Mickey Kennedy","Mike Sloan","Milton Walsh","Mohamed Allison","Mohammad Christensen","Nadia Macdonald","Naomi Snyder","Ned Lowe","Nettie Leonard","Olive Perkins","Ophelia Morrow","Oren Montes","Orlando Henderson","Owen Buchanan","Paul Norman","Rafael Barrett","Raymond Cochran","Reed Hooper","Reinaldo Houston","Renato Simmons","Rene Calhoun","Reva Hardin","Robert French","Robin Bender","Rodolfo Scott","Roland Blake","Roland Sullivan","Rolf Barnett","Ross Marquez","Ruthie Daugherty","Sandra Potts","Scott Stephenson","Scotty Gonzales","Sean Wiggins","Shana Gallagher","Sharron Montes","Sheryl Lindsey","Socorro Hayden","Solomon Andrade","Stacey Whitehead","Stevie Hale","Stuart Oliver","Stuart Riddle","Tammy Merritt","Theo Wiley","Theresa Murillo","Timothy Roberts","Tony Torres","Tracy Logan","Troy Hoover","Twila Rubio","Velma Everett","Vincent Mccormick","Vincenzo Stafford","Vito Clark","Waldo Spencer","Werner Lowe","Werner Shepard","Wesley Ford","Wm Cantu","Zelma Pierce"]
[null,null,null,null,null,"Twila Rubio",{"$f":"IF('Resulting List'!F215=\"\",\"\",'Resulting List'!F215)","v":""},null,{"$f":"TRANSPOSE(_xlfn._xlws.SORT(_xlfn.UNIQUE(_xlfn._xlws.FILTER(Customers[Names],ISNUMBER(SEARCH(Customers[[#This Row],[Search Criteria]],Customers[Names])),\"No data.\"))))","v":"Adriana Todd"},"Albert Ramirez","Alex Rubio","Amanda Beck","Amparo Orozco","Amy Todd","Angelina Roberson","April Fox","Arden Ayala","Arnoldo Pennington","Aubrey Giles","Bette Rivers","Brianna Alexander","Brianna Mora","Britt Vazquez","Broderick Gillespie","Brooke Roman","Calvin Buck","Carmela Mullins","Carol Stevenson","Carolina Russell","Carolyn Roberts","Chelsea Gilbert","Cheryl Williamson","Christa Frederick","Christian Armstrong","Christopher Stuart","Chung Krueger","Clare Whitney","Clarissa Archer","Claudio Lam","Cordell Mills","Craig Shepherd","Damien Kramer","Dane Burke","Danielle Stout","Darrel Liu","Darrin Mcneil","Darron Aguilar","Della Huber","Delores Krause","Dena Rosario","Dominick Johnston","Dona Herring","Dorothy Winters","Douglas Wiley","Doyle David","Earlene Hester","Earline Shepherd","Edwin Sparks","Eli Galvan","Elinor Kaufman","Elroy Porter","Elvin Flynn","Emmitt Porter","Erik Parsons","Ethel Forbes","Felicia Ware","Fidel Haynes","Francisco Valenzuela","Frank Hunt","Gabriela Moore","Gabrielle Patrick","Gale Fitzpatrick","Gayle Curtis","Genevieve Lucero","Gerry Oneal","Grady Ellis","Grover Escobar","Hans Patel","Horacio Black","Humberto Compton","Hunter Short","Ilene Mcguire","Imelda Lloyd","Ira Macdonald","Issac Allen","Jacques Velazquez","Janis Mullins","Janna Cowan","Javier Garner","Jayson Abbott","Jeannie Tapia","Jefferson Lee","Jeramy Keith","Jermaine Bradshaw","Jewel Lee","Jimmie Yang","Jodie Wood","John Cline","Josefina Dickerson","Josie Pineda","Judith Griffin","Julius Soto","Kelli Romero","Kerri Joseph","Kim Mccall","Lakeisha Velazquez","Latonya Logan","Lee Schmidt","Lela Atkins","Leland Robertson","Leonardo House","Leroy Mcintyre","Lesley Blevins","Lilia Berg","Lilly Stone","Lincoln Bond","Lindsay Hurst","Lionel Fuller","Lorene Hunter","Louis Kidd","Lucius Warren","Lucy Mejia","Lupe Ingram","Lynette Fuller","Lynnette Wright","Madge Copeland","Madge Tanner","Mae Sawyer","Malcolm Newman","Mamie Wong","Mandy Swanson","Marcella Everett","Marco Bright","Marcos Schaefer","Marcus Hays","Marina Walsh","Marion Savage","Marylou Bass","Marylou Mccarthy","Mathew Howard","Maurice Jacobson","Mauricio Bautista","Max Smith","Melanie Bridges","Melissa Brandt","Merlin Wu","Michel Simpson","Mickey Kennedy","Mike Sloan","Milton Walsh","Mohamed Allison","Mohammad Christensen","Nadia Macdonald","Naomi Snyder","Ned Lowe","Nettie Leonard","Olive Perkins","Ophelia Morrow","Oren Montes","Orlando Henderson","Owen Buchanan","Paul Norman","Rafael Barrett","Raymond Cochran","Reed Hooper","Reinaldo Houston","Renato Simmons","Rene Calhoun","Reva Hardin","Robert French","Robin Bender","Rodolfo Scott","Roland Blake","Roland Sullivan","Rolf Barnett","Ross Marquez","Ruthie Daugherty","Sandra Potts","Scott Stephenson","Scotty Gonzales","Sean Wiggins","Shana Gallagher","Sharron Montes","Sheryl Lindsey","Socorro Hayden","Solomon Andrade","Stacey Whitehead","Stevie Hale","Stuart Oliver","Stuart Riddle","Tammy Merritt","Theo Wiley","Theresa Murillo","Timothy Roberts","Tony Torres","Tracy Logan","Troy Hoover","Twila Rubio","Velma Everett","Vincent Mccormick","Vincenzo Stafford","Vito Clark","Waldo Spencer","Werner Lowe","Werner Shepard","Wesley Ford","Wm Cantu","Zelma Pierce"]
[null,null,null,null,null,"Hunter Short",{"$f":"IF('Resulting List'!F216=\"\",\"\",'Resulting List'!F216)","v":""},null,{"$f":"TRANSPOSE(_xlfn._xlws.SORT(_xlfn.UNIQUE(_xlfn._xlws.FILTER(Customers[Names],ISNUMBER(SEARCH(Customers[[#This Row],[Search Criteria]],Customers[Names])),\"No data.\"))))","v":"Adriana Todd"},"Albert Ramirez","Alex Rubio","Amanda Beck","Amparo Orozco","Amy Todd","Angelina Roberson","April Fox","Arden Ayala","Arnoldo Pennington","Aubrey Giles","Bette Rivers","Brianna Alexander","Brianna Mora","Britt Vazquez","Broderick Gillespie","Brooke Roman","Calvin Buck","Carmela Mullins","Carol Stevenson","Carolina Russell","Carolyn Roberts","Chelsea Gilbert","Cheryl Williamson","Christa Frederick","Christian Armstrong","Christopher Stuart","Chung Krueger","Clare Whitney","Clarissa Archer","Claudio Lam","Cordell Mills","Craig Shepherd","Damien Kramer","Dane Burke","Danielle Stout","Darrel Liu","Darrin Mcneil","Darron Aguilar","Della Huber","Delores Krause","Dena Rosario","Dominick Johnston","Dona Herring","Dorothy Winters","Douglas Wiley","Doyle David","Earlene Hester","Earline Shepherd","Edwin Sparks","Eli Galvan","Elinor Kaufman","Elroy Porter","Elvin Flynn","Emmitt Porter","Erik Parsons","Ethel Forbes","Felicia Ware","Fidel Haynes","Francisco Valenzuela","Frank Hunt","Gabriela Moore","Gabrielle Patrick","Gale Fitzpatrick","Gayle Curtis","Genevieve Lucero","Gerry Oneal","Grady Ellis","Grover Escobar","Hans Patel","Horacio Black","Humberto Compton","Hunter Short","Ilene Mcguire","Imelda Lloyd","Ira Macdonald","Issac Allen","Jacques Velazquez","Janis Mullins","Janna Cowan","Javier Garner","Jayson Abbott","Jeannie Tapia","Jefferson Lee","Jeramy Keith","Jermaine Bradshaw","Jewel Lee","Jimmie Yang","Jodie Wood","John Cline","Josefina Dickerson","Josie Pineda","Judith Griffin","Julius Soto","Kelli Romero","Kerri Joseph","Kim Mccall","Lakeisha Velazquez","Latonya Logan","Lee Schmidt","Lela Atkins","Leland Robertson","Leonardo House","Leroy Mcintyre","Lesley Blevins","Lilia Berg","Lilly Stone","Lincoln Bond","Lindsay Hurst","Lionel Fuller","Lorene Hunter","Louis Kidd","Lucius Warren","Lucy Mejia","Lupe Ingram","Lynette Fuller","Lynnette Wright","Madge Copeland","Madge Tanner","Mae Sawyer","Malcolm Newman","Mamie Wong","Mandy Swanson","Marcella Everett","Marco Bright","Marcos Schaefer","Marcus Hays","Marina Walsh","Marion Savage","Marylou Bass","Marylou Mccarthy","Mathew Howard","Maurice Jacobson","Mauricio Bautista","Max Smith","Melanie Bridges","Melissa Brandt","Merlin Wu","Michel Simpson","Mickey Kennedy","Mike Sloan","Milton Walsh","Mohamed Allison","Mohammad Christensen","Nadia Macdonald","Naomi Snyder","Ned Lowe","Nettie Leonard","Olive Perkins","Ophelia Morrow","Oren Montes","Orlando Henderson","Owen Buchanan","Paul Norman","Rafael Barrett","Raymond Cochran","Reed Hooper","Reinaldo Houston","Renato Simmons","Rene Calhoun","Reva Hardin","Robert French","Robin Bender","Rodolfo Scott","Roland Blake","Roland Sullivan","Rolf Barnett","Ross Marquez","Ruthie Daugherty","Sandra Potts","Scott Stephenson","Scotty Gonzales","Sean Wiggins","Shana Gallagher","Sharron Montes","Sheryl Lindsey","Socorro Hayden","Solomon Andrade","Stacey Whitehead","Stevie Hale","Stuart Oliver","Stuart Riddle","Tammy Merritt","Theo Wiley","Theresa Murillo","Timothy Roberts","Tony Torres","Tracy Logan","Troy Hoover","Twila Rubio","Velma Everett","Vincent Mccormick","Vincenzo Stafford","Vito Clark","Waldo Spencer","Werner Lowe","Werner Shepard","Wesley Ford","Wm Cantu","Zelma Pierce"]
[null,null,null,null,null,"Albert Ramirez",{"$f":"IF('Resulting List'!F217=\"\",\"\",'Resulting List'!F217)","v":""},null,{"$f":"TRANSPOSE(_xlfn._xlws.SORT(_xlfn.UNIQUE(_xlfn._xlws.FILTER(Customers[Names],ISNUMBER(SEARCH(Customers[[#This Row],[Search Criteria]],Customers[Names])),\"No data.\"))))","v":"Adriana Todd"},"Albert Ramirez","Alex Rubio","Amanda Beck","Amparo Orozco","Amy Todd","Angelina Roberson","April Fox","Arden Ayala","Arnoldo Pennington","Aubrey Giles","Bette Rivers","Brianna Alexander","Brianna Mora","Britt Vazquez","Broderick Gillespie","Brooke Roman","Calvin Buck","Carmela Mullins","Carol Stevenson","Carolina Russell","Carolyn Roberts","Chelsea Gilbert","Cheryl Williamson","Christa Frederick","Christian Armstrong","Christopher Stuart","Chung Krueger","Clare Whitney","Clarissa Archer","Claudio Lam","Cordell Mills","Craig Shepherd","Damien Kramer","Dane Burke","Danielle Stout","Darrel Liu","Darrin Mcneil","Darron Aguilar","Della Huber","Delores Krause","Dena Rosario","Dominick Johnston","Dona Herring","Dorothy Winters","Douglas Wiley","Doyle David","Earlene Hester","Earline Shepherd","Edwin Sparks","Eli Galvan","Elinor Kaufman","Elroy Porter","Elvin Flynn","Emmitt Porter","Erik Parsons","Ethel Forbes","Felicia Ware","Fidel Haynes","Francisco Valenzuela","Frank Hunt","Gabriela Moore","Gabrielle Patrick","Gale Fitzpatrick","Gayle Curtis","Genevieve Lucero","Gerry Oneal","Grady Ellis","Grover Escobar","Hans Patel","Horacio Black","Humberto Compton","Hunter Short","Ilene Mcguire","Imelda Lloyd","Ira Macdonald","Issac Allen","Jacques Velazquez","Janis Mullins","Janna Cowan","Javier Garner","Jayson Abbott","Jeannie Tapia","Jefferson Lee","Jeramy Keith","Jermaine Bradshaw","Jewel Lee","Jimmie Yang","Jodie Wood","John Cline","Josefina Dickerson","Josie Pineda","Judith Griffin","Julius Soto","Kelli Romero","Kerri Joseph","Kim Mccall","Lakeisha Velazquez","Latonya Logan","Lee Schmidt","Lela Atkins","Leland Robertson","Leonardo House","Leroy Mcintyre","Lesley Blevins","Lilia Berg","Lilly Stone","Lincoln Bond","Lindsay Hurst","Lionel Fuller","Lorene Hunter","Louis Kidd","Lucius Warren","Lucy Mejia","Lupe Ingram","Lynette Fuller","Lynnette Wright","Madge Copeland","Madge Tanner","Mae Sawyer","Malcolm Newman","Mamie Wong","Mandy Swanson","Marcella Everett","Marco Bright","Marcos Schaefer","Marcus Hays","Marina Walsh","Marion Savage","Marylou Bass","Marylou Mccarthy","Mathew Howard","Maurice Jacobson","Mauricio Bautista","Max Smith","Melanie Bridges","Melissa Brandt","Merlin Wu","Michel Simpson","Mickey Kennedy","Mike Sloan","Milton Walsh","Mohamed Allison","Mohammad Christensen","Nadia Macdonald","Naomi Snyder","Ned Lowe","Nettie Leonard","Olive Perkins","Ophelia Morrow","Oren Montes","Orlando Henderson","Owen Buchanan","Paul Norman","Rafael Barrett","Raymond Cochran","Reed Hooper","Reinaldo Houston","Renato Simmons","Rene Calhoun","Reva Hardin","Robert French","Robin Bender","Rodolfo Scott","Roland Blake","Roland Sullivan","Rolf Barnett","Ross Marquez","Ruthie Daugherty","Sandra Potts","Scott Stephenson","Scotty Gonzales","Sean Wiggins","Shana Gallagher","Sharron Montes","Sheryl Lindsey","Socorro Hayden","Solomon Andrade","Stacey Whitehead","Stevie Hale","Stuart Oliver","Stuart Riddle","Tammy Merritt","Theo Wiley","Theresa Murillo","Timothy Roberts","Tony Torres","Tracy Logan","Troy Hoover","Twila Rubio","Velma Everett","Vincent Mccormick","Vincenzo Stafford","Vito Clark","Waldo Spencer","Werner Lowe","Werner Shepard","Wesley Ford","Wm Cantu","Zelma Pierce"]
[null,null,null,null,null,"Jefferson Lee",{"$f":"IF('Resulting List'!F218=\"\",\"\",'Resulting List'!F218)","v":""},null,{"$f":"TRANSPOSE(_xlfn._xlws.SORT(_xlfn.UNIQUE(_xlfn._xlws.FILTER(Customers[Names],ISNUMBER(SEARCH(Customers[[#This Row],[Search Criteria]],Customers[Names])),\"No data.\"))))","v":"Adriana Todd"},"Albert Ramirez","Alex Rubio","Amanda Beck","Amparo Orozco","Amy Todd","Angelina Roberson","April Fox","Arden Ayala","Arnoldo Pennington","Aubrey Giles","Bette Rivers","Brianna Alexander","Brianna Mora","Britt Vazquez","Broderick Gillespie","Brooke Roman","Calvin Buck","Carmela Mullins","Carol Stevenson","Carolina Russell","Carolyn Roberts","Chelsea Gilbert","Cheryl Williamson","Christa Frederick","Christian Armstrong","Christopher Stuart","Chung Krueger","Clare Whitney","Clarissa Archer","Claudio Lam","Cordell Mills","Craig Shepherd","Damien Kramer","Dane Burke","Danielle Stout","Darrel Liu","Darrin Mcneil","Darron Aguilar","Della Huber","Delores Krause","Dena Rosario","Dominick Johnston","Dona Herring","Dorothy Winters","Douglas Wiley","Doyle David","Earlene Hester","Earline Shepherd","Edwin Sparks","Eli Galvan","Elinor Kaufman","Elroy Porter","Elvin Flynn","Emmitt Porter","Erik Parsons","Ethel Forbes","Felicia Ware","Fidel Haynes","Francisco Valenzuela","Frank Hunt","Gabriela Moore","Gabrielle Patrick","Gale Fitzpatrick","Gayle Curtis","Genevieve Lucero","Gerry Oneal","Grady Ellis","Grover Escobar","Hans Patel","Horacio Black","Humberto Compton","Hunter Short","Ilene Mcguire","Imelda Lloyd","Ira Macdonald","Issac Allen","Jacques Velazquez","Janis Mullins","Janna Cowan","Javier Garner","Jayson Abbott","Jeannie Tapia","Jefferson Lee","Jeramy Keith","Jermaine Bradshaw","Jewel Lee","Jimmie Yang","Jodie Wood","John Cline","Josefina Dickerson","Josie Pineda","Judith Griffin","Julius Soto","Kelli Romero","Kerri Joseph","Kim Mccall","Lakeisha Velazquez","Latonya Logan","Lee Schmidt","Lela Atkins","Leland Robertson","Leonardo House","Leroy Mcintyre","Lesley Blevins","Lilia Berg","Lilly Stone","Lincoln Bond","Lindsay Hurst","Lionel Fuller","Lorene Hunter","Louis Kidd","Lucius Warren","Lucy Mejia","Lupe Ingram","Lynette Fuller","Lynnette Wright","Madge Copeland","Madge Tanner","Mae Sawyer","Malcolm Newman","Mamie Wong","Mandy Swanson","Marcella Everett","Marco Bright","Marcos Schaefer","Marcus Hays","Marina Walsh","Marion Savage","Marylou Bass","Marylou Mccarthy","Mathew Howard","Maurice Jacobson","Mauricio Bautista","Max Smith","Melanie Bridges","Melissa Brandt","Merlin Wu","Michel Simpson","Mickey Kennedy","Mike Sloan","Milton Walsh","Mohamed Allison","Mohammad Christensen","Nadia Macdonald","Naomi Snyder","Ned Lowe","Nettie Leonard","Olive Perkins","Ophelia Morrow","Oren Montes","Orlando Henderson","Owen Buchanan","Paul Norman","Rafael Barrett","Raymond Cochran","Reed Hooper","Reinaldo Houston","Renato Simmons","Rene Calhoun","Reva Hardin","Robert French","Robin Bender","Rodolfo Scott","Roland Blake","Roland Sullivan","Rolf Barnett","Ross Marquez","Ruthie Daugherty","Sandra Potts","Scott Stephenson","Scotty Gonzales","Sean Wiggins","Shana Gallagher","Sharron Montes","Sheryl Lindsey","Socorro Hayden","Solomon Andrade","Stacey Whitehead","Stevie Hale","Stuart Oliver","Stuart Riddle","Tammy Merritt","Theo Wiley","Theresa Murillo","Timothy Roberts","Tony Torres","Tracy Logan","Troy Hoover","Twila Rubio","Velma Everett","Vincent Mccormick","Vincenzo Stafford","Vito Clark","Waldo Spencer","Werner Lowe","Werner Shepard","Wesley Ford","Wm Cantu","Zelma Pierce"]
[null,null,null,null,null,"Emmitt Porter",{"$f":"IF('Resulting List'!F219=\"\",\"\",'Resulting List'!F219)","v":""},null,{"$f":"TRANSPOSE(_xlfn._xlws.SORT(_xlfn.UNIQUE(_xlfn._xlws.FILTER(Customers[Names],ISNUMBER(SEARCH(Customers[[#This Row],[Search Criteria]],Customers[Names])),\"No data.\"))))","v":"Adriana Todd"},"Albert Ramirez","Alex Rubio","Amanda Beck","Amparo Orozco","Amy Todd","Angelina Roberson","April Fox","Arden Ayala","Arnoldo Pennington","Aubrey Giles","Bette Rivers","Brianna Alexander","Brianna Mora","Britt Vazquez","Broderick Gillespie","Brooke Roman","Calvin Buck","Carmela Mullins","Carol Stevenson","Carolina Russell","Carolyn Roberts","Chelsea Gilbert","Cheryl Williamson","Christa Frederick","Christian Armstrong","Christopher Stuart","Chung Krueger","Clare Whitney","Clarissa Archer","Claudio Lam","Cordell Mills","Craig Shepherd","Damien Kramer","Dane Burke","Danielle Stout","Darrel Liu","Darrin Mcneil","Darron Aguilar","Della Huber","Delores Krause","Dena Rosario","Dominick Johnston","Dona Herring","Dorothy Winters","Douglas Wiley","Doyle David","Earlene Hester","Earline Shepherd","Edwin Sparks","Eli Galvan","Elinor Kaufman","Elroy Porter","Elvin Flynn","Emmitt Porter","Erik Parsons","Ethel Forbes","Felicia Ware","Fidel Haynes","Francisco Valenzuela","Frank Hunt","Gabriela Moore","Gabrielle Patrick","Gale Fitzpatrick","Gayle Curtis","Genevieve Lucero","Gerry Oneal","Grady Ellis","Grover Escobar","Hans Patel","Horacio Black","Humberto Compton","Hunter Short","Ilene Mcguire","Imelda Lloyd","Ira Macdonald","Issac Allen","Jacques Velazquez","Janis Mullins","Janna Cowan","Javier Garner","Jayson Abbott","Jeannie Tapia","Jefferson Lee","Jeramy Keith","Jermaine Bradshaw","Jewel Lee","Jimmie Yang","Jodie Wood","John Cline","Josefina Dickerson","Josie Pineda","Judith Griffin","Julius Soto","Kelli Romero","Kerri Joseph","Kim Mccall","Lakeisha Velazquez","Latonya Logan","Lee Schmidt","Lela Atkins","Leland Robertson","Leonardo House","Leroy Mcintyre","Lesley Blevins","Lilia Berg","Lilly Stone","Lincoln Bond","Lindsay Hurst","Lionel Fuller","Lorene Hunter","Louis Kidd","Lucius Warren","Lucy Mejia","Lupe Ingram","Lynette Fuller","Lynnette Wright","Madge Copeland","Madge Tanner","Mae Sawyer","Malcolm Newman","Mamie Wong","Mandy Swanson","Marcella Everett","Marco Bright","Marcos Schaefer","Marcus Hays","Marina Walsh","Marion Savage","Marylou Bass","Marylou Mccarthy","Mathew Howard","Maurice Jacobson","Mauricio Bautista","Max Smith","Melanie Bridges","Melissa Brandt","Merlin Wu","Michel Simpson","Mickey Kennedy","Mike Sloan","Milton Walsh","Mohamed Allison","Mohammad Christensen","Nadia Macdonald","Naomi Snyder","Ned Lowe","Nettie Leonard","Olive Perkins","Ophelia Morrow","Oren Montes","Orlando Henderson","Owen Buchanan","Paul Norman","Rafael Barrett","Raymond Cochran","Reed Hooper","Reinaldo Houston","Renato Simmons","Rene Calhoun","Reva Hardin","Robert French","Robin Bender","Rodolfo Scott","Roland Blake","Roland Sullivan","Rolf Barnett","Ross Marquez","Ruthie Daugherty","Sandra Potts","Scott Stephenson","Scotty Gonzales","Sean Wiggins","Shana Gallagher","Sharron Montes","Sheryl Lindsey","Socorro Hayden","Solomon Andrade","Stacey Whitehead","Stevie Hale","Stuart Oliver","Stuart Riddle","Tammy Merritt","Theo Wiley","Theresa Murillo","Timothy Roberts","Tony Torres","Tracy Logan","Troy Hoover","Twila Rubio","Velma Everett","Vincent Mccormick","Vincenzo Stafford","Vito Clark","Waldo Spencer","Werner Lowe","Werner Shepard","Wesley Ford","Wm Cantu","Zelma Pierce"]
[null,null,null,null,null,"Mohammad Christensen",{"$f":"IF('Resulting List'!F220=\"\",\"\",'Resulting List'!F220)","v":""},null,{"$f":"TRANSPOSE(_xlfn._xlws.SORT(_xlfn.UNIQUE(_xlfn._xlws.FILTER(Customers[Names],ISNUMBER(SEARCH(Customers[[#This Row],[Search Criteria]],Customers[Names])),\"No data.\"))))","v":"Adriana Todd"},"Albert Ramirez","Alex Rubio","Amanda Beck","Amparo Orozco","Amy Todd","Angelina Roberson","April Fox","Arden Ayala","Arnoldo Pennington","Aubrey Giles","Bette Rivers","Brianna Alexander","Brianna Mora","Britt Vazquez","Broderick Gillespie","Brooke Roman","Calvin Buck","Carmela Mullins","Carol Stevenson","Carolina Russell","Carolyn Roberts","Chelsea Gilbert","Cheryl Williamson","Christa Frederick","Christian Armstrong","Christopher Stuart","Chung Krueger","Clare Whitney","Clarissa Archer","Claudio Lam","Cordell Mills","Craig Shepherd","Damien Kramer","Dane Burke","Danielle Stout","Darrel Liu","Darrin Mcneil","Darron Aguilar","Della Huber","Delores Krause","Dena Rosario","Dominick Johnston","Dona Herring","Dorothy Winters","Douglas Wiley","Doyle David","Earlene Hester","Earline Shepherd","Edwin Sparks","Eli Galvan","Elinor Kaufman","Elroy Porter","Elvin Flynn","Emmitt Porter","Erik Parsons","Ethel Forbes","Felicia Ware","Fidel Haynes","Francisco Valenzuela","Frank Hunt","Gabriela Moore","Gabrielle Patrick","Gale Fitzpatrick","Gayle Curtis","Genevieve Lucero","Gerry Oneal","Grady Ellis","Grover Escobar","Hans Patel","Horacio Black","Humberto Compton","Hunter Short","Ilene Mcguire","Imelda Lloyd","Ira Macdonald","Issac Allen","Jacques Velazquez","Janis Mullins","Janna Cowan","Javier Garner","Jayson Abbott","Jeannie Tapia","Jefferson Lee","Jeramy Keith","Jermaine Bradshaw","Jewel Lee","Jimmie Yang","Jodie Wood","John Cline","Josefina Dickerson","Josie Pineda","Judith Griffin","Julius Soto","Kelli Romero","Kerri Joseph","Kim Mccall","Lakeisha Velazquez","Latonya Logan","Lee Schmidt","Lela Atkins","Leland Robertson","Leonardo House","Leroy Mcintyre","Lesley Blevins","Lilia Berg","Lilly Stone","Lincoln Bond","Lindsay Hurst","Lionel Fuller","Lorene Hunter","Louis Kidd","Lucius Warren","Lucy Mejia","Lupe Ingram","Lynette Fuller","Lynnette Wright","Madge Copeland","Madge Tanner","Mae Sawyer","Malcolm Newman","Mamie Wong","Mandy Swanson","Marcella Everett","Marco Bright","Marcos Schaefer","Marcus Hays","Marina Walsh","Marion Savage","Marylou Bass","Marylou Mccarthy","Mathew Howard","Maurice Jacobson","Mauricio Bautista","Max Smith","Melanie Bridges","Melissa Brandt","Merlin Wu","Michel Simpson","Mickey Kennedy","Mike Sloan","Milton Walsh","Mohamed Allison","Mohammad Christensen","Nadia Macdonald","Naomi Snyder","Ned Lowe","Nettie Leonard","Olive Perkins","Ophelia Morrow","Oren Montes","Orlando Henderson","Owen Buchanan","Paul Norman","Rafael Barrett","Raymond Cochran","Reed Hooper","Reinaldo Houston","Renato Simmons","Rene Calhoun","Reva Hardin","Robert French","Robin Bender","Rodolfo Scott","Roland Blake","Roland Sullivan","Rolf Barnett","Ross Marquez","Ruthie Daugherty","Sandra Potts","Scott Stephenson","Scotty Gonzales","Sean Wiggins","Shana Gallagher","Sharron Montes","Sheryl Lindsey","Socorro Hayden","Solomon Andrade","Stacey Whitehead","Stevie Hale","Stuart Oliver","Stuart Riddle","Tammy Merritt","Theo Wiley","Theresa Murillo","Timothy Roberts","Tony Torres","Tracy Logan","Troy Hoover","Twila Rubio","Velma Everett","Vincent Mccormick","Vincenzo Stafford","Vito Clark","Waldo Spencer","Werner Lowe","Werner Shepard","Wesley Ford","Wm Cantu","Zelma Pierce"]
[null,null,null,null,null,"Shana Gallagher",{"$f":"IF('Resulting List'!F221=\"\",\"\",'Resulting List'!F221)","v":""},null,{"$f":"TRANSPOSE(_xlfn._xlws.SORT(_xlfn.UNIQUE(_xlfn._xlws.FILTER(Customers[Names],ISNUMBER(SEARCH(Customers[[#This Row],[Search Criteria]],Customers[Names])),\"No data.\"))))","v":"Adriana Todd"},"Albert Ramirez","Alex Rubio","Amanda Beck","Amparo Orozco","Amy Todd","Angelina Roberson","April Fox","Arden Ayala","Arnoldo Pennington","Aubrey Giles","Bette Rivers","Brianna Alexander","Brianna Mora","Britt Vazquez","Broderick Gillespie","Brooke Roman","Calvin Buck","Carmela Mullins","Carol Stevenson","Carolina Russell","Carolyn Roberts","Chelsea Gilbert","Cheryl Williamson","Christa Frederick","Christian Armstrong","Christopher Stuart","Chung Krueger","Clare Whitney","Clarissa Archer","Claudio Lam","Cordell Mills","Craig Shepherd","Damien Kramer","Dane Burke","Danielle Stout","Darrel Liu","Darrin Mcneil","Darron Aguilar","Della Huber","Delores Krause","Dena Rosario","Dominick Johnston","Dona Herring","Dorothy Winters","Douglas Wiley","Doyle David","Earlene Hester","Earline Shepherd","Edwin Sparks","Eli Galvan","Elinor Kaufman","Elroy Porter","Elvin Flynn","Emmitt Porter","Erik Parsons","Ethel Forbes","Felicia Ware","Fidel Haynes","Francisco Valenzuela","Frank Hunt","Gabriela Moore","Gabrielle Patrick","Gale Fitzpatrick","Gayle Curtis","Genevieve Lucero","Gerry Oneal","Grady Ellis","Grover Escobar","Hans Patel","Horacio Black","Humberto Compton","Hunter Short","Ilene Mcguire","Imelda Lloyd","Ira Macdonald","Issac Allen","Jacques Velazquez","Janis Mullins","Janna Cowan","Javier Garner","Jayson Abbott","Jeannie Tapia","Jefferson Lee","Jeramy Keith","Jermaine Bradshaw","Jewel Lee","Jimmie Yang","Jodie Wood","John Cline","Josefina Dickerson","Josie Pineda","Judith Griffin","Julius Soto","Kelli Romero","Kerri Joseph","Kim Mccall","Lakeisha Velazquez","Latonya Logan","Lee Schmidt","Lela Atkins","Leland Robertson","Leonardo House","Leroy Mcintyre","Lesley Blevins","Lilia Berg","Lilly Stone","Lincoln Bond","Lindsay Hurst","Lionel Fuller","Lorene Hunter","Louis Kidd","Lucius Warren","Lucy Mejia","Lupe Ingram","Lynette Fuller","Lynnette Wright","Madge Copeland","Madge Tanner","Mae Sawyer","Malcolm Newman","Mamie Wong","Mandy Swanson","Marcella Everett","Marco Bright","Marcos Schaefer","Marcus Hays","Marina Walsh","Marion Savage","Marylou Bass","Marylou Mccarthy","Mathew Howard","Maurice Jacobson","Mauricio Bautista","Max Smith","Melanie Bridges","Melissa Brandt","Merlin Wu","Michel Simpson","Mickey Kennedy","Mike Sloan","Milton Walsh","Mohamed Allison","Mohammad Christensen","Nadia Macdonald","Naomi Snyder","Ned Lowe","Nettie Leonard","Olive Perkins","Ophelia Morrow","Oren Montes","Orlando Henderson","Owen Buchanan","Paul Norman","Rafael Barrett","Raymond Cochran","Reed Hooper","Reinaldo Houston","Renato Simmons","Rene Calhoun","Reva Hardin","Robert French","Robin Bender","Rodolfo Scott","Roland Blake","Roland Sullivan","Rolf Barnett","Ross Marquez","Ruthie Daugherty","Sandra Potts","Scott Stephenson","Scotty Gonzales","Sean Wiggins","Shana Gallagher","Sharron Montes","Sheryl Lindsey","Socorro Hayden","Solomon Andrade","Stacey Whitehead","Stevie Hale","Stuart Oliver","Stuart Riddle","Tammy Merritt","Theo Wiley","Theresa Murillo","Timothy Roberts","Tony Torres","Tracy Logan","Troy Hoover","Twila Rubio","Velma Everett","Vincent Mccormick","Vincenzo Stafford","Vito Clark","Waldo Spencer","Werner Lowe","Werner Shepard","Wesley Ford","Wm Cantu","Zelma Pierce"]
[null,null,null,null,null,"Leonardo House",{"$f":"IF('Resulting List'!F222=\"\",\"\",'Resulting List'!F222)","v":""},null,{"$f":"TRANSPOSE(_xlfn._xlws.SORT(_xlfn.UNIQUE(_xlfn._xlws.FILTER(Customers[Names],ISNUMBER(SEARCH(Customers[[#This Row],[Search Criteria]],Customers[Names])),\"No data.\"))))","v":"Adriana Todd"},"Albert Ramirez","Alex Rubio","Amanda Beck","Amparo Orozco","Amy Todd","Angelina Roberson","April Fox","Arden Ayala","Arnoldo Pennington","Aubrey Giles","Bette Rivers","Brianna Alexander","Brianna Mora","Britt Vazquez","Broderick Gillespie","Brooke Roman","Calvin Buck","Carmela Mullins","Carol Stevenson","Carolina Russell","Carolyn Roberts","Chelsea Gilbert","Cheryl Williamson","Christa Frederick","Christian Armstrong","Christopher Stuart","Chung Krueger","Clare Whitney","Clarissa Archer","Claudio Lam","Cordell Mills","Craig Shepherd","Damien Kramer","Dane Burke","Danielle Stout","Darrel Liu","Darrin Mcneil","Darron Aguilar","Della Huber","Delores Krause","Dena Rosario","Dominick Johnston","Dona Herring","Dorothy Winters","Douglas Wiley","Doyle David","Earlene Hester","Earline Shepherd","Edwin Sparks","Eli Galvan","Elinor Kaufman","Elroy Porter","Elvin Flynn","Emmitt Porter","Erik Parsons","Ethel Forbes","Felicia Ware","Fidel Haynes","Francisco Valenzuela","Frank Hunt","Gabriela Moore","Gabrielle Patrick","Gale Fitzpatrick","Gayle Curtis","Genevieve Lucero","Gerry Oneal","Grady Ellis","Grover Escobar","Hans Patel","Horacio Black","Humberto Compton","Hunter Short","Ilene Mcguire","Imelda Lloyd","Ira Macdonald","Issac Allen","Jacques Velazquez","Janis Mullins","Janna Cowan","Javier Garner","Jayson Abbott","Jeannie Tapia","Jefferson Lee","Jeramy Keith","Jermaine Bradshaw","Jewel Lee","Jimmie Yang","Jodie Wood","John Cline","Josefina Dickerson","Josie Pineda","Judith Griffin","Julius Soto","Kelli Romero","Kerri Joseph","Kim Mccall","Lakeisha Velazquez","Latonya Logan","Lee Schmidt","Lela Atkins","Leland Robertson","Leonardo House","Leroy Mcintyre","Lesley Blevins","Lilia Berg","Lilly Stone","Lincoln Bond","Lindsay Hurst","Lionel Fuller","Lorene Hunter","Louis Kidd","Lucius Warren","Lucy Mejia","Lupe Ingram","Lynette Fuller","Lynnette Wright","Madge Copeland","Madge Tanner","Mae Sawyer","Malcolm Newman","Mamie Wong","Mandy Swanson","Marcella Everett","Marco Bright","Marcos Schaefer","Marcus Hays","Marina Walsh","Marion Savage","Marylou Bass","Marylou Mccarthy","Mathew Howard","Maurice Jacobson","Mauricio Bautista","Max Smith","Melanie Bridges","Melissa Brandt","Merlin Wu","Michel Simpson","Mickey Kennedy","Mike Sloan","Milton Walsh","Mohamed Allison","Mohammad Christensen","Nadia Macdonald","Naomi Snyder","Ned Lowe","Nettie Leonard","Olive Perkins","Ophelia Morrow","Oren Montes","Orlando Henderson","Owen Buchanan","Paul Norman","Rafael Barrett","Raymond Cochran","Reed Hooper","Reinaldo Houston","Renato Simmons","Rene Calhoun","Reva Hardin","Robert French","Robin Bender","Rodolfo Scott","Roland Blake","Roland Sullivan","Rolf Barnett","Ross Marquez","Ruthie Daugherty","Sandra Potts","Scott Stephenson","Scotty Gonzales","Sean Wiggins","Shana Gallagher","Sharron Montes","Sheryl Lindsey","Socorro Hayden","Solomon Andrade","Stacey Whitehead","Stevie Hale","Stuart Oliver","Stuart Riddle","Tammy Merritt","Theo Wiley","Theresa Murillo","Timothy Roberts","Tony Torres","Tracy Logan","Troy Hoover","Twila Rubio","Velma Everett","Vincent Mccormick","Vincenzo Stafford","Vito Clark","Waldo Spencer","Werner Lowe","Werner Shepard","Wesley Ford","Wm Cantu","Zelma Pierce"]

{"sheet":"Error Checks","index":6,"n_rows":17,"n_cols":9,"rows_kept":17,"cut":false,"hidden":false,"merged":[[0,8,0,9],[2,0,2,4]]}
[{"$f":"IF(ISERROR(RIGHT(CELL(\"filename\",A1),LEN(CELL(\"filename\",A1))-FIND(\"]\",CELL(\"filename\",A1)))),\n\"\",\nRIGHT(CELL(\"filename\",A1),LEN(CELL(\"filename\",A1))-FIND(\"]\",CELL(\"filename\",A1))))","v":"Error Checks"}]
[{"$f":"Model_Name","v":"SP Dynamic Data Validation.xlsm"}]
["Navigator"]
[null,"Error Checks:",null,null,null,{"$f":"Overall_Error_Check","v":0}]
[]
[null,{"$f":"MAX($B$5:$B5)+1","v":1},"Error Checks"]
[]
[null,null,"Summary of Errors"]
[]
[null,null,null,"Assumptions"]
[]
[null,null,null,null,"Example"]
[]
[]
[]
[]
[null,null,null,null,{"$f":"C8","v":"Summary of Errors"},null,null,null,{"$f":"MIN(1,SUM(I11:I15))","v":0}]

{"sheet":"Sheet1","index":7,"n_rows":0,"n_cols":0,"rows_kept":0,"cut":false,"hidden":false,"merged":[]}