{"text_format":"1","workbook":"xlsx","n_sheets":8,"sheets":["Cover","Navigator","Style Guide","Model Parameters","Resulting List","Data","Error Checks","Sheet1"],"not_rendered":{"charts":0,"images":1,"macros":1,"external_links":0,"defined_names":25,"comments":0,"pivot_tables":0},"unopened":[],"bounds":{"document_bytes":16777216,"sheet_cells":100000,"rows_first":2000,"rows_last":500,"rows_between":2000,"halvings":0,"cell_chars":16384,"cell_head_chars":4096},"cells_cut":0,"cells_raw":0,"read":"whole","date_system":"1900"}

{"sheet":"Cover","index":0,"n_rows":22,"n_cols":7,"rows_kept":22,"cut":false,"hidden":false,"merged":[[16,2,16,9],[17,2,17,9],[20,6,20,8],[21,6,21,8]]}
[]
[]
["Navigator"]
[]
[null,null,{"$f":"Client_Name","v":"SumProduct Pty Limited"}]
[null,null,{"$f":"Model_Name","v":"SP Dynamic Data Validation.xlsm"}]
[]
[]
[]
[]
[]
[]
[]
[null,null,"Primary Developer:  Liam Bastick"]
[]
{"$rows_left_out":8}
{"sheet":"Navigator","index":1,"n_rows":14,"n_cols":7,"rows_kept":14,"cut":false,"hidden":false,"merged":[]}
["Navigator"]
[{"$f":"Model_Name","v":"SP Dynamic Data Validation.xlsm"}]
["Navigator"]
[null,null,null,null,"Error Checks:",null,{"$f":"Overall_Error_Check","v":0}]
[]
[]
[null,1,"Table of Contents"]
[]
[null,null,null,null,null,"Cover"]
[null,null,null,null,null,"Style Guide"]
[null,null,null,null,null,"Model Parameters"]
[null,null,null,null,null,"Resulting List"]
[null,null,null,null,null,"Data"]
[null,null,null,null,null,"Error Checks"]

{"sheet":"Style Guide","index":2,"n_rows":74,"n_cols":11,"rows_kept":74,"cut":false,"hidden":false,"merged":[[16,2,16,6],[2,0,2,4],[7,2,7,6],[8,2,8,6],[9,2,9,6],[10,2,10,6],[11,2,11,6],[12,2,12,6],[13,2,13,6],[14,2,14,6],[15,2,15,6],[34,2,34,6],[17,2,17,6],[18,2,18,6],[19,2,19,6],[24,2,24,6],[25,2,25,6],[26,2,26,6],[27,2,27,6],[28,2,28,6],[29,2,29,6],[30,2,30,6],[31,2,31,6],[46,2,46,6],[35,2,35,6],[36,2,36,6],[37,2,37,6],[38,2,38,6],[39,2,39,6],[40,2,40,6],[41,2,41,6],[42,2,42,6],[43,2,43,6],[44,2,44,6],[45,2,45,6],[61,2,61,6],[47,2,47,6],[48,2,48,6],[49,2,49,6],[50,2,50,6],[51,2,51,6],[52,2,52,6],[53,2,53,6],[54,2,54,6],[57,2,57,6],[59,2,59,6],[60,2,60,6],[73,2,73,6],[62,2,62,6],[63,2,63,6],[64,2,64,6],[65,2,65,6],[66,2,66,6],[67,2,67,6],[68,2,68,6],[69,2,69,6],[70,2,70,6],[71,2,71,6],[72,2,72,6],[80,2,80,6],[74,2,74,6],[75,2,75,6],[76,2,76,6],[77,2,77,6],[78,2,78,6],[79,2,79,6]]}
[{"$f":"IF(ISERROR(RIGHT(CELL(\"filename\",A1),LEN(CELL(\"filename\",A1))-FIND(\"]\",CELL(\"filename\",A1)))),\n\"\",\nRIGHT(CELL(\"filename\",A1),LEN(CELL(\"filename\",A1))-FIND(\"]\",CELL(\"filename\",A1))))","v":"Style Guide"}]
[{"$f":"Model_Name","v":"SP Dynamic Data Validation.xlsm"}]
["Navigator"]
[null,null,null,null,"Error Checks:",null,null,null,{"$f":"Overall_Error_Check","v":0}]
[]
[null,{"$f":"MAX($B$5:$B5)+1","v":1},"Formatting of Headers / Dividers"]
[]
[null,null,"Description",null,null,null,null,null,"Display",null,"Style Name"]
[]
[null,null,"Sheet Title",null,null,null,null,null,{"$f":"C10","v":"Sheet Title"},null,"Sheet Title"]
[null,null,"Model Name",null,null,null,null,null,{"$f":"C11","v":"Model Name"},null,"Model Name"]
[]
[null,null,"Header 1",null,null,null,null,null,{"$f":"C13","v":"Header 1"},null,"Header 1"]
[null,null,"Header 2",null,null,null,null,null,{"$f":"C14","v":"Header 2"},null,"Header 2"]
[null,null,"Header 3",null,null,null,null,null,{"$f":"C15","v":"Header 3"},null,"Header 3"]
{"$rows_left_out":60}
{"sheet":"Model Parameters","index":3,"n_rows":31,"n_cols":9,"rows_kept":31,"cut":false,"hidden":false,"merged":[[0,9,0,10],[2,0,2,4],[10,6,10,13],[11,6,11,13]]}
[{"$f":"IF(ISERROR(RIGHT(CELL(\"filename\",A1),LEN(CELL(\"filename\",A1))-FIND(\"]\",CELL(\"filename\",A1)))),\n\"\",\nRIGHT(CELL(\"filename\",A1),LEN(CELL(\"filename\",A1))-FIND(\"]\",CELL(\"filename\",A1))))","v":"Model Parameters"}]
[{"$f":"Model_Name","v":"SP Dynamic Data Validation.xlsm"}]
["Navigator"]
[null,null,null,null,"Error Checks:",null,null,null,{"$f":"Overall_Error_Check","v":0}]
[]
[null,{"$f":"MAX($B$5:$B5)+1","v":1},"General"]
[]
[null,null,"Key Inputs"]
[]
[null,null,null,null,"General"]
[null,null,null,null,"Model Name",null,{"$f":"IF(ISERROR(OR(FIND(\"[\",CELL(\"filename\",A1)),FIND(\"]\",CELL(\"filename\",A1)))),\"\",MID(CELL(\"filename\",A1),FIND(\"[\",CELL(\"filename\",A1))+1,FIND(\"]\",CELL(\"filename\",A1))-FIND(\"[\",CELL(\"filename\",A1))-1))","v":"SP Dynamic Data Validation.xlsm"}]
[null,null,null,null,"Client Name",null,"SumProduct Pty Limited"]
[]
[]
[null,{"$f":"MAX($B$5:$B14)+1","v":2},"General Range Names"]
{"$rows_left_out":17}
{"sheet":"Resulting List","index":4,"n_rows":222,"n_cols":11,"rows_kept":222,"cut":false,"hidden":false,"merged":[[2,0,2,4]]}
[{"$f":"IF(ISERROR(RIGHT(CELL(\"filename\",A1),LEN(CELL(\"filename\",A1))-FIND(\"]\",CELL(\"filename\",A1)))),\n\"\",\nRIGHT(CELL(\"filename\",A1),LEN(CELL(\"filename\",A1))-FIND(\"]\",CELL(\"filename\",A1))))","v":"Resulting List"}]
[{"$f":"Model_Name","v":"SP Dynamic Data Validation.xlsm"}]
["Navigator"]
[null,null,null,null,"Error Checks:",null,null,null,{"$f":"Overall_Error_Check","v":0}]
[]
[null,{"$f":"MAX($B$5:$B5)+1","v":1},"Example"]
[]
[null,null,{"$f":"A1","v":"Resulting List"}]
[]
[null,null,null,"Workings"]
[]
[null,null,null,null,"We don't recommend you put these on an output page in general."]
[]
[null,null,null,null,null,"Cell in row above first list",null,null,{"$f":"Data!I12","v":"Lists"},null,{"$f":"IFERROR(_xlfn.FORMULATEXT(I14),\"\")","v":"=Data!I12"}]
[null,null,null,null,null,"Formula",null,null,{"$f":"IFERROR(_xlfn.FORMULATEXT(I14),\"\")","v":"=Data!I12"},null,{"$f":"IFERROR(_xlfn.FORMULATEXT(I15),\"\")","v":"=IFERROR(FORMULATEXT(I14),\"\")"}]
{"$rows_left_out":208}
{"sheet":"Data","index":5,"n_rows":212,"n_cols":209,"rows_kept":212,"cut":false,"hidden":false,"merged":[[2,0,2,4]]}
[{"$f":"IF(ISERROR(RIGHT(CELL(\"filename\",A1),LEN(CELL(\"filename\",A1))-FIND(\"]\",CELL(\"filename\",A1)))),\n\"\",\nRIGHT(CELL(\"filename\",A1),LEN(CELL(\"filename\",A1))-FIND(\"]\",CELL(\"filename\",A1))))","v":"Data"}]
[{"$f":"Model_Name","v":"SP Dynamic Data Validation.xlsm"}]
["Navigator"]
[null,null,null,null,"Error Checks:",null,null,null,{"$f":"Overall_Error_Check","v":0}]
[]
[null,{"$f":"MAX($B$5:$B5)+1","v":1},"Data for Data Validation List"]
[]
[null,null,"Assumptions"]
[]
[null,null,null,"Fictitious Data"]
[]
[null,null,null,null,null,"Names","Search Criteria",null,"Lists",null,null,null,null,null,null,null,null,null,null,null,null,null,null,null,null,null,null,null,null,null,null,null,null,null,null,null,null,null,null,null,null,null,null,null,null,null,null,null,null,null,null,null,null,null,null,null,null,null,null,null,null,null,null,null,null,null,null,null,null,null,null,null,null,null,null,null,null,null,null,null,null,null,null,null,null,null,null,null,null,null,null,null,null,null,null,null,null,null,null,null,null,null,null,null,null,null,null,null,null,null,null,null,null,null,null,null,null,null,null,null,null,null,null,null,null,null,null,null,null,null,null,null,null,null,null,null,null,null,null,null,null,null,null,null,null,null,null,null,null,null,null,null,null,null,null,null,null,null,null,null,null,null,null,null,null,null,null,null,null,null,null,null,null,null,null,null,null,null,null,null,null,null,null,null,null,null,null,null,null,null,null,null,null,null,null,null,null,null,null,null,null,null,null,null,null,null,null,null," "]
[null,null,null,null,null,"Claudio Lam",{"$f":"IF('Resulting List'!F23=\"\",\"\",'Resulting List'!F23)","v":""},null,{"$f":"TRANSPOSE(_xlfn._xlws.SORT(_xlfn.UNIQUE(_xlfn._xlws.FILTER(Customers[Names],ISNUMBER(SEARCH(Customers[[#This Row],[Search Criteria]],Customers[Names])),\"No data.\"))))","v":"Adriana Todd"},"Albert Ramirez","Alex Rubio","Amanda Beck","Amparo Orozco","Amy Todd","Angelina Roberson","April Fox","Arden Ayala","Arnoldo Pennington","Aubrey Giles","Bette Rivers","Brianna Alexander","Brianna Mora","Britt Vazquez","Broderick Gillespie","Brooke Roman","Calvin Buck","Carmela Mullins","Carol Stevenson","Carolina Russell","Carolyn Roberts","Chelsea Gilbert","Cheryl Williamson","Christa Frederick","Christian Armstrong","Christopher Stuart","Chung Krueger","Clare Whitney","Clarissa Archer","Claudio Lam","Cordell Mills","Craig Shepherd","Damien Kramer","Dane Burke","Danielle Stout","Darrel Liu","Darrin Mcneil","Darron Aguilar","Della Huber","Delores Krause","Dena Rosario","Dominick Johnston","Dona Herring","Dorothy Winters","Douglas Wiley","Doyle David","Earlene Hester","Earline Shepherd","Edwin Sparks","Eli Galvan","Elinor Kaufman","Elroy Porter","Elvin Flynn","Emmitt Porter","Erik Parsons","Ethel Forbes","Felicia Ware","Fidel Haynes","Francisco Valenzuela","Frank Hunt","Gabriela Moore","Gabrielle Patrick","Gale Fitzpatrick","Gayle Curtis","Genevieve Lucero","Gerry Oneal","Grady Ellis","Grover Escobar","Hans Patel","Horacio Black","Humberto Compton","Hunter Short","Ilene Mcguire","Imelda Lloyd","Ira Macdonald","Issac Allen","Jacques Velazquez","Janis Mullins","Janna Cowan","Javier Garner","Jayson Abbott","Jeannie Tapia","Jefferson Lee","Jeramy Keith","Jermaine Bradshaw","Jewel Lee","Jimmie Yang","Jodie Wood","John Cline","Josefina Dickerson","Josie Pineda","Judith Griffin","Julius Soto","Kelli Romero","Kerri Joseph","Kim Mccall","Lakeisha Velazquez","Latonya Logan","Lee Schmidt","Lela Atkins","Leland Robertson","Leonardo House","Leroy Mcintyre","Lesley Blevins","Lilia Berg","Lilly Stone","Lincoln Bond","Lindsay Hurst","Lionel Fuller","Lorene Hunter","Louis Kidd","Lucius Warren","Lucy Mejia","Lupe Ingram","Lynette Fuller","Lynnette Wright","Madge Copeland","Madge Tanner","Mae Sawyer","Malcolm Newman","Mamie Wong","Mandy Swanson","Marcella Everett","Marco Bright","Marcos Schaefer","Marcus Hays","Marina Walsh","Marion Savage","Marylou Bass","Marylou Mccarthy","Mathew Howard","Maurice Jacobson","Mauricio Bautista","Max Smith","Melanie Bridges","Melissa Brandt","Merlin Wu","Michel Simpson","Mickey Kennedy","Mike Sloan","Milton Walsh","Mohamed Allison","Mohammad Christensen","Nadia Macdonald","Naomi Snyder","Ned Lowe","Nettie Leonard","Olive Perkins","Ophelia Morrow","Oren Montes","Orlando Henderson","Owen Buchanan","Paul Norman","Rafael Barrett","Raymond Cochran","Reed Hooper","Reinaldo Houston","Renato Simmons","Rene Calhoun","Reva Hardin","Robert French","Robin Bender","Rodolfo Scott","Roland Blake","Roland Sullivan","Rolf Barnett","Ross Marquez","Ruthie Daugherty","Sandra Potts","Scott Stephenson","Scotty Gonzales","Sean Wiggins","Shana Gallagher","Sharron Montes","Sheryl Lindsey","Socorro Hayden","Solomon Andrade","Stacey Whitehead","Stevie Hale","Stuart Oliver","Stuart Riddle","Tammy Merritt","Theo Wiley","Theresa Murillo","Timothy Roberts","Tony Torres","Tracy Logan","Troy Hoover","Twila Rubio","Velma Everett","Vincent Mccormick","Vincenzo Stafford","Vito Clark","Waldo Spencer","Werner Lowe","Werner Shepard","Wesley Ford","Wm Cantu","Zelma Pierce"]
[null,null,null,null,null,"Josefina Dickerson",{"$f":"IF('Resulting List'!F24=\"\",\"\",'Resulting List'!F24)","v":""},null,{"$f":"TRANSPOSE(_xlfn._xlws.SORT(_xlfn.UNIQUE(_xlfn._xlws.FILTER(Customers[Names],ISNUMBER(SEARCH(Customers[[#This Row],[Search Criteria]],Customers[Names])),\"No data.\"))))","v":"Adriana Todd"},"Albert Ramirez","Alex Rubio","Amanda Beck","Amparo Orozco","Amy Todd","Angelina Roberson","April Fox","Arden Ayala","Arnoldo Pennington","Aubrey Giles","Bette Rivers","Brianna Alexander","Brianna Mora","Britt Vazquez","Broderick Gillespie","Brooke Roman","Calvin Buck","Carmela Mullins","Carol Stevenson","Carolina Russell","Carolyn Roberts","Chelsea Gilbert","Cheryl Williamson","Christa Frederick","Christian Armstrong","Christopher Stuart","Chung Krueger","Clare Whitney","Clarissa Archer","Claudio Lam","Cordell Mills","Craig Shepherd","Damien Kramer","Dane Burke","Danielle Stout","Darrel Liu","Darrin Mcneil","Darron Aguilar","Della Huber","Delores Krause","Dena Rosario","Dominick Johnston","Dona Herring","Dorothy Winters","Douglas Wiley","Doyle David","Earlene Hester","Earline Shepherd","Edwin Sparks","Eli Galvan","Elinor Kaufman","Elroy Porter","Elvin Flynn","Emmitt Porter","Erik Parsons","Ethel Forbes","Felicia Ware","Fidel Haynes","Francisco Valenzuela","Frank Hunt","Gabriela Moore","Gabrielle Patrick","Gale Fitzpatrick","Gayle Curtis","Genevieve Lucero","Gerry Oneal","Grady Ellis","Grover Escobar","Hans Patel","Horacio Black","Humberto Compton","Hunter Short","Ilene Mcguire","Imelda Lloyd","Ira Macdonald","Issac Allen","Jacques Velazquez","Janis Mullins","Janna Cowan","Javier Garner","Jayson Abbott","Jeannie Tapia","Jefferson Lee","Jeramy Keith","Jermaine Bradshaw","Jewel Lee","Jimmie Yang","Jodie Wood","John Cline","Josefina Dickerson","Josie Pineda","Judith Griffin","Julius Soto","Kelli Romero","Kerri Joseph","Kim Mccall","Lakeisha Velazquez","Latonya Logan","Lee Schmidt","Lela Atkins","Leland Robertson","Leonardo House","Leroy Mcintyre","Lesley Blevins","Lilia Berg","Lilly Stone","Lincoln Bond","Lindsay Hurst","Lionel Fuller","Lorene Hunter","Louis Kidd","Lucius Warren","Lucy Mejia","Lupe Ingram","Lynette Fuller","Lynnette Wright","Madge Copeland","Madge Tanner","Mae Sawyer","Malcolm Newman","Mamie Wong","Mandy Swanson","Marcella Everett","Marco Bright","Marcos Schaefer","Marcus Hays","Marina Walsh","Marion Savage","Marylou Bass","Marylou Mccarthy","Mathew Howard","Maurice Jacobson","Mauricio Bautista","Max Smith","Melanie Bridges","Melissa Brandt","Merlin Wu","Michel Simpson","Mickey Kennedy","Mike Sloan","Milton Walsh","Mohamed Allison","Mohammad Christensen","Nadia Macdonald","Naomi Snyder","Ned Lowe","Nettie Leonard","Olive Perkins","Ophelia Morrow","Oren Montes","Orlando Henderson","Owen Buchanan","Paul Norman","Rafael Barrett","Raymond Cochran","Reed Hooper","Reinaldo Houston","Renato Simmons","Rene Calhoun","Reva Hardin","Robert French","Robin Bender","Rodolfo Scott","Roland Blake","Roland Sullivan","Rolf Barnett","Ross Marquez","Ruthie Daugherty","Sandra Potts","Scott Stephenson","Scotty Gonzales","Sean Wiggins","Shana Gallagher","Sharron Montes","Sheryl Lindsey","Socorro Hayden","Solomon Andrade","Stacey Whitehead","Stevie Hale","Stuart Oliver","Stuart Riddle","Tammy Merritt","Theo Wiley","Theresa Murillo","Timothy Roberts","Tony Torres","Tracy Logan","Troy Hoover","Twila Rubio","Velma Everett","Vincent Mccormick","Vincenzo Stafford","Vito Clark","Waldo Spencer","Werner Lowe","Werner Shepard","Wesley Ford","Wm Cantu","Zelma Pierce"]
[null,null,null,null,null,"Britt Vazquez",{"$f":"IF('Resulting List'!F25=\"\",\"\",'Resulting List'!F25)","v":""},null,{"$f":"TRANSPOSE(_xlfn._xlws.SORT(_xlfn.UNIQUE(_xlfn._xlws.FILTER(Customers[Names],ISNUMBER(SEARCH(Customers[[#This Row],[Search Criteria]],Customers[Names])),\"No data.\"))))","v":"Adriana Todd"},"Albert Ramirez","Alex Rubio","Amanda Beck","Amparo Orozco","Amy Todd","Angelina Roberson","April Fox","Arden Ayala","Arnoldo Pennington","Aubrey Giles","Bette Rivers","Brianna Alexander","Brianna Mora","Britt Vazquez","Broderick Gillespie","Brooke Roman","Calvin Buck","Carmela Mullins","Carol Stevenson","Carolina Russell","Carolyn Roberts","Chelsea Gilbert","Cheryl Williamson","Christa Frederick","Christian Armstrong","Christopher Stuart","Chung Krueger","Clare Whitney","Clarissa Archer","Claudio Lam","Cordell Mills","Craig Shepherd","Damien Kramer","Dane Burke","Danielle Stout","Darrel Liu","Darrin Mcneil","Darron Aguilar","Della Huber","Delores Krause","Dena Rosario","Dominick Johnston","Dona Herring","Dorothy Winters","Douglas Wiley","Doyle David","Earlene Hester","Earline Shepherd","Edwin Sparks","Eli Galvan","Elinor Kaufman","Elroy Porter","Elvin Flynn","Emmitt Porter","Erik Parsons","Ethel Forbes","Felicia Ware","Fidel Haynes","Francisco Valenzuela","Frank Hunt","Gabriela Moore","Gabrielle Patrick","Gale Fitzpatrick","Gayle Curtis","Genevieve Lucero","Gerry Oneal","Grady Ellis","Grover Escobar","Hans Patel","Horacio Black","Humberto Compton","Hunter Short","Ilene Mcguire","Imelda Lloyd","Ira Macdonald","Issac Allen","Jacques Velazquez","Janis Mullins","Janna Cowan","Javier Garner","Jayson Abbott","Jeannie Tapia","Jefferson Lee","Jeramy Keith","Jermaine Bradshaw","Jewel Lee","Jimmie Yang","Jodie Wood","John Cline","Josefina Dickerson","Josie Pineda","Judith Griffin","Julius Soto","Kelli Romero","Kerri Joseph","Kim Mccall","Lakeisha Velazquez","Latonya Logan","Lee Schmidt","Lela Atkins","Leland Robertson","Leonardo House","Leroy Mcintyre","Lesley Blevins","Lilia Berg","Lilly Stone","Lincoln Bond","Lindsay Hurst","Lionel Fuller","Lorene Hunter","Louis Kidd","Lucius Warren","Lucy Mejia","Lupe Ingram","Lynette Fuller","Lynnette Wright","Madge Copeland","Madge Tanner","Mae Sawyer","Malcolm Newman","Mamie Wong","Mandy Swanson","Marcella Everett","Marco Bright","Marcos Schaefer","Marcus Hays","Marina Walsh","Marion Savage","Marylou Bass","Marylou Mccarthy","Mathew Howard","Maurice Jacobson","Mauricio Bautista","Max Smith","Melanie Bridges","Melissa Brandt","Merlin Wu","Michel Simpson","Mickey Kennedy","Mike Sloan","Milton Walsh","Mohamed Allison","Mohammad Christensen","Nadia Macdonald","Naomi Snyder","Ned Lowe","Nettie Leonard","Olive Perkins","Ophelia Morrow","Oren Montes","Orlando Henderson","Owen Buchanan","Paul Norman","Rafael Barrett","Raymond Cochran","Reed Hooper","Reinaldo Houston","Renato Simmons","Rene Calhoun","Reva Hardin","Robert French","Robin Bender","Rodolfo Scott","Roland Blake","Roland Sullivan","Rolf Barnett","Ross Marquez","Ruthie Daugherty","Sandra Potts","Scott Stephenson","Scotty Gonzales","Sean Wiggins","Shana Gallagher","Sharron Montes","Sheryl Lindsey","Socorro Hayden","Solomon Andrade","Stacey Whitehead","Stevie Hale","Stuart Oliver","Stuart Riddle","Tammy Merritt","Theo Wiley","Theresa Murillo","Timothy Roberts","Tony Torres","Tracy Logan","Troy Hoover","Twila Rubio","Velma Everett","Vincent Mccormick","Vincenzo Stafford","Vito Clark","Waldo Spencer","Werner Lowe","Werner Shepard","Wesley Ford","Wm Cantu","Zelma Pierce"]
{"$rows_left_out":198}
{"sheet":"Error Checks","index":6,"n_rows":17,"n_cols":9,"rows_kept":17,"cut":false,"hidden":false,"merged":[[0,8,0,9],[2,0,2,4]]}
[{"$f":"IF(ISERROR(RIGHT(CELL(\"filename\",A1),LEN(CELL(\"filename\",A1))-FIND(\"]\",CELL(\"filename\",A1)))),\n\"\",\nRIGHT(CELL(\"filename\",A1),LEN(CELL(\"filename\",A1))-FIND(\"]\",CELL(\"filename\",A1))))","v":"Error Checks"}]
[{"$f":"Model_Name","v":"SP Dynamic Data Validation.xlsm"}]
["Navigator"]
[null,"Error Checks:",null,null,null,{"$f":"Overall_Error_Check","v":0}]
[]
[null,{"$f":"MAX($B$5:$B5)+1","v":1},"Error Checks"]
[]
[null,null,"Summary of Errors"]
[]
[null,null,null,"Assumptions"]
[]
[null,null,null,null,"Example"]
[]
[]
[]
{"$rows_left_out":3}
{"sheet":"Sheet1","index":7,"n_rows":0,"n_cols":0,"rows_kept":0,"cut":false,"hidden":false,"merged":[]}