{"text_format":"1","workbook":"xlsx","n_sheets":10,"sheets":["Cover","Navigator","Style Guide","Model Parameters","Data","PnF-CSE","PnF-DA","Data_BB","PnF_BB","Error Checks"],"not_rendered":{"charts":0,"images":1,"macros":0,"external_links":0,"defined_names":49,"comments":0,"pivot_tables":0},"unopened":[],"bounds":{"document_bytes":16777216,"sheet_cells":100000,"rows_first":2000,"rows_last":500,"rows_between":2000,"halvings":0,"cell_chars":16384,"cell_head_chars":4096},"cells_cut":0,"cells_raw":0,"read":"whole","date_system":"1900"}

{"sheet":"Cover","index":0,"n_rows":22,"n_cols":7,"rows_kept":22,"cut":false,"hidden":false,"merged":[[16,2,16,9],[17,2,17,9],[20,6,20,8],[21,6,21,8]]}
[]
[]
["Navigator"]
[]
[null,null,{"$f":"Client_Name","v":"SumProduct Pty Limited"}]
[null,null,{"$f":"Model_Name","v":"SP Point and Figure Chart - Complete.xlsm"}]
[]
[]
[]
[]
[]
[]
[]
[null,null,"Primary Developer:  Sam Ngo"]
[]
[null,null,"General Cover Notes:"]
[null,null,"Point and Figure Charts CSE array (CSE), Dynamic array (DA) "]
[null,null,"and Dynamic Array with Bollinger Bands (BB) version."]
[]
[]
[null,null,"Any queries, please e-mail:",null,null,null,"sam.ngo@sumproduct.com"]
[null,null,"Website:",null,null,null,"www.sumproduct.com"]

{"sheet":"Navigator","index":1,"n_rows":17,"n_cols":7,"rows_kept":17,"cut":false,"hidden":false,"merged":[]}
["Navigator"]
[{"$f":"Model_Name","v":"SP Point and Figure Chart - Complete.xlsm"}]
["Navigator"]
[null,null,null,null,"Error Checks:",null,{"$f":"Overall_Error_Check","v":0}]
[]
[]
[null,1,"Table of Contents"]
[]
[null,null,null,null,null,"Cover"]
[null,null,null,null,null,"Style Guide"]
[null,null,null,null,null,"Model Parameters"]
[null,null,null,null,null,"Data"]
[null,null,null,null,null,"PnF-CSE"]
[null,null,null,null,null,"PnF-DA"]
[null,null,null,null,null,"Data_BB"]
[null,null,null,null,null,"PnF_BB"]
[null,null,null,null,null,"Error Checks"]

{"sheet":"Style Guide","index":2,"n_rows":74,"n_cols":11,"rows_kept":74,"cut":false,"hidden":false,"merged":[[16,2,16,6],[2,0,2,4],[7,2,7,6],[8,2,8,6],[9,2,9,6],[10,2,10,6],[11,2,11,6],[12,2,12,6],[13,2,13,6],[14,2,14,6],[15,2,15,6],[34,2,34,6],[17,2,17,6],[18,2,18,6],[19,2,19,6],[24,2,24,6],[25,2,25,6],[26,2,26,6],[27,2,27,6],[28,2,28,6],[29,2,29,6],[30,2,30,6],[31,2,31,6],[46,2,46,6],[35,2,35,6],[36,2,36,6],[37,2,37,6],[38,2,38,6],[39,2,39,6],[40,2,40,6],[41,2,41,6],[42,2,42,6],[43,2,43,6],[44,2,44,6],[45,2,45,6],[61,2,61,6],[47,2,47,6],[48,2,48,6],[49,2,49,6],[50,2,50,6],[51,2,51,6],[52,2,52,6],[53,2,53,6],[54,2,54,6],[57,2,57,6],[59,2,59,6],[60,2,60,6],[73,2,73,6],[62,2,62,6],[63,2,63,6],[64,2,64,6],[65,2,65,6],[66,2,66,6],[67,2,67,6],[68,2,68,6],[69,2,69,6],[70,2,70,6],[71,2,71,6],[72,2,72,6],[80,2,80,6],[74,2,74,6],[75,2,75,6],[76,2,76,6],[77,2,77,6],[78,2,78,6],[79,2,79,6]]}
[{"$f":"IF(ISERROR(RIGHT(CELL(\"filename\",A1),LEN(CELL(\"filename\",A1))-FIND(\"]\",CELL(\"filename\",A1)))),\n\"\",\nRIGHT(CELL(\"filename\",A1),LEN(CELL(\"filename\",A1))-FIND(\"]\",CELL(\"filename\",A1))))","v":"Style Guide"}]
[{"$f":"Model_Name","v":"SP Point and Figure Chart - Complete.xlsm"}]
["Navigator"]
[null,null,null,null,"Error Checks:",null,null,null,{"$f":"Overall_Error_Check","v":0}]
[]
[null,{"$f":"MAX($B$5:$B5)+1","v":1},"Formatting of Headers / Dividers"]
[]
[null,null,"Description",null,null,null,null,null,"Display",null,"Style Name"]
[]
[null,null,"Sheet Title",null,null,null,null,null,{"$f":"C10","v":"Sheet Title"},null,"Sheet Title"]
[null,null,"Model Name",null,null,null,null,null,{"$f":"C11","v":"Model Name"},null,"Model Name"]
[]
[null,null,"Header 1",null,null,null,null,null,{"$f":"C13","v":"Header 1"},null,"Header 1"]
[null,null,"Header 2",null,null,null,null,null,{"$f":"C14","v":"Header 2"},null,"Header 2"]
[null,null,"Header 3",null,null,null,null,null,{"$f":"C15","v":"Header 3"},null,"Header 3"]
[null,null,"Header 4",null,null,null,null,null,{"$f":"C16","v":"Header 4"},null,"Header 4"]
[]
[null,null,"Notes",null,null,null,null,null,{"$f":"C18","v":"Notes"},null,"Notes"]
[]
[null,null,"Table Heading",null,null,null,null,null,{"$f":"C20","v":"Table Heading"},null,"Table Heading"]
[]
[]
[null,{"$f":"MAX($B$5:$B22)+1","v":2},"Individual Cell Styles"]
[]
[null,null,"Description",null,null,null,null,null,"Display",null,"Style Name"]
[]
[null,null,"Assumption",null,null,null,null,null,"Assumption",null,{"$f":"C27","v":"Assumption"}]
[]
[null,null,"Constraint",null,null,null,null,null,{"$f":"C29","v":"Constraint"},null,{"$f":"C29","v":"Constraint"}]
[]
[null,null,"Empty",null,null,null,null,null,null,null,{"$f":"C31","v":"Empty"}]
[]
[null,null,"Error Check",null,null,null,null,null,0,null,{"$f":"C33","v":"Error Check"}]
[]
[null,null,"Hyperlink",null,null,null,null,null,"Hyperlink",null,{"$f":"C35","v":"Hyperlink"}]
[]
[null,null,"Internal Reference",null,null,null,null,null,{"$f":"'Error Checks'!E12","v":"Example"},null,{"$f":"C37","v":"Internal Reference"}]
[]
[null,null,"Line Calculation",null,null,null,null,null,77,null,"Line Calc"]
[]
[null,null,"Line Total",null,null,null,null,null,{"$f":"I39","v":77},null,{"$f":"C41","v":"Line Total"}]
[]
[null,null,"Parameter",null,null,null,null,null,365,null,{"$f":"C43","v":"Parameter"}]
[]
[null,null,"Range Name Description",null,null,null,null,null,"Not_Named",null,{"$f":"C45","v":"Range Name Description"}]
[]
[null,null,"Row Reference",null,null,null,null,null,{"$f":"ROW(C47)","v":47},null,"Row Ref"]
[]
[null,null,"Row Summary",null,null,null,null,null,{"$f":"I41","v":77},null,{"$f":"C49","v":"Row Summary"}]
[]
[null,null,"Units",null,null,null,null,null,"A$",null,{"$f":"C51","v":"Units"}]
[]
[null,null,"WIP",null,null,null,null,null,null,null,{"$f":"C53","v":"WIP"}]
[]
[]
[null,{"$f":"MAX($B$5:$B55)+1","v":3},"Numerical Styles"]
[]
[null,null,"Description",null,null,null,null,null,"Display",null,"Style Name"]
[]
[null,null,"Comma",null,null,null,null,null,123456.789,null,{"$f":"C60","v":"Comma"}]
[]
[null,null,"Comma [0]",null,null,null,null,null,-123456.789,null,"Comma [0]"]
[]
[null,null,"Currency",null,null,null,null,null,123456.789,null,"Currency"]
[]
[null,null,"Currency [0]",null,null,null,null,null,123456.789,null,"Currency [0]"]
[]
[null,null,"Date",null,null,null,null,null,{"$f":"TODAY()","v":"2023-07-13"},null,{"$f":"C68","v":"Date"}]
[]
[null,null,"Date Heading",null,null,null,null,null,{"$f":"TODAY()","v":"2023-07-13"},null,{"$f":"C70","v":"Date Heading"}]
[]
[null,null,"Numbers 0",null,null,null,null,null,-123456.789,null,{"$f":"C72","v":"Numbers 0"}]
[]
[null,null,"Percent",null,null,null,null,null,0.5,null,{"$f":"C74","v":"Percent"}]

{"sheet":"Model Parameters","index":3,"n_rows":31,"n_cols":9,"rows_kept":31,"cut":false,"hidden":false,"merged":[[0,9,0,10],[2,0,2,4],[10,6,10,13],[11,6,11,13]]}
[{"$f":"IF(ISERROR(RIGHT(CELL(\"filename\",A1),LEN(CELL(\"filename\",A1))-FIND(\"]\",CELL(\"filename\",A1)))),\n\"\",\nRIGHT(CELL(\"filename\",A1),LEN(CELL(\"filename\",A1))-FIND(\"]\",CELL(\"filename\",A1))))","v":"Model Parameters"}]
[{"$f":"Model_Name","v":"SP Point and Figure Chart - Complete.xlsm"}]
["Navigator"]
[null,null,null,null,"Error Checks:",null,null,null,{"$f":"Overall_Error_Check","v":0}]
[]
[null,{"$f":"MAX($B$5:$B5)+1","v":1},"General"]
[]
[null,null,"Key Inputs"]
[]
[null,null,null,null,"General"]
[null,null,null,null,"Model Name",null,{"$f":"IF(ISERROR(OR(FIND(\"[\",CELL(\"filename\",A1)),FIND(\"]\",CELL(\"filename\",A1)))),\"\",MID(CELL(\"filename\",A1),FIND(\"[\",CELL(\"filename\",A1))+1,FIND(\"]\",CELL(\"filename\",A1))-FIND(\"[\",CELL(\"filename\",A1))-1))","v":"SP Point and Figure Chart - Complete.xlsm"}]
[null,null,null,null,"Client Name",null,"SumProduct Pty Limited"]
[]
[]
[null,{"$f":"MAX($B$5:$B14)+1","v":2},"General Range Names"]
[]
[null,null,"Technical Assumptions"]
[]
[null,null,null,null,"Days in Year",null,365]
[null,null,null,null,"Months in Month",null,1]
[null,null,null,null,"Months in Quarter",null,3]
[null,null,null,null,"Months in Half Yr",null,6]
[null,null,null,null,"Months in Year",null,12]
[null,null,null,null,"Quarters in Year",null,4]
[]
[null,null,null,null,"Rounding Accuracy",null,5]
[]
[null,null,null,null,"Very Large Number",null,9.9999999999999997E+98]
[null,null,null,null,"Very Small Number",null,1E-8]
[]
[null,null,null,null,"Thousand",null,1000]

{"sheet":"Data","index":4,"n_rows":294,"n_cols":15,"rows_kept":294,"cut":false,"hidden":false,"merged":[[2,0,2,4]]}
[{"$f":"IF(ISERROR(RIGHT(CELL(\"filename\",A1),LEN(CELL(\"filename\",A1))-FIND(\"]\",CELL(\"filename\",A1)))),\n\"\",\nRIGHT(CELL(\"filename\",A1),LEN(CELL(\"filename\",A1))-FIND(\"]\",CELL(\"filename\",A1))))","v":"Data"}]
[{"$f":"Model_Name","v":"SP Point and Figure Chart - Complete.xlsm"}]
["Navigator"]
[null,"Error Checks:",null,null,null,{"$f":"Overall_Error_Check","v":0}]
[]
[null,{"$f":"MAX($B$5:$B5)+1","v":1},{"$f":"A1","v":"Data"}]
[]
[null,null,"Summary Data"]
[]
[null,null,null,"Min",{"$f":"MIN(Data[Adj Close])","v":213.64790300000001}]
[null,null,null,"Max",{"$f":"MAX(Data[Adj Close])","v":331}]
[null,null,null,"Range",{"$f":"Max-Min","v":117.35209699999999}]
[]
[null,null,null,"Bin Width",30]
[null,null,null,"Width",{"$f":"Range/Number_of_Bins","v":3.9117365666666664}]
[]
[null,null,null,"Up Symbol","X"]
[null,null,null,"Down Symbol","O"]
[null,null,null,"Starting Symbol",{"$f":"IF(F26<>\"\",Up_Symbol,Down_Symbol)","v":"O"}]
[]
[]
[null,null,"Data Table",null,null,null,null,null,null,null,"Transform Data"]
[]
[null,null,null,"The Ajusted Close Price is took from MSFT stock on Yahoo Finance"]
[null,null,null,"Date","Adj Close","Up","Switch Location","Index","Lag Index",null,null,"Unique Index","Date","Max","Min"]
[null,null,null,"2022-01-03",331,{"$f":"IF(Data[[#This Row],[Adj Close]]<E27,TRUE,\"\")","v":""},{"$f":"IF(F25=Data[[#This Row],[Up]],0,1)","v":1},{"$f":"SUM($G$26:G26)","v":1},{"$f":"N(H25)","v":0},null,null,{"$f":"N(L25)+1","v":1},{"$f":"INDEX(Data[Date],MATCH(Transform_Data[[#This Row],[Unique Index]],Data[Index],0))","v":"2022-01-03"},{"$f":"MAX( IF(Transform_Data[[#This Row],[Unique Index]]=Data[Index],Data[Adj Close]),\n               IF(Transform_Data[[#This Row],[Unique Index]]=Data[Lag Index],Data[Adj Close]))","v":331},{"$f":"MIN(IF(Transform_Data[[#This Row],[Unique Index]]=Data[Index],Data[Adj Close]),\n             IF(Transform_Data[[#This Row],[Unique Index]]=Data[Lag Index],Data[Adj Close]))","v":310.96621699999997}]
[null,null,null,"2022-01-04",325.95575000000002,{"$f":"IF(Data[[#This Row],[Adj Close]]<E28,TRUE,\"\")","v":""},{"$f":"IF(F26=Data[[#This Row],[Up]],0,1)","v":0},{"$f":"SUM($G$26:G27)","v":1},{"$f":"N(H26)","v":1},null,null,2,{"$f":"INDEX(Data[Date],MATCH(Transform_Data[[#This Row],[Unique Index]],Data[Index],0))","v":"2022-01-06"},{"$f":"MAX( IF(Transform_Data[[#This Row],[Unique Index]]=Data[Index],Data[Adj Close]),\n               IF(Transform_Data[[#This Row],[Unique Index]]=Data[Lag Index],Data[Adj Close]))","v":315.31542999999999},{"$f":"MIN(IF(Transform_Data[[#This Row],[Unique Index]]=Data[Index],Data[Adj Close]),\n             IF(Transform_Data[[#This Row],[Unique Index]]=Data[Lag Index],Data[Adj Close]))","v":310.96621699999997}]
[null,null,null,"2022-01-05",313.442993,{"$f":"IF(Data[[#This Row],[Adj Close]]<E29,TRUE,\"\")","v":""},{"$f":"IF(F27=Data[[#This Row],[Up]],0,1)","v":0},{"$f":"SUM($G$26:G28)","v":1},1,null,null,3,{"$f":"INDEX(Data[Date],MATCH(Transform_Data[[#This Row],[Unique Index]],Data[Index],0))","v":"2022-01-12"},{"$f":"MAX( IF(Transform_Data[[#This Row],[Unique Index]]=Data[Index],Data[Adj Close]),\n               IF(Transform_Data[[#This Row],[Unique Index]]=Data[Lag Index],Data[Adj Close]))","v":315.31542999999999},{"$f":"MIN(IF(Transform_Data[[#This Row],[Unique Index]]=Data[Index],Data[Adj Close]),\n             IF(Transform_Data[[#This Row],[Unique Index]]=Data[Lag Index],Data[Adj Close]))","v":301.97048999999998}]
[null,null,null,"2022-01-06",310.96621699999997,{"$f":"IF(Data[[#This Row],[Adj Close]]<E30,TRUE,\"\")","v":true},{"$f":"IF(F28=Data[[#This Row],[Up]],0,1)","v":1},{"$f":"SUM($G$26:G29)","v":2},1,null,null,4,{"$f":"INDEX(Data[Date],MATCH(Transform_Data[[#This Row],[Unique Index]],Data[Index],0))","v":"2022-01-13"},{"$f":"MAX( IF(Transform_Data[[#This Row],[Unique Index]]=Data[Index],Data[Adj Close]),\n               IF(Transform_Data[[#This Row],[Unique Index]]=Data[Lag Index],Data[Adj Close]))","v":307.320404},{"$f":"MIN(IF(Transform_Data[[#This Row],[Unique Index]]=Data[Index],Data[Adj Close]),\n             IF(Transform_Data[[#This Row],[Unique Index]]=Data[Lag Index],Data[Adj Close]))","v":301.97048999999998}]
[null,null,null,"2022-01-07",311.12472500000001,{"$f":"IF(Data[[#This Row],[Adj Close]]<E31,TRUE,\"\")","v":true},{"$f":"IF(F29=Data[[#This Row],[Up]],0,1)","v":0},{"$f":"SUM($G$26:G30)","v":2},2,null,null,5,{"$f":"INDEX(Data[Date],MATCH(Transform_Data[[#This Row],[Unique Index]],Data[Index],0))","v":"2022-01-14"},{"$f":"MAX( IF(Transform_Data[[#This Row],[Unique Index]]=Data[Index],Data[Adj Close]),\n               IF(Transform_Data[[#This Row],[Unique Index]]=Data[Lag Index],Data[Adj Close]))","v":307.320404},{"$f":"MIN(IF(Transform_Data[[#This Row],[Unique Index]]=Data[Index],Data[Adj Close]),\n             IF(Transform_Data[[#This Row],[Unique Index]]=Data[Lag Index],Data[Adj Close]))","v":299.84045400000002}]
[null,null,null,"2022-01-10",311.35257000000001,{"$f":"IF(Data[[#This Row],[Adj Close]]<E32,TRUE,\"\")","v":true},{"$f":"IF(F30=Data[[#This Row],[Up]],0,1)","v":0},{"$f":"SUM($G$26:G31)","v":2},2,null,null,6,{"$f":"INDEX(Data[Date],MATCH(Transform_Data[[#This Row],[Unique Index]],Data[Index],0))","v":"2022-01-18"},{"$f":"MAX( IF(Transform_Data[[#This Row],[Unique Index]]=Data[Index],Data[Adj Close]),\n               IF(Transform_Data[[#This Row],[Unique Index]]=Data[Lag Index],Data[Adj Close]))","v":300.51409899999999},{"$f":"MIN(IF(Transform_Data[[#This Row],[Unique Index]]=Data[Index],Data[Adj Close]),\n             IF(Transform_Data[[#This Row],[Unique Index]]=Data[Lag Index],Data[Adj Close]))","v":299.84045400000002}]
[null,null,null,"2022-01-11",312.05599999999998,{"$f":"IF(Data[[#This Row],[Adj Close]]<E33,TRUE,\"\")","v":true},{"$f":"IF(F31=Data[[#This Row],[Up]],0,1)","v":0},{"$f":"SUM($G$26:G32)","v":2},2,null,null,7,{"$f":"INDEX(Data[Date],MATCH(Transform_Data[[#This Row],[Unique Index]],Data[Index],0))","v":"2022-01-19"},{"$f":"MAX( IF(Transform_Data[[#This Row],[Unique Index]]=Data[Index],Data[Adj Close]),\n               IF(Transform_Data[[#This Row],[Unique Index]]=Data[Lag Index],Data[Adj Close]))","v":300.51409899999999},{"$f":"MIN(IF(Transform_Data[[#This Row],[Unique Index]]=Data[Index],Data[Adj Close]),\n             IF(Transform_Data[[#This Row],[Unique Index]]=Data[Lag Index],Data[Adj Close]))","v":293.28189099999997}]
[null,null,null,"2022-01-12",315.31542999999999,{"$f":"IF(Data[[#This Row],[Adj Close]]<E34,TRUE,\"\")","v":""},{"$f":"IF(F32=Data[[#This Row],[Up]],0,1)","v":1},{"$f":"SUM($G$26:G33)","v":3},2,null,null,8,{"$f":"INDEX(Data[Date],MATCH(Transform_Data[[#This Row],[Unique Index]],Data[Index],0))","v":"2022-01-21"},{"$f":"MAX( IF(Transform_Data[[#This Row],[Unique Index]]=Data[Index],Data[Adj Close]),\n               IF(Transform_Data[[#This Row],[Unique Index]]=Data[Lag Index],Data[Adj Close]))","v":293.61874399999999},{"$f":"MIN(IF(Transform_Data[[#This Row],[Unique Index]]=Data[Index],Data[Adj Close]),\n             IF(Transform_Data[[#This Row],[Unique Index]]=Data[Lag Index],Data[Adj Close]))","v":293.28189099999997}]
[null,null,null,"2022-01-13",301.97048999999998,{"$f":"IF(Data[[#This Row],[Adj Close]]<E35,TRUE,\"\")","v":true},{"$f":"IF(F33=Data[[#This Row],[Up]],0,1)","v":1},{"$f":"SUM($G$26:G34)","v":4},3,null,null,9,{"$f":"INDEX(Data[Date],MATCH(Transform_Data[[#This Row],[Unique Index]],Data[Index],0))","v":"2022-01-24"},{"$f":"MAX( IF(Transform_Data[[#This Row],[Unique Index]]=Data[Index],Data[Adj Close]),\n               IF(Transform_Data[[#This Row],[Unique Index]]=Data[Lag Index],Data[Adj Close]))","v":293.61874399999999},{"$f":"MIN(IF(Transform_Data[[#This Row],[Unique Index]]=Data[Index],Data[Adj Close]),\n             IF(Transform_Data[[#This Row],[Unique Index]]=Data[Lag Index],Data[Adj Close]))","v":285.81191999999999}]
[null,null,null,"2022-01-14",307.320404,{"$f":"IF(Data[[#This Row],[Adj Close]]<E36,TRUE,\"\")","v":""},{"$f":"IF(F34=Data[[#This Row],[Up]],0,1)","v":1},{"$f":"SUM($G$26:G35)","v":5},4,null,null,10,{"$f":"INDEX(Data[Date],MATCH(Transform_Data[[#This Row],[Unique Index]],Data[Index],0))","v":"2022-01-25"},{"$f":"MAX( IF(Transform_Data[[#This Row],[Unique Index]]=Data[Index],Data[Adj Close]),\n               IF(Transform_Data[[#This Row],[Unique Index]]=Data[Lag Index],Data[Adj Close]))","v":308.09310900000003},{"$f":"MIN(IF(Transform_Data[[#This Row],[Unique Index]]=Data[Index],Data[Adj Close]),\n             IF(Transform_Data[[#This Row],[Unique Index]]=Data[Lag Index],Data[Adj Close]))","v":285.81191999999999}]
[null,null,null,"2022-01-18",299.84045400000002,{"$f":"IF(Data[[#This Row],[Adj Close]]<E37,TRUE,\"\")","v":true},{"$f":"IF(F35=Data[[#This Row],[Up]],0,1)","v":1},{"$f":"SUM($G$26:G36)","v":6},5,null,null,11,{"$f":"INDEX(Data[Date],MATCH(Transform_Data[[#This Row],[Unique Index]],Data[Index],0))","v":"2022-01-31"},{"$f":"MAX( IF(Transform_Data[[#This Row],[Unique Index]]=Data[Index],Data[Adj Close]),\n               IF(Transform_Data[[#This Row],[Unique Index]]=Data[Lag Index],Data[Adj Close]))","v":308.09310900000003},{"$f":"MIN(IF(Transform_Data[[#This Row],[Unique Index]]=Data[Index],Data[Adj Close]),\n             IF(Transform_Data[[#This Row],[Unique Index]]=Data[Lag Index],Data[Adj Close]))","v":305.89373799999998}]
[null,null,null,"2022-01-19",300.51409899999999,{"$f":"IF(Data[[#This Row],[Adj Close]]<E38,TRUE,\"\")","v":""},{"$f":"IF(F36=Data[[#This Row],[Up]],0,1)","v":1},{"$f":"SUM($G$26:G37)","v":7},6,null,null,12,{"$f":"INDEX(Data[Date],MATCH(Transform_Data[[#This Row],[Unique Index]],Data[Index],0))","v":"2022-02-01"},{"$f":"MAX( IF(Transform_Data[[#This Row],[Unique Index]]=Data[Index],Data[Adj Close]),\n               IF(Transform_Data[[#This Row],[Unique Index]]=Data[Lag Index],Data[Adj Close]))","v":310.55007899999998},{"$f":"MIN(IF(Transform_Data[[#This Row],[Unique Index]]=Data[Index],Data[Adj Close]),\n             IF(Transform_Data[[#This Row],[Unique Index]]=Data[Lag Index],Data[Adj Close]))","v":305.89373799999998}]
[null,null,null,"2022-01-20",298.80017099999998,{"$f":"IF(Data[[#This Row],[Adj Close]]<E39,TRUE,\"\")","v":""},{"$f":"IF(F37=Data[[#This Row],[Up]],0,1)","v":0},{"$f":"SUM($G$26:G38)","v":7},7,null,null,13,{"$f":"INDEX(Data[Date],MATCH(Transform_Data[[#This Row],[Unique Index]],Data[Index],0))","v":"2022-02-02"},{"$f":"MAX( IF(Transform_Data[[#This Row],[Unique Index]]=Data[Index],Data[Adj Close]),\n               IF(Transform_Data[[#This Row],[Unique Index]]=Data[Lag Index],Data[Adj Close]))","v":310.55007899999998},{"$f":"MIN(IF(Transform_Data[[#This Row],[Unique Index]]=Data[Index],Data[Adj Close]),\n             IF(Transform_Data[[#This Row],[Unique Index]]=Data[Lag Index],Data[Adj Close]))","v":298.45343000000003}]
[null,null,null,"2022-01-21",293.28189099999997,{"$f":"IF(Data[[#This Row],[Adj Close]]<E40,TRUE,\"\")","v":true},{"$f":"IF(F38=Data[[#This Row],[Up]],0,1)","v":1},{"$f":"SUM($G$26:G39)","v":8},7,null,null,14,{"$f":"INDEX(Data[Date],MATCH(Transform_Data[[#This Row],[Unique Index]],Data[Index],0))","v":"2022-02-03"},{"$f":"MAX( IF(Transform_Data[[#This Row],[Unique Index]]=Data[Index],Data[Adj Close]),\n               IF(Transform_Data[[#This Row],[Unique Index]]=Data[Lag Index],Data[Adj Close]))","v":303.09988399999997},{"$f":"MIN(IF(Transform_Data[[#This Row],[Unique Index]]=Data[Index],Data[Adj Close]),\n             IF(Transform_Data[[#This Row],[Unique Index]]=Data[Lag Index],Data[Adj Close]))","v":298.45343000000003}]
[null,null,null,"2022-01-24",293.61874399999999,{"$f":"IF(Data[[#This Row],[Adj Close]]<E41,TRUE,\"\")","v":""},{"$f":"IF(F39=Data[[#This Row],[Up]],0,1)","v":1},{"$f":"SUM($G$26:G40)","v":9},8,null,null,15,{"$f":"INDEX(Data[Date],MATCH(Transform_Data[[#This Row],[Unique Index]],Data[Index],0))","v":"2022-02-04"},{"$f":"MAX( IF(Transform_Data[[#This Row],[Unique Index]]=Data[Index],Data[Adj Close]),\n               IF(Transform_Data[[#This Row],[Unique Index]]=Data[Lag Index],Data[Adj Close]))","v":303.09988399999997},{"$f":"MIN(IF(Transform_Data[[#This Row],[Unique Index]]=Data[Index],Data[Adj Close]),\n             IF(Transform_Data[[#This Row],[Unique Index]]=Data[Lag Index],Data[Adj Close]))","v":298.15621900000002}]
[null,null,null,"2022-01-25",285.81191999999999,{"$f":"IF(Data[[#This Row],[Adj Close]]<E42,TRUE,\"\")","v":true},{"$f":"IF(F40=Data[[#This Row],[Up]],0,1)","v":1},{"$f":"SUM($G$26:G41)","v":10},9,null,null,16,{"$f":"INDEX(Data[Date],MATCH(Transform_Data[[#This Row],[Unique Index]],Data[Index],0))","v":"2022-02-07"},{"$f":"MAX( IF(Transform_Data[[#This Row],[Unique Index]]=Data[Index],Data[Adj Close]),\n               IF(Transform_Data[[#This Row],[Unique Index]]=Data[Lag Index],Data[Adj Close]))","v":308.32095299999997},{"$f":"MIN(IF(Transform_Data[[#This Row],[Unique Index]]=Data[Index],Data[Adj Close]),\n             IF(Transform_Data[[#This Row],[Unique Index]]=Data[Lag Index],Data[Adj Close]))","v":298.15621900000002}]
[null,null,null,"2022-01-26",293.95559700000001,{"$f":"IF(Data[[#This Row],[Adj Close]]<E43,TRUE,\"\")","v":true},{"$f":"IF(F41=Data[[#This Row],[Up]],0,1)","v":0},{"$f":"SUM($G$26:G42)","v":10},10,null,null,17,{"$f":"INDEX(Data[Date],MATCH(Transform_Data[[#This Row],[Unique Index]],Data[Index],0))","v":"2022-02-09"},{"$f":"MAX( IF(Transform_Data[[#This Row],[Unique Index]]=Data[Index],Data[Adj Close]),\n               IF(Transform_Data[[#This Row],[Unique Index]]=Data[Lag Index],Data[Adj Close]))","v":308.32095299999997},{"$f":"MIN(IF(Transform_Data[[#This Row],[Unique Index]]=Data[Index],Data[Adj Close]),\n             IF(Transform_Data[[#This Row],[Unique Index]]=Data[Lag Index],Data[Adj Close]))","v":292.26147500000002}]
[null,null,null,"2022-01-27",297.05654900000002,{"$f":"IF(Data[[#This Row],[Adj Close]]<E44,TRUE,\"\")","v":true},{"$f":"IF(F42=Data[[#This Row],[Up]],0,1)","v":0},{"$f":"SUM($G$26:G43)","v":10},10,null,null,18,{"$f":"INDEX(Data[Date],MATCH(Transform_Data[[#This Row],[Unique Index]],Data[Index],0))","v":"2022-02-14"},{"$f":"MAX( IF(Transform_Data[[#This Row],[Unique Index]]=Data[Index],Data[Adj Close]),\n               IF(Transform_Data[[#This Row],[Unique Index]]=Data[Lag Index],Data[Adj Close]))","v":297.68069500000001},{"$f":"MIN(IF(Transform_Data[[#This Row],[Unique Index]]=Data[Index],Data[Adj Close]),\n             IF(Transform_Data[[#This Row],[Unique Index]]=Data[Lag Index],Data[Adj Close]))","v":292.26147500000002}]
[null,null,null,"2022-01-28",305.39837599999998,{"$f":"IF(Data[[#This Row],[Adj Close]]<E45,TRUE,\"\")","v":true},{"$f":"IF(F43=Data[[#This Row],[Up]],0,1)","v":0},{"$f":"SUM($G$26:G44)","v":10},10,null,null,19,{"$f":"INDEX(Data[Date],MATCH(Transform_Data[[#This Row],[Unique Index]],Data[Index],0))","v":"2022-02-15"},{"$f":"MAX( IF(Transform_Data[[#This Row],[Unique Index]]=Data[Index],Data[Adj Close]),\n               IF(Transform_Data[[#This Row],[Unique Index]]=Data[Lag Index],Data[Adj Close]))","v":297.68069500000001},{"$f":"MIN(IF(Transform_Data[[#This Row],[Unique Index]]=Data[Index],Data[Adj Close]),\n             IF(Transform_Data[[#This Row],[Unique Index]]=Data[Lag Index],Data[Adj Close]))","v":278.24230999999997}]
[null,null,null,"2022-01-31",308.09310900000003,{"$f":"IF(Data[[#This Row],[Adj Close]]<E46,TRUE,\"\")","v":""},{"$f":"IF(F44=Data[[#This Row],[Up]],0,1)","v":1},{"$f":"SUM($G$26:G45)","v":11},10,null,null,20,{"$f":"INDEX(Data[Date],MATCH(Transform_Data[[#This Row],[Unique Index]],Data[Index],0))","v":"2022-02-23"},{"$f":"MAX( IF(Transform_Data[[#This Row],[Unique Index]]=Data[Index],Data[Adj Close]),\n               IF(Transform_Data[[#This Row],[Unique Index]]=Data[Lag Index],Data[Adj Close]))","v":296.62835699999999},{"$f":"MIN(IF(Transform_Data[[#This Row],[Unique Index]]=Data[Index],Data[Adj Close]),\n             IF(Transform_Data[[#This Row],[Unique Index]]=Data[Lag Index],Data[Adj Close]))","v":278.24230999999997}]
[null,null,null,"2022-02-01",305.89373799999998,{"$f":"IF(Data[[#This Row],[Adj Close]]<E47,TRUE,\"\")","v":true},{"$f":"IF(F45=Data[[#This Row],[Up]],0,1)","v":1},{"$f":"SUM($G$26:G46)","v":12},11,null,null,21,{"$f":"INDEX(Data[Date],MATCH(Transform_Data[[#This Row],[Unique Index]],Data[Index],0))","v":"2022-02-28"},{"$f":"MAX( IF(Transform_Data[[#This Row],[Unique Index]]=Data[Index],Data[Adj Close]),\n               IF(Transform_Data[[#This Row],[Unique Index]]=Data[Lag Index],Data[Adj Close]))","v":296.62835699999999},{"$f":"MIN(IF(Transform_Data[[#This Row],[Unique Index]]=Data[Index],Data[Adj Close]),\n             IF(Transform_Data[[#This Row],[Unique Index]]=Data[Lag Index],Data[Adj Close]))","v":292.81616200000002}]
[null,null,null,"2022-02-02",310.55007899999998,{"$f":"IF(Data[[#This Row],[Adj Close]]<E48,TRUE,\"\")","v":""},{"$f":"IF(F46=Data[[#This Row],[Up]],0,1)","v":1},{"$f":"SUM($G$26:G47)","v":13},12,null,null,22,{"$f":"INDEX(Data[Date],MATCH(Transform_Data[[#This Row],[Unique Index]],Data[Index],0))","v":"2022-03-01"},{"$f":"MAX( IF(Transform_Data[[#This Row],[Unique Index]]=Data[Index],Data[Adj Close]),\n               IF(Transform_Data[[#This Row],[Unique Index]]=Data[Lag Index],Data[Adj Close]))","v":298.01825000000002},{"$f":"MIN(IF(Transform_Data[[#This Row],[Unique Index]]=Data[Index],Data[Adj Close]),\n             IF(Transform_Data[[#This Row],[Unique Index]]=Data[Lag Index],Data[Adj Close]))","v":292.81616200000002}]
[null,null,null,"2022-02-03",298.45343000000003,{"$f":"IF(Data[[#This Row],[Adj Close]]<E49,TRUE,\"\")","v":true},{"$f":"IF(F47=Data[[#This Row],[Up]],0,1)","v":1},{"$f":"SUM($G$26:G48)","v":14},13,null,null,23,{"$f":"INDEX(Data[Date],MATCH(Transform_Data[[#This Row],[Unique Index]],Data[Index],0))","v":"2022-03-02"},{"$f":"MAX( IF(Transform_Data[[#This Row],[Unique Index]]=Data[Index],Data[Adj Close]),\n               IF(Transform_Data[[#This Row],[Unique Index]]=Data[Lag Index],Data[Adj Close]))","v":298.01825000000002},{"$f":"MIN(IF(Transform_Data[[#This Row],[Unique Index]]=Data[Index],Data[Adj Close]),\n             IF(Transform_Data[[#This Row],[Unique Index]]=Data[Lag Index],Data[Adj Close]))","v":273.854309}]
[null,null,null,"2022-02-04",303.09988399999997,{"$f":"IF(Data[[#This Row],[Adj Close]]<E50,TRUE,\"\")","v":""},{"$f":"IF(F48=Data[[#This Row],[Up]],0,1)","v":1},{"$f":"SUM($G$26:G49)","v":15},14,null,null,24,{"$f":"INDEX(Data[Date],MATCH(Transform_Data[[#This Row],[Unique Index]],Data[Index],0))","v":"2022-03-08"},{"$f":"MAX( IF(Transform_Data[[#This Row],[Unique Index]]=Data[Index],Data[Adj Close]),\n               IF(Transform_Data[[#This Row],[Unique Index]]=Data[Lag Index],Data[Adj Close]))","v":286.41281099999998},{"$f":"MIN(IF(Transform_Data[[#This Row],[Unique Index]]=Data[Index],Data[Adj Close]),\n             IF(Transform_Data[[#This Row],[Unique Index]]=Data[Lag Index],Data[Adj Close]))","v":273.854309}]
[null,null,null,"2022-02-07",298.15621900000002,{"$f":"IF(Data[[#This Row],[Adj Close]]<E51,TRUE,\"\")","v":true},{"$f":"IF(F49=Data[[#This Row],[Up]],0,1)","v":1},{"$f":"SUM($G$26:G50)","v":16},15,null,null,25,{"$f":"INDEX(Data[Date],MATCH(Transform_Data[[#This Row],[Unique Index]],Data[Index],0))","v":"2022-03-09"},{"$f":"MAX( IF(Transform_Data[[#This Row],[Unique Index]]=Data[Index],Data[Adj Close]),\n               IF(Transform_Data[[#This Row],[Unique Index]]=Data[Lag Index],Data[Adj Close]))","v":286.41281099999998},{"$f":"MIN(IF(Transform_Data[[#This Row],[Unique Index]]=Data[Index],Data[Adj Close]),\n             IF(Transform_Data[[#This Row],[Unique Index]]=Data[Lag Index],Data[Adj Close]))","v":274.44006300000001}]
[null,null,null,"2022-02-08",301.73269699999997,{"$f":"IF(Data[[#This Row],[Adj Close]]<E52,TRUE,\"\")","v":true},{"$f":"IF(F50=Data[[#This Row],[Up]],0,1)","v":0},{"$f":"SUM($G$26:G51)","v":16},16,null,null,26,{"$f":"INDEX(Data[Date],MATCH(Transform_Data[[#This Row],[Unique Index]],Data[Index],0))","v":"2022-03-14"},{"$f":"MAX( IF(Transform_Data[[#This Row],[Unique Index]]=Data[Index],Data[Adj Close]),\n               IF(Transform_Data[[#This Row],[Unique Index]]=Data[Lag Index],Data[Adj Close]))","v":298.25650000000002},{"$f":"MIN(IF(Transform_Data[[#This Row],[Unique Index]]=Data[Index],Data[Adj Close]),\n             IF(Transform_Data[[#This Row],[Unique Index]]=Data[Lag Index],Data[Adj Close]))","v":274.44006300000001}]
[null,null,null,"2022-02-09",308.32095299999997,{"$f":"IF(Data[[#This Row],[Adj Close]]<E53,TRUE,\"\")","v":""},{"$f":"IF(F51=Data[[#This Row],[Up]],0,1)","v":1},{"$f":"SUM($G$26:G52)","v":17},16,null,null,27,{"$f":"INDEX(Data[Date],MATCH(Transform_Data[[#This Row],[Unique Index]],Data[Index],0))","v":"2022-03-18"},{"$f":"MAX( IF(Transform_Data[[#This Row],[Unique Index]]=Data[Index],Data[Adj Close]),\n               IF(Transform_Data[[#This Row],[Unique Index]]=Data[Lag Index],Data[Adj Close]))","v":298.25650000000002},{"$f":"MIN(IF(Transform_Data[[#This Row],[Unique Index]]=Data[Index],Data[Adj Close]),\n             IF(Transform_Data[[#This Row],[Unique Index]]=Data[Lag Index],Data[Adj Close]))","v":296.99569700000001}]
[null,null,null,"2022-02-10",299.57299799999998,{"$f":"IF(Data[[#This Row],[Adj Close]]<E54,TRUE,\"\")","v":""},{"$f":"IF(F52=Data[[#This Row],[Up]],0,1)","v":0},{"$f":"SUM($G$26:G53)","v":17},17,null,null,28,{"$f":"INDEX(Data[Date],MATCH(Transform_Data[[#This Row],[Unique Index]],Data[Index],0))","v":"2022-03-21"},{"$f":"MAX( IF(Transform_Data[[#This Row],[Unique Index]]=Data[Index],Data[Adj Close]),\n               IF(Transform_Data[[#This Row],[Unique Index]]=Data[Lag Index],Data[Adj Close]))","v":301.860229},{"$f":"MIN(IF(Transform_Data[[#This Row],[Unique Index]]=Data[Index],Data[Adj Close]),\n             IF(Transform_Data[[#This Row],[Unique Index]]=Data[Lag Index],Data[Adj Close]))","v":296.99569700000001}]
[null,null,null,"2022-02-11",292.301086,{"$f":"IF(Data[[#This Row],[Adj Close]]<E55,TRUE,\"\")","v":""},{"$f":"IF(F53=Data[[#This Row],[Up]],0,1)","v":0},{"$f":"SUM($G$26:G54)","v":17},17,null,null,29,{"$f":"INDEX(Data[Date],MATCH(Transform_Data[[#This Row],[Unique Index]],Data[Index],0))","v":"2022-03-22"},{"$f":"MAX( IF(Transform_Data[[#This Row],[Unique Index]]=Data[Index],Data[Adj Close]),\n               IF(Transform_Data[[#This Row],[Unique Index]]=Data[Lag Index],Data[Adj Close]))","v":301.860229},{"$f":"MIN(IF(Transform_Data[[#This Row],[Unique Index]]=Data[Index],Data[Adj Close]),\n             IF(Transform_Data[[#This Row],[Unique Index]]=Data[Lag Index],Data[Adj Close]))","v":297.32327299999997}]
[null,null,null,"2022-02-14",292.26147500000002,{"$f":"IF(Data[[#This Row],[Adj Close]]<E56,TRUE,\"\")","v":true},{"$f":"IF(F54=Data[[#This Row],[Up]],0,1)","v":1},{"$f":"SUM($G$26:G55)","v":18},17,null,null,30,{"$f":"INDEX(Data[Date],MATCH(Transform_Data[[#This Row],[Unique Index]],Data[Index],0))","v":"2022-03-23"},{"$f":"MAX( IF(Transform_Data[[#This Row],[Unique Index]]=Data[Index],Data[Adj Close]),\n               IF(Transform_Data[[#This Row],[Unique Index]]=Data[Lag Index],Data[Adj Close]))","v":301.89996300000001},{"$f":"MIN(IF(Transform_Data[[#This Row],[Unique Index]]=Data[Index],Data[Adj Close]),\n             IF(Transform_Data[[#This Row],[Unique Index]]=Data[Lag Index],Data[Adj Close]))","v":297.32327299999997}]
[null,null,null,"2022-02-15",297.68069500000001,{"$f":"IF(Data[[#This Row],[Adj Close]]<E57,TRUE,\"\")","v":""},{"$f":"IF(F55=Data[[#This Row],[Up]],0,1)","v":1},{"$f":"SUM($G$26:G56)","v":19},18,null,null,31,{"$f":"INDEX(Data[Date],MATCH(Transform_Data[[#This Row],[Unique Index]],Data[Index],0))","v":"2022-03-24"},{"$f":"MAX( IF(Transform_Data[[#This Row],[Unique Index]]=Data[Index],Data[Adj Close]),\n               IF(Transform_Data[[#This Row],[Unique Index]]=Data[Lag Index],Data[Adj Close]))","v":301.89996300000001},{"$f":"MIN(IF(Transform_Data[[#This Row],[Unique Index]]=Data[Index],Data[Adj Close]),\n             IF(Transform_Data[[#This Row],[Unique Index]]=Data[Lag Index],Data[Adj Close]))","v":301.48297100000002}]
[null,null,null,"2022-02-16",297.333191,{"$f":"IF(Data[[#This Row],[Adj Close]]<E58,TRUE,\"\")","v":""},{"$f":"IF(F56=Data[[#This Row],[Up]],0,1)","v":0},{"$f":"SUM($G$26:G57)","v":19},19,null,null,32,{"$f":"INDEX(Data[Date],MATCH(Transform_Data[[#This Row],[Unique Index]],Data[Index],0))","v":"2022-03-25"},{"$f":"MAX( IF(Transform_Data[[#This Row],[Unique Index]]=Data[Index],Data[Adj Close]),\n               IF(Transform_Data[[#This Row],[Unique Index]]=Data[Lag Index],Data[Adj Close]))","v":313.12811299999998},{"$f":"MIN(IF(Transform_Data[[#This Row],[Unique Index]]=Data[Index],Data[Adj Close]),\n             IF(Transform_Data[[#This Row],[Unique Index]]=Data[Lag Index],Data[Adj Close]))","v":301.48297100000002}]
[null,null,null,"2022-02-17",288.62667800000003,{"$f":"IF(Data[[#This Row],[Adj Close]]<E59,TRUE,\"\")","v":""},{"$f":"IF(F57=Data[[#This Row],[Up]],0,1)","v":0},{"$f":"SUM($G$26:G58)","v":19},19,null,null,{"$f":"N(L57)+1","v":33},{"$f":"INDEX(Data[Date],MATCH(Transform_Data[[#This Row],[Unique Index]],Data[Index],0))","v":"2022-03-29"},{"$f":"MAX( IF(Transform_Data[[#This Row],[Unique Index]]=Data[Index],Data[Adj Close]),\n               IF(Transform_Data[[#This Row],[Unique Index]]=Data[Lag Index],Data[Adj Close]))","v":313.12811299999998},{"$f":"MIN(IF(Transform_Data[[#This Row],[Unique Index]]=Data[Index],Data[Adj Close]),\n             IF(Transform_Data[[#This Row],[Unique Index]]=Data[Lag Index],Data[Adj Close]))","v":306.07946800000002}]
[null,null,null,"2022-02-18",285.846924,{"$f":"IF(Data[[#This Row],[Adj Close]]<E60,TRUE,\"\")","v":""},{"$f":"IF(F58=Data[[#This Row],[Up]],0,1)","v":0},{"$f":"SUM($G$26:G59)","v":19},19,null,null,34,{"$f":"INDEX(Data[Date],MATCH(Transform_Data[[#This Row],[Unique Index]],Data[Index],0))","v":"2022-03-31"},{"$f":"MAX( IF(Transform_Data[[#This Row],[Unique Index]]=Data[Index],Data[Adj Close]),\n               IF(Transform_Data[[#This Row],[Unique Index]]=Data[Lag Index],Data[Adj Close]))","v":312.69131499999997},{"$f":"MIN(IF(Transform_Data[[#This Row],[Unique Index]]=Data[Index],Data[Adj Close]),\n             IF(Transform_Data[[#This Row],[Unique Index]]=Data[Lag Index],Data[Adj Close]))","v":306.07946800000002}]
[null,null,null,"2022-02-22",285.63845800000001,{"$f":"IF(Data[[#This Row],[Adj Close]]<E61,TRUE,\"\")","v":""},{"$f":"IF(F59=Data[[#This Row],[Up]],0,1)","v":0},{"$f":"SUM($G$26:G60)","v":19},19,null,null,35,{"$f":"INDEX(Data[Date],MATCH(Transform_Data[[#This Row],[Unique Index]],Data[Index],0))","v":"2022-04-04"},{"$f":"MAX( IF(Transform_Data[[#This Row],[Unique Index]]=Data[Index],Data[Adj Close]),\n               IF(Transform_Data[[#This Row],[Unique Index]]=Data[Lag Index],Data[Adj Close]))","v":312.69131499999997},{"$f":"MIN(IF(Transform_Data[[#This Row],[Unique Index]]=Data[Index],Data[Adj Close]),\n             IF(Transform_Data[[#This Row],[Unique Index]]=Data[Lag Index],Data[Adj Close]))","v":297.333191}]
[null,null,null,"2022-02-23",278.24230999999997,{"$f":"IF(Data[[#This Row],[Adj Close]]<E62,TRUE,\"\")","v":true},{"$f":"IF(F60=Data[[#This Row],[Up]],0,1)","v":1},{"$f":"SUM($G$26:G61)","v":20},19,null,null,36,{"$f":"INDEX(Data[Date],MATCH(Transform_Data[[#This Row],[Unique Index]],Data[Index],0))","v":"2022-04-06"},{"$f":"MAX( IF(Transform_Data[[#This Row],[Unique Index]]=Data[Index],Data[Adj Close]),\n               IF(Transform_Data[[#This Row],[Unique Index]]=Data[Lag Index],Data[Adj Close]))","v":299.18966699999999},{"$f":"MIN(IF(Transform_Data[[#This Row],[Unique Index]]=Data[Index],Data[Adj Close]),\n             IF(Transform_Data[[#This Row],[Unique Index]]=Data[Lag Index],Data[Adj Close]))","v":297.333191}]
[null,null,null,"2022-02-24",292.45871,{"$f":"IF(Data[[#This Row],[Adj Close]]<E63,TRUE,\"\")","v":true},{"$f":"IF(F61=Data[[#This Row],[Up]],0,1)","v":0},{"$f":"SUM($G$26:G62)","v":20},20,null,null,37,{"$f":"INDEX(Data[Date],MATCH(Transform_Data[[#This Row],[Unique Index]],Data[Index],0))","v":"2022-04-07"},{"$f":"MAX( IF(Transform_Data[[#This Row],[Unique Index]]=Data[Index],Data[Adj Close]),\n               IF(Transform_Data[[#This Row],[Unique Index]]=Data[Lag Index],Data[Adj Close]))","v":299.18966699999999},{"$f":"MIN(IF(Transform_Data[[#This Row],[Unique Index]]=Data[Index],Data[Adj Close]),\n             IF(Transform_Data[[#This Row],[Unique Index]]=Data[Lag Index],Data[Adj Close]))","v":280.019409}]
[null,null,null,"2022-02-25",295.159088,{"$f":"IF(Data[[#This Row],[Adj Close]]<E64,TRUE,\"\")","v":true},{"$f":"IF(F62=Data[[#This Row],[Up]],0,1)","v":0},{"$f":"SUM($G$26:G63)","v":20},20,null,null,38,{"$f":"INDEX(Data[Date],MATCH(Transform_Data[[#This Row],[Unique Index]],Data[Index],0))","v":"2022-04-12"},{"$f":"MAX( IF(Transform_Data[[#This Row],[Unique Index]]=Data[Index],Data[Adj Close]),\n               IF(Transform_Data[[#This Row],[Unique Index]]=Data[Lag Index],Data[Adj Close]))","v":285.539154},{"$f":"MIN(IF(Transform_Data[[#This Row],[Unique Index]]=Data[Index],Data[Adj Close]),\n             IF(Transform_Data[[#This Row],[Unique Index]]=Data[Lag Index],Data[Adj Close]))","v":280.019409}]
[null,null,null,"2022-02-28",296.62835699999999,{"$f":"IF(Data[[#This Row],[Adj Close]]<E65,TRUE,\"\")","v":""},{"$f":"IF(F63=Data[[#This Row],[Up]],0,1)","v":1},{"$f":"SUM($G$26:G64)","v":21},20,null,null,39,{"$f":"INDEX(Data[Date],MATCH(Transform_Data[[#This Row],[Unique Index]],Data[Index],0))","v":"2022-04-13"},{"$f":"MAX( IF(Transform_Data[[#This Row],[Unique Index]]=Data[Index],Data[Adj Close]),\n               IF(Transform_Data[[#This Row],[Unique Index]]=Data[Lag Index],Data[Adj Close]))","v":285.539154},{"$f":"MIN(IF(Transform_Data[[#This Row],[Unique Index]]=Data[Index],Data[Adj Close]),\n             IF(Transform_Data[[#This Row],[Unique Index]]=Data[Lag Index],Data[Adj Close]))","v":277.805542}]
[null,null,null,"2022-03-01",292.81616200000002,{"$f":"IF(Data[[#This Row],[Adj Close]]<E66,TRUE,\"\")","v":true},{"$f":"IF(F64=Data[[#This Row],[Up]],0,1)","v":1},{"$f":"SUM($G$26:G65)","v":22},21,null,null,40,{"$f":"INDEX(Data[Date],MATCH(Transform_Data[[#This Row],[Unique Index]],Data[Index],0))","v":"2022-04-14"},{"$f":"MAX( IF(Transform_Data[[#This Row],[Unique Index]]=Data[Index],Data[Adj Close]),\n               IF(Transform_Data[[#This Row],[Unique Index]]=Data[Lag Index],Data[Adj Close]))","v":284.28826900000001},{"$f":"MIN(IF(Transform_Data[[#This Row],[Unique Index]]=Data[Index],Data[Adj Close]),\n             IF(Transform_Data[[#This Row],[Unique Index]]=Data[Lag Index],Data[Adj Close]))","v":277.805542}]
[null,null,null,"2022-03-02",298.01825000000002,{"$f":"IF(Data[[#This Row],[Adj Close]]<E67,TRUE,\"\")","v":""},{"$f":"IF(F65=Data[[#This Row],[Up]],0,1)","v":1},{"$f":"SUM($G$26:G66)","v":23},22,null,null,41,{"$f":"INDEX(Data[Date],MATCH(Transform_Data[[#This Row],[Unique Index]],Data[Index],0))","v":"2022-04-20"},{"$f":"MAX( IF(Transform_Data[[#This Row],[Unique Index]]=Data[Index],Data[Adj Close]),\n               IF(Transform_Data[[#This Row],[Unique Index]]=Data[Lag Index],Data[Adj Close]))","v":284.28826900000001},{"$f":"MIN(IF(Transform_Data[[#This Row],[Unique Index]]=Data[Index],Data[Adj Close]),\n             IF(Transform_Data[[#This Row],[Unique Index]]=Data[Lag Index],Data[Adj Close]))","v":272.04748499999999}]
[null,null,null,"2022-03-03",293.77914399999997,{"$f":"IF(Data[[#This Row],[Adj Close]]<E68,TRUE,\"\")","v":""},{"$f":"IF(F66=Data[[#This Row],[Up]],0,1)","v":0},{"$f":"SUM($G$26:G67)","v":23},23,null,null,42,{"$f":"INDEX(Data[Date],MATCH(Transform_Data[[#This Row],[Unique Index]],Data[Index],0))","v":"2022-04-22"},{"$f":"MAX( IF(Transform_Data[[#This Row],[Unique Index]]=Data[Index],Data[Adj Close]),\n               IF(Transform_Data[[#This Row],[Unique Index]]=Data[Lag Index],Data[Adj Close]))","v":278.68908699999997},{"$f":"MIN(IF(Transform_Data[[#This Row],[Unique Index]]=Data[Index],Data[Adj Close]),\n             IF(Transform_Data[[#This Row],[Unique Index]]=Data[Lag Index],Data[Adj Close]))","v":272.04748499999999}]
[null,null,null,"2022-03-04",287.76293900000002,{"$f":"IF(Data[[#This Row],[Adj Close]]<E69,TRUE,\"\")","v":""},{"$f":"IF(F67=Data[[#This Row],[Up]],0,1)","v":0},{"$f":"SUM($G$26:G68)","v":23},23,null,null,43,{"$f":"INDEX(Data[Date],MATCH(Transform_Data[[#This Row],[Unique Index]],Data[Index],0))","v":"2022-04-25"},{"$f":"MAX( IF(Transform_Data[[#This Row],[Unique Index]]=Data[Index],Data[Adj Close]),\n               IF(Transform_Data[[#This Row],[Unique Index]]=Data[Lag Index],Data[Adj Close]))","v":278.68908699999997},{"$f":"MIN(IF(Transform_Data[[#This Row],[Unique Index]]=Data[Index],Data[Adj Close]),\n             IF(Transform_Data[[#This Row],[Unique Index]]=Data[Lag Index],Data[Adj Close]))","v":268.26507600000002}]
[null,null,null,"2022-03-07",276.89218099999999,{"$f":"IF(Data[[#This Row],[Adj Close]]<E70,TRUE,\"\")","v":""},{"$f":"IF(F68=Data[[#This Row],[Up]],0,1)","v":0},{"$f":"SUM($G$26:G69)","v":23},23,null,null,44,{"$f":"INDEX(Data[Date],MATCH(Transform_Data[[#This Row],[Unique Index]],Data[Index],0))","v":"2022-04-26"},{"$f":"MAX( IF(Transform_Data[[#This Row],[Unique Index]]=Data[Index],Data[Adj Close]),\n               IF(Transform_Data[[#This Row],[Unique Index]]=Data[Lag Index],Data[Adj Close]))","v":287.53463699999998},{"$f":"MIN(IF(Transform_Data[[#This Row],[Unique Index]]=Data[Index],Data[Adj Close]),\n             IF(Transform_Data[[#This Row],[Unique Index]]=Data[Lag Index],Data[Adj Close]))","v":268.26507600000002}]
[null,null,null,"2022-03-08",273.854309,{"$f":"IF(Data[[#This Row],[Adj Close]]<E71,TRUE,\"\")","v":true},{"$f":"IF(F69=Data[[#This Row],[Up]],0,1)","v":1},{"$f":"SUM($G$26:G70)","v":24},23,null,null,45,{"$f":"INDEX(Data[Date],MATCH(Transform_Data[[#This Row],[Unique Index]],Data[Index],0))","v":"2022-04-28"},{"$f":"MAX( IF(Transform_Data[[#This Row],[Unique Index]]=Data[Index],Data[Adj Close]),\n               IF(Transform_Data[[#This Row],[Unique Index]]=Data[Lag Index],Data[Adj Close]))","v":287.53463699999998},{"$f":"MIN(IF(Transform_Data[[#This Row],[Unique Index]]=Data[Index],Data[Adj Close]),\n             IF(Transform_Data[[#This Row],[Unique Index]]=Data[Lag Index],Data[Adj Close]))","v":275.51220699999999}]
[null,null,null,"2022-03-09",286.41281099999998,{"$f":"IF(Data[[#This Row],[Adj Close]]<E72,TRUE,\"\")","v":""},{"$f":"IF(F70=Data[[#This Row],[Up]],0,1)","v":1},{"$f":"SUM($G$26:G71)","v":25},24,null,null,46,{"$f":"INDEX(Data[Date],MATCH(Transform_Data[[#This Row],[Unique Index]],Data[Index],0))","v":"2022-04-29"},{"$f":"MAX( IF(Transform_Data[[#This Row],[Unique Index]]=Data[Index],Data[Adj Close]),\n               IF(Transform_Data[[#This Row],[Unique Index]]=Data[Lag Index],Data[Adj Close]))","v":282.41195699999997},{"$f":"MIN(IF(Transform_Data[[#This Row],[Unique Index]]=Data[Index],Data[Adj Close]),\n             IF(Transform_Data[[#This Row],[Unique Index]]=Data[Lag Index],Data[Adj Close]))","v":275.51220699999999}]
[null,null,null,"2022-03-10",283.523865,{"$f":"IF(Data[[#This Row],[Adj Close]]<E73,TRUE,\"\")","v":""},{"$f":"IF(F71=Data[[#This Row],[Up]],0,1)","v":0},{"$f":"SUM($G$26:G72)","v":25},25,null,null,47,{"$f":"INDEX(Data[Date],MATCH(Transform_Data[[#This Row],[Unique Index]],Data[Index],0))","v":"2022-05-02"},{"$f":"MAX( IF(Transform_Data[[#This Row],[Unique Index]]=Data[Index],Data[Adj Close]),\n               IF(Transform_Data[[#This Row],[Unique Index]]=Data[Lag Index],Data[Adj Close]))","v":282.41195699999997},{"$f":"MIN(IF(Transform_Data[[#This Row],[Unique Index]]=Data[Index],Data[Adj Close]),\n             IF(Transform_Data[[#This Row],[Unique Index]]=Data[Lag Index],Data[Adj Close]))","v":279.74142499999999}]
[null,null,null,"2022-03-11",278.04379299999999,{"$f":"IF(Data[[#This Row],[Adj Close]]<E74,TRUE,\"\")","v":""},{"$f":"IF(F72=Data[[#This Row],[Up]],0,1)","v":0},{"$f":"SUM($G$26:G73)","v":25},25,null,null,48,{"$f":"INDEX(Data[Date],MATCH(Transform_Data[[#This Row],[Unique Index]],Data[Index],0))","v":"2022-05-03"},{"$f":"MAX( IF(Transform_Data[[#This Row],[Unique Index]]=Data[Index],Data[Adj Close]),\n               IF(Transform_Data[[#This Row],[Unique Index]]=Data[Lag Index],Data[Adj Close]))","v":287.88211100000001},{"$f":"MIN(IF(Transform_Data[[#This Row],[Unique Index]]=Data[Index],Data[Adj Close]),\n             IF(Transform_Data[[#This Row],[Unique Index]]=Data[Lag Index],Data[Adj Close]))","v":279.74142499999999}]
[null,null,null,"2022-03-14",274.44006300000001,{"$f":"IF(Data[[#This Row],[Adj Close]]<E75,TRUE,\"\")","v":true},{"$f":"IF(F73=Data[[#This Row],[Up]],0,1)","v":1},{"$f":"SUM($G$26:G74)","v":26},25,null,null,49,{"$f":"INDEX(Data[Date],MATCH(Transform_Data[[#This Row],[Unique Index]],Data[Index],0))","v":"2022-05-04"},{"$f":"MAX( IF(Transform_Data[[#This Row],[Unique Index]]=Data[Index],Data[Adj Close]),\n               IF(Transform_Data[[#This Row],[Unique Index]]=Data[Lag Index],Data[Adj Close]))","v":287.88211100000001},{"$f":"MIN(IF(Transform_Data[[#This Row],[Unique Index]]=Data[Index],Data[Adj Close]),\n             IF(Transform_Data[[#This Row],[Unique Index]]=Data[Lag Index],Data[Adj Close]))","v":262.665863}]
[null,null,null,"2022-03-15",285.07257099999998,{"$f":"IF(Data[[#This Row],[Adj Close]]<E76,TRUE,\"\")","v":true},{"$f":"IF(F74=Data[[#This Row],[Up]],0,1)","v":0},{"$f":"SUM($G$26:G75)","v":26},26,null,null,50,{"$f":"INDEX(Data[Date],MATCH(Transform_Data[[#This Row],[Unique Index]],Data[Index],0))","v":"2022-05-09"},{"$f":"MAX( IF(Transform_Data[[#This Row],[Unique Index]]=Data[Index],Data[Adj Close]),\n               IF(Transform_Data[[#This Row],[Unique Index]]=Data[Lag Index],Data[Adj Close]))","v":267.55026199999998},{"$f":"MIN(IF(Transform_Data[[#This Row],[Unique Index]]=Data[Index],Data[Adj Close]),\n             IF(Transform_Data[[#This Row],[Unique Index]]=Data[Lag Index],Data[Adj Close]))","v":262.665863}]
[null,null,null,"2022-03-16",292.26019300000002,{"$f":"IF(Data[[#This Row],[Adj Close]]<E77,TRUE,\"\")","v":true},{"$f":"IF(F75=Data[[#This Row],[Up]],0,1)","v":0},{"$f":"SUM($G$26:G76)","v":26},26,null,null,51,{"$f":"INDEX(Data[Date],MATCH(Transform_Data[[#This Row],[Unique Index]],Data[Index],0))","v":"2022-05-10"},{"$f":"MAX( IF(Transform_Data[[#This Row],[Unique Index]]=Data[Index],Data[Adj Close]),\n               IF(Transform_Data[[#This Row],[Unique Index]]=Data[Lag Index],Data[Adj Close]))","v":267.55026199999998},{"$f":"MIN(IF(Transform_Data[[#This Row],[Unique Index]]=Data[Index],Data[Adj Close]),\n             IF(Transform_Data[[#This Row],[Unique Index]]=Data[Lag Index],Data[Adj Close]))","v":253.50264000000001}]
[null,null,null,"2022-03-17",293.08416699999998,{"$f":"IF(Data[[#This Row],[Adj Close]]<E78,TRUE,\"\")","v":true},{"$f":"IF(F76=Data[[#This Row],[Up]],0,1)","v":0},{"$f":"SUM($G$26:G77)","v":26},26,null,null,52,{"$f":"INDEX(Data[Date],MATCH(Transform_Data[[#This Row],[Unique Index]],Data[Index],0))","v":"2022-05-12"},{"$f":"MAX( IF(Transform_Data[[#This Row],[Unique Index]]=Data[Index],Data[Adj Close]),\n               IF(Transform_Data[[#This Row],[Unique Index]]=Data[Lag Index],Data[Adj Close]))","v":264.889679},{"$f":"MIN(IF(Transform_Data[[#This Row],[Unique Index]]=Data[Index],Data[Adj Close]),\n             IF(Transform_Data[[#This Row],[Unique Index]]=Data[Lag Index],Data[Adj Close]))","v":253.50264000000001}]
[null,null,null,"2022-03-18",298.25650000000002,{"$f":"IF(Data[[#This Row],[Adj Close]]<E79,TRUE,\"\")","v":""},{"$f":"IF(F77=Data[[#This Row],[Up]],0,1)","v":1},{"$f":"SUM($G$26:G78)","v":27},26,null,null,53,{"$f":"INDEX(Data[Date],MATCH(Transform_Data[[#This Row],[Unique Index]],Data[Index],0))","v":"2022-05-17"},{"$f":"MAX( IF(Transform_Data[[#This Row],[Unique Index]]=Data[Index],Data[Adj Close]),\n               IF(Transform_Data[[#This Row],[Unique Index]]=Data[Lag Index],Data[Adj Close]))","v":264.889679},{"$f":"MIN(IF(Transform_Data[[#This Row],[Unique Index]]=Data[Index],Data[Adj Close]),\n             IF(Transform_Data[[#This Row],[Unique Index]]=Data[Lag Index],Data[Adj Close]))","v":251.31680299999999}]
[null,null,null,"2022-03-21",296.99569700000001,{"$f":"IF(Data[[#This Row],[Adj Close]]<E80,TRUE,\"\")","v":true},{"$f":"IF(F78=Data[[#This Row],[Up]],0,1)","v":1},{"$f":"SUM($G$26:G79)","v":28},27,null,null,54,{"$f":"INDEX(Data[Date],MATCH(Transform_Data[[#This Row],[Unique Index]],Data[Index],0))","v":"2022-05-20"},{"$f":"MAX( IF(Transform_Data[[#This Row],[Unique Index]]=Data[Index],Data[Adj Close]),\n               IF(Transform_Data[[#This Row],[Unique Index]]=Data[Lag Index],Data[Adj Close]))","v":259.36697400000003},{"$f":"MIN(IF(Transform_Data[[#This Row],[Unique Index]]=Data[Index],Data[Adj Close]),\n             IF(Transform_Data[[#This Row],[Unique Index]]=Data[Lag Index],Data[Adj Close]))","v":251.31680299999999}]
[null,null,null,"2022-03-22",301.860229,{"$f":"IF(Data[[#This Row],[Adj Close]]<E81,TRUE,\"\")","v":""},{"$f":"IF(F79=Data[[#This Row],[Up]],0,1)","v":1},{"$f":"SUM($G$26:G80)","v":29},28,null,null,55,{"$f":"INDEX(Data[Date],MATCH(Transform_Data[[#This Row],[Unique Index]],Data[Index],0))","v":"2022-05-23"},{"$f":"MAX( IF(Transform_Data[[#This Row],[Unique Index]]=Data[Index],Data[Adj Close]),\n               IF(Transform_Data[[#This Row],[Unique Index]]=Data[Lag Index],Data[Adj Close]))","v":259.36697400000003},{"$f":"MIN(IF(Transform_Data[[#This Row],[Unique Index]]=Data[Index],Data[Adj Close]),\n             IF(Transform_Data[[#This Row],[Unique Index]]=Data[Lag Index],Data[Adj Close]))","v":258.34204099999999}]
[null,null,null,"2022-03-23",297.32327299999997,{"$f":"IF(Data[[#This Row],[Adj Close]]<E82,TRUE,\"\")","v":true},{"$f":"IF(F80=Data[[#This Row],[Up]],0,1)","v":1},{"$f":"SUM($G$26:G81)","v":30},29,null,null,56,{"$f":"INDEX(Data[Date],MATCH(Transform_Data[[#This Row],[Unique Index]],Data[Index],0))","v":"2022-05-24"},{"$f":"MAX( IF(Transform_Data[[#This Row],[Unique Index]]=Data[Index],Data[Adj Close]),\n               IF(Transform_Data[[#This Row],[Unique Index]]=Data[Lag Index],Data[Adj Close]))","v":271.89498900000001},{"$f":"MIN(IF(Transform_Data[[#This Row],[Unique Index]]=Data[Index],Data[Adj Close]),\n             IF(Transform_Data[[#This Row],[Unique Index]]=Data[Lag Index],Data[Adj Close]))","v":258.34204099999999}]
[null,null,null,"2022-03-24",301.89996300000001,{"$f":"IF(Data[[#This Row],[Adj Close]]<E83,TRUE,\"\")","v":""},{"$f":"IF(F81=Data[[#This Row],[Up]],0,1)","v":1},{"$f":"SUM($G$26:G82)","v":31},30,null,null,57,{"$f":"INDEX(Data[Date],MATCH(Transform_Data[[#This Row],[Unique Index]],Data[Index],0))","v":"2022-05-27"},{"$f":"MAX( IF(Transform_Data[[#This Row],[Unique Index]]=Data[Index],Data[Adj Close]),\n               IF(Transform_Data[[#This Row],[Unique Index]]=Data[Lag Index],Data[Adj Close]))","v":271.89498900000001},{"$f":"MIN(IF(Transform_Data[[#This Row],[Unique Index]]=Data[Index],Data[Adj Close]),\n             IF(Transform_Data[[#This Row],[Unique Index]]=Data[Lag Index],Data[Adj Close]))","v":270.531769}]
[null,null,null,"2022-03-25",301.48297100000002,{"$f":"IF(Data[[#This Row],[Adj Close]]<E84,TRUE,\"\")","v":true},{"$f":"IF(F82=Data[[#This Row],[Up]],0,1)","v":1},{"$f":"SUM($G$26:G83)","v":32},31,null,null,58,{"$f":"INDEX(Data[Date],MATCH(Transform_Data[[#This Row],[Unique Index]],Data[Index],0))","v":"2022-05-31"},{"$f":"MAX( IF(Transform_Data[[#This Row],[Unique Index]]=Data[Index],Data[Adj Close]),\n               IF(Transform_Data[[#This Row],[Unique Index]]=Data[Lag Index],Data[Adj Close]))","v":273.22839399999998},{"$f":"MIN(IF(Transform_Data[[#This Row],[Unique Index]]=Data[Index],Data[Adj Close]),\n             IF(Transform_Data[[#This Row],[Unique Index]]=Data[Lag Index],Data[Adj Close]))","v":270.531769}]
[null,null,null,"2022-03-28",308.45220899999998,{"$f":"IF(Data[[#This Row],[Adj Close]]<E85,TRUE,\"\")","v":true},{"$f":"IF(F83=Data[[#This Row],[Up]],0,1)","v":0},{"$f":"SUM($G$26:G84)","v":32},32,null,null,59,{"$f":"INDEX(Data[Date],MATCH(Transform_Data[[#This Row],[Unique Index]],Data[Index],0))","v":"2022-06-02"},{"$f":"MAX( IF(Transform_Data[[#This Row],[Unique Index]]=Data[Index],Data[Adj Close]),\n               IF(Transform_Data[[#This Row],[Unique Index]]=Data[Lag Index],Data[Adj Close]))","v":273.22839399999998},{"$f":"MIN(IF(Transform_Data[[#This Row],[Unique Index]]=Data[Index],Data[Adj Close]),\n             IF(Transform_Data[[#This Row],[Unique Index]]=Data[Lag Index],Data[Adj Close]))","v":267.42709400000001}]
[null,null,null,"2022-03-29",313.12811299999998,{"$f":"IF(Data[[#This Row],[Adj Close]]<E86,TRUE,\"\")","v":""},{"$f":"IF(F84=Data[[#This Row],[Up]],0,1)","v":1},{"$f":"SUM($G$26:G85)","v":33},32,null,null,60,{"$f":"INDEX(Data[Date],MATCH(Transform_Data[[#This Row],[Unique Index]],Data[Index],0))","v":"2022-06-06"},{"$f":"MAX( IF(Transform_Data[[#This Row],[Unique Index]]=Data[Index],Data[Adj Close]),\n               IF(Transform_Data[[#This Row],[Unique Index]]=Data[Lag Index],Data[Adj Close]))","v":271.158661},{"$f":"MIN(IF(Transform_Data[[#This Row],[Unique Index]]=Data[Index],Data[Adj Close]),\n             IF(Transform_Data[[#This Row],[Unique Index]]=Data[Lag Index],Data[Adj Close]))","v":267.42709400000001}]
[null,null,null,"2022-03-30",311.58932499999997,{"$f":"IF(Data[[#This Row],[Adj Close]]<E87,TRUE,\"\")","v":""},{"$f":"IF(F85=Data[[#This Row],[Up]],0,1)","v":0},{"$f":"SUM($G$26:G86)","v":33},33,null,null,61,{"$f":"INDEX(Data[Date],MATCH(Transform_Data[[#This Row],[Unique Index]],Data[Index],0))","v":"2022-06-07"},{"$f":"MAX( IF(Transform_Data[[#This Row],[Unique Index]]=Data[Index],Data[Adj Close]),\n               IF(Transform_Data[[#This Row],[Unique Index]]=Data[Lag Index],Data[Adj Close]))","v":271.158661},{"$f":"MIN(IF(Transform_Data[[#This Row],[Unique Index]]=Data[Index],Data[Adj Close]),\n             IF(Transform_Data[[#This Row],[Unique Index]]=Data[Lag Index],Data[Adj Close]))","v":241.06750500000001}]
[null,null,null,"2022-03-31",306.07946800000002,{"$f":"IF(Data[[#This Row],[Adj Close]]<E88,TRUE,\"\")","v":true},{"$f":"IF(F86=Data[[#This Row],[Up]],0,1)","v":1},{"$f":"SUM($G$26:G87)","v":34},33,null,null,62,{"$f":"INDEX(Data[Date],MATCH(Transform_Data[[#This Row],[Unique Index]],Data[Index],0))","v":"2022-06-13"},{"$f":"MAX( IF(Transform_Data[[#This Row],[Unique Index]]=Data[Index],Data[Adj Close]),\n               IF(Transform_Data[[#This Row],[Unique Index]]=Data[Lag Index],Data[Adj Close]))","v":250.520737},{"$f":"MIN(IF(Transform_Data[[#This Row],[Unique Index]]=Data[Index],Data[Adj Close]),\n             IF(Transform_Data[[#This Row],[Unique Index]]=Data[Lag Index],Data[Adj Close]))","v":241.06750500000001}]
[null,null,null,"2022-04-01",307.18145800000002,{"$f":"IF(Data[[#This Row],[Adj Close]]<E89,TRUE,\"\")","v":true},{"$f":"IF(F87=Data[[#This Row],[Up]],0,1)","v":0},{"$f":"SUM($G$26:G88)","v":34},34,null,null,63,{"$f":"INDEX(Data[Date],MATCH(Transform_Data[[#This Row],[Unique Index]],Data[Index],0))","v":"2022-06-15"},{"$f":"MAX( IF(Transform_Data[[#This Row],[Unique Index]]=Data[Index],Data[Adj Close]),\n               IF(Transform_Data[[#This Row],[Unique Index]]=Data[Lag Index],Data[Adj Close]))","v":250.520737},{"$f":"MIN(IF(Transform_Data[[#This Row],[Unique Index]]=Data[Index],Data[Adj Close]),\n             IF(Transform_Data[[#This Row],[Unique Index]]=Data[Lag Index],Data[Adj Close]))","v":243.76416}]
[null,null,null,"2022-04-04",312.69131499999997,{"$f":"IF(Data[[#This Row],[Adj Close]]<E90,TRUE,\"\")","v":""},{"$f":"IF(F88=Data[[#This Row],[Up]],0,1)","v":1},{"$f":"SUM($G$26:G89)","v":35},34,null,null,64,{"$f":"INDEX(Data[Date],MATCH(Transform_Data[[#This Row],[Unique Index]],Data[Index],0))","v":"2022-06-16"},{"$f":"MAX( IF(Transform_Data[[#This Row],[Unique Index]]=Data[Index],Data[Adj Close]),\n               IF(Transform_Data[[#This Row],[Unique Index]]=Data[Lag Index],Data[Adj Close]))","v":252.49099699999999},{"$f":"MIN(IF(Transform_Data[[#This Row],[Unique Index]]=Data[Index],Data[Adj Close]),\n             IF(Transform_Data[[#This Row],[Unique Index]]=Data[Lag Index],Data[Adj Close]))","v":243.76416}]
[null,null,null,"2022-04-05",308.63089000000002,{"$f":"IF(Data[[#This Row],[Adj Close]]<E91,TRUE,\"\")","v":""},{"$f":"IF(F89=Data[[#This Row],[Up]],0,1)","v":0},{"$f":"SUM($G$26:G90)","v":35},{"$f":"N(H89)","v":35},null,null,{"$f":"N(L89)+1","v":65},{"$f":"INDEX(Data[Date],MATCH(Transform_Data[[#This Row],[Unique Index]],Data[Index],0))","v":"2022-06-21"},{"$f":"MAX( IF(Transform_Data[[#This Row],[Unique Index]]=Data[Index],Data[Adj Close]),\n               IF(Transform_Data[[#This Row],[Unique Index]]=Data[Lag Index],Data[Adj Close]))","v":252.49099699999999},{"$f":"MIN(IF(Transform_Data[[#This Row],[Unique Index]]=Data[Index],Data[Adj Close]),\n             IF(Transform_Data[[#This Row],[Unique Index]]=Data[Lag Index],Data[Adj Close]))","v":251.88400300000001}]
[null,null,null,"2022-04-06",297.333191,{"$f":"IF(Data[[#This Row],[Adj Close]]<E92,TRUE,\"\")","v":true},{"$f":"IF(F90=Data[[#This Row],[Up]],0,1)","v":1},{"$f":"SUM($G$26:G91)","v":36},35,null,null,66,{"$f":"INDEX(Data[Date],MATCH(Transform_Data[[#This Row],[Unique Index]],Data[Index],0))","v":"2022-06-22"},{"$f":"MAX( IF(Transform_Data[[#This Row],[Unique Index]]=Data[Index],Data[Adj Close]),\n               IF(Transform_Data[[#This Row],[Unique Index]]=Data[Lag Index],Data[Adj Close]))","v":266.382294},{"$f":"MIN(IF(Transform_Data[[#This Row],[Unique Index]]=Data[Index],Data[Adj Close]),\n             IF(Transform_Data[[#This Row],[Unique Index]]=Data[Lag Index],Data[Adj Close]))","v":251.88400300000001}]
[null,null,null,"2022-04-07",299.18966699999999,{"$f":"IF(Data[[#This Row],[Adj Close]]<E93,TRUE,\"\")","v":""},{"$f":"IF(F91=Data[[#This Row],[Up]],0,1)","v":1},{"$f":"SUM($G$26:G92)","v":37},36,null,null,67,{"$f":"INDEX(Data[Date],MATCH(Transform_Data[[#This Row],[Unique Index]],Data[Index],0))","v":"2022-06-24"},{"$f":"MAX( IF(Transform_Data[[#This Row],[Unique Index]]=Data[Index],Data[Adj Close]),\n               IF(Transform_Data[[#This Row],[Unique Index]]=Data[Lag Index],Data[Adj Close]))","v":266.382294},{"$f":"MIN(IF(Transform_Data[[#This Row],[Unique Index]]=Data[Index],Data[Adj Close]),\n             IF(Transform_Data[[#This Row],[Unique Index]]=Data[Lag Index],Data[Adj Close]))","v":255.21751399999999}]
[null,null,null,"2022-04-08",294.82150300000001,{"$f":"IF(Data[[#This Row],[Adj Close]]<E94,TRUE,\"\")","v":""},{"$f":"IF(F92=Data[[#This Row],[Up]],0,1)","v":0},{"$f":"SUM($G$26:G93)","v":37},37,null,null,68,{"$f":"INDEX(Data[Date],MATCH(Transform_Data[[#This Row],[Unique Index]],Data[Index],0))","v":"2022-06-28"},{"$f":"MAX( IF(Transform_Data[[#This Row],[Unique Index]]=Data[Index],Data[Adj Close]),\n               IF(Transform_Data[[#This Row],[Unique Index]]=Data[Lag Index],Data[Adj Close]))","v":258.97891199999998},{"$f":"MIN(IF(Transform_Data[[#This Row],[Unique Index]]=Data[Index],Data[Adj Close]),\n             IF(Transform_Data[[#This Row],[Unique Index]]=Data[Lag Index],Data[Adj Close]))","v":255.21751399999999}]
[null,null,null,"2022-04-11",283.19628899999998,{"$f":"IF(Data[[#This Row],[Adj Close]]<E95,TRUE,\"\")","v":""},{"$f":"IF(F93=Data[[#This Row],[Up]],0,1)","v":0},{"$f":"SUM($G$26:G94)","v":37},37,null,null,69,{"$f":"INDEX(Data[Date],MATCH(Transform_Data[[#This Row],[Unique Index]],Data[Index],0))","v":"2022-06-29"},{"$f":"MAX( IF(Transform_Data[[#This Row],[Unique Index]]=Data[Index],Data[Adj Close]),\n               IF(Transform_Data[[#This Row],[Unique Index]]=Data[Lag Index],Data[Adj Close]))","v":258.97891199999998},{"$f":"MIN(IF(Transform_Data[[#This Row],[Unique Index]]=Data[Index],Data[Adj Close]),\n             IF(Transform_Data[[#This Row],[Unique Index]]=Data[Lag Index],Data[Adj Close]))","v":255.56578099999999}]
[null,null,null,"2022-04-12",280.019409,{"$f":"IF(Data[[#This Row],[Adj Close]]<E96,TRUE,\"\")","v":true},{"$f":"IF(F94=Data[[#This Row],[Up]],0,1)","v":1},{"$f":"SUM($G$26:G95)","v":38},37,null,null,70,{"$f":"INDEX(Data[Date],MATCH(Transform_Data[[#This Row],[Unique Index]],Data[Index],0))","v":"2022-06-30"},{"$f":"MAX( IF(Transform_Data[[#This Row],[Unique Index]]=Data[Index],Data[Adj Close]),\n               IF(Transform_Data[[#This Row],[Unique Index]]=Data[Lag Index],Data[Adj Close]))","v":267.07882699999999},{"$f":"MIN(IF(Transform_Data[[#This Row],[Unique Index]]=Data[Index],Data[Adj Close]),\n             IF(Transform_Data[[#This Row],[Unique Index]]=Data[Lag Index],Data[Adj Close]))","v":255.56578099999999}]
[null,null,null,"2022-04-13",285.539154,{"$f":"IF(Data[[#This Row],[Adj Close]]<E97,TRUE,\"\")","v":""},{"$f":"IF(F95=Data[[#This Row],[Up]],0,1)","v":1},{"$f":"SUM($G$26:G96)","v":39},38,null,null,71,{"$f":"INDEX(Data[Date],MATCH(Transform_Data[[#This Row],[Unique Index]],Data[Index],0))","v":"2022-07-07"},{"$f":"MAX( IF(Transform_Data[[#This Row],[Unique Index]]=Data[Index],Data[Adj Close]),\n               IF(Transform_Data[[#This Row],[Unique Index]]=Data[Lag Index],Data[Adj Close]))","v":267.07882699999999},{"$f":"MIN(IF(Transform_Data[[#This Row],[Unique Index]]=Data[Index],Data[Adj Close]),\n             IF(Transform_Data[[#This Row],[Unique Index]]=Data[Lag Index],Data[Adj Close]))","v":251.47601299999999}]
[null,null,null,"2022-04-14",277.805542,{"$f":"IF(Data[[#This Row],[Adj Close]]<E98,TRUE,\"\")","v":true},{"$f":"IF(F96=Data[[#This Row],[Up]],0,1)","v":1},{"$f":"SUM($G$26:G97)","v":40},39,null,null,72,{"$f":"INDEX(Data[Date],MATCH(Transform_Data[[#This Row],[Unique Index]],Data[Index],0))","v":"2022-07-13"},{"$f":"MAX( IF(Transform_Data[[#This Row],[Unique Index]]=Data[Index],Data[Adj Close]),\n               IF(Transform_Data[[#This Row],[Unique Index]]=Data[Lag Index],Data[Adj Close]))","v":255.45631399999999},{"$f":"MIN(IF(Transform_Data[[#This Row],[Unique Index]]=Data[Index],Data[Adj Close]),\n             IF(Transform_Data[[#This Row],[Unique Index]]=Data[Lag Index],Data[Adj Close]))","v":251.47601299999999}]
[null,null,null,"2022-04-18",278.49054000000001,{"$f":"IF(Data[[#This Row],[Adj Close]]<E99,TRUE,\"\")","v":true},{"$f":"IF(F97=Data[[#This Row],[Up]],0,1)","v":0},{"$f":"SUM($G$26:G98)","v":40},40,null,null,73,{"$f":"INDEX(Data[Date],MATCH(Transform_Data[[#This Row],[Unique Index]],Data[Index],0))","v":"2022-07-15"},{"$f":"MAX( IF(Transform_Data[[#This Row],[Unique Index]]=Data[Index],Data[Adj Close]),\n               IF(Transform_Data[[#This Row],[Unique Index]]=Data[Lag Index],Data[Adj Close]))","v":255.45631399999999},{"$f":"MIN(IF(Transform_Data[[#This Row],[Unique Index]]=Data[Index],Data[Adj Close]),\n             IF(Transform_Data[[#This Row],[Unique Index]]=Data[Lag Index],Data[Adj Close]))","v":252.99847399999999}]
[null,null,null,"2022-04-19",283.23596199999997,{"$f":"IF(Data[[#This Row],[Adj Close]]<E100,TRUE,\"\")","v":true},{"$f":"IF(F98=Data[[#This Row],[Up]],0,1)","v":0},{"$f":"SUM($G$26:G99)","v":40},40,null,null,74,{"$f":"INDEX(Data[Date],MATCH(Transform_Data[[#This Row],[Unique Index]],Data[Index],0))","v":"2022-07-18"},{"$f":"MAX( IF(Transform_Data[[#This Row],[Unique Index]]=Data[Index],Data[Adj Close]),\n               IF(Transform_Data[[#This Row],[Unique Index]]=Data[Lag Index],Data[Adj Close]))","v":263.53634599999998},{"$f":"MIN(IF(Transform_Data[[#This Row],[Unique Index]]=Data[Index],Data[Adj Close]),\n             IF(Transform_Data[[#This Row],[Unique Index]]=Data[Lag Index],Data[Adj Close]))","v":252.99847399999999}]
[null,null,null,"2022-04-20",284.28826900000001,{"$f":"IF(Data[[#This Row],[Adj Close]]<E101,TRUE,\"\")","v":""},{"$f":"IF(F99=Data[[#This Row],[Up]],0,1)","v":1},{"$f":"SUM($G$26:G100)","v":41},40,null,null,75,{"$f":"INDEX(Data[Date],MATCH(Transform_Data[[#This Row],[Unique Index]],Data[Index],0))","v":"2022-07-21"},{"$f":"MAX( IF(Transform_Data[[#This Row],[Unique Index]]=Data[Index],Data[Adj Close]),\n               IF(Transform_Data[[#This Row],[Unique Index]]=Data[Lag Index],Data[Adj Close]))","v":263.53634599999998},{"$f":"MIN(IF(Transform_Data[[#This Row],[Unique Index]]=Data[Index],Data[Adj Close]),\n             IF(Transform_Data[[#This Row],[Unique Index]]=Data[Lag Index],Data[Adj Close]))","v":250.660034}]
[null,null,null,"2022-04-21",278.778412,{"$f":"IF(Data[[#This Row],[Adj Close]]<E102,TRUE,\"\")","v":""},{"$f":"IF(F100=Data[[#This Row],[Up]],0,1)","v":0},{"$f":"SUM($G$26:G101)","v":41},41,null,null,76,{"$f":"INDEX(Data[Date],MATCH(Transform_Data[[#This Row],[Unique Index]],Data[Index],0))","v":"2022-07-26"},{"$f":"MAX( IF(Transform_Data[[#This Row],[Unique Index]]=Data[Index],Data[Adj Close]),\n               IF(Transform_Data[[#This Row],[Unique Index]]=Data[Lag Index],Data[Adj Close]))","v":279.358093},{"$f":"MIN(IF(Transform_Data[[#This Row],[Unique Index]]=Data[Index],Data[Adj Close]),\n             IF(Transform_Data[[#This Row],[Unique Index]]=Data[Lag Index],Data[Adj Close]))","v":250.660034}]
[null,null,null,"2022-04-22",272.04748499999999,{"$f":"IF(Data[[#This Row],[Adj Close]]<E103,TRUE,\"\")","v":true},{"$f":"IF(F101=Data[[#This Row],[Up]],0,1)","v":1},{"$f":"SUM($G$26:G102)","v":42},41,null,null,77,{"$f":"INDEX(Data[Date],MATCH(Transform_Data[[#This Row],[Unique Index]],Data[Index],0))","v":"2022-07-29"},{"$f":"MAX( IF(Transform_Data[[#This Row],[Unique Index]]=Data[Index],Data[Adj Close]),\n               IF(Transform_Data[[#This Row],[Unique Index]]=Data[Lag Index],Data[Adj Close]))","v":279.358093},{"$f":"MIN(IF(Transform_Data[[#This Row],[Unique Index]]=Data[Index],Data[Adj Close]),\n             IF(Transform_Data[[#This Row],[Unique Index]]=Data[Lag Index],Data[Adj Close]))","v":273.46722399999999}]
[null,null,null,"2022-04-25",278.68908699999997,{"$f":"IF(Data[[#This Row],[Adj Close]]<E104,TRUE,\"\")","v":""},{"$f":"IF(F102=Data[[#This Row],[Up]],0,1)","v":1},{"$f":"SUM($G$26:G103)","v":43},42,null,null,78,{"$f":"INDEX(Data[Date],MATCH(Transform_Data[[#This Row],[Unique Index]],Data[Index],0))","v":"2022-08-02"},{"$f":"MAX( IF(Transform_Data[[#This Row],[Unique Index]]=Data[Index],Data[Adj Close]),\n               IF(Transform_Data[[#This Row],[Unique Index]]=Data[Lag Index],Data[Adj Close]))","v":282.25375400000001},{"$f":"MIN(IF(Transform_Data[[#This Row],[Unique Index]]=Data[Index],Data[Adj Close]),\n             IF(Transform_Data[[#This Row],[Unique Index]]=Data[Lag Index],Data[Adj Close]))","v":273.46722399999999}]
[null,null,null,"2022-04-26",268.26507600000002,{"$f":"IF(Data[[#This Row],[Adj Close]]<E105,TRUE,\"\")","v":true},{"$f":"IF(F103=Data[[#This Row],[Up]],0,1)","v":1},{"$f":"SUM($G$26:G104)","v":44},43,null,null,79,{"$f":"INDEX(Data[Date],MATCH(Transform_Data[[#This Row],[Unique Index]],Data[Index],0))","v":"2022-08-04"},{"$f":"MAX( IF(Transform_Data[[#This Row],[Unique Index]]=Data[Index],Data[Adj Close]),\n               IF(Transform_Data[[#This Row],[Unique Index]]=Data[Lag Index],Data[Adj Close]))","v":282.25375400000001},{"$f":"MIN(IF(Transform_Data[[#This Row],[Unique Index]]=Data[Index],Data[Adj Close]),\n             IF(Transform_Data[[#This Row],[Unique Index]]=Data[Lag Index],Data[Adj Close]))","v":278.940155}]
[null,null,null,"2022-04-27",281.171021,{"$f":"IF(Data[[#This Row],[Adj Close]]<E106,TRUE,\"\")","v":true},{"$f":"IF(F104=Data[[#This Row],[Up]],0,1)","v":0},{"$f":"SUM($G$26:G105)","v":44},44,null,null,80,{"$f":"INDEX(Data[Date],MATCH(Transform_Data[[#This Row],[Unique Index]],Data[Index],0))","v":"2022-08-08"},{"$f":"MAX( IF(Transform_Data[[#This Row],[Unique Index]]=Data[Index],Data[Adj Close]),\n               IF(Transform_Data[[#This Row],[Unique Index]]=Data[Lag Index],Data[Adj Close]))","v":287.73663299999998},{"$f":"MIN(IF(Transform_Data[[#This Row],[Unique Index]]=Data[Index],Data[Adj Close]),\n             IF(Transform_Data[[#This Row],[Unique Index]]=Data[Lag Index],Data[Adj Close]))","v":278.940155}]
[null,null,null,"2022-04-28",287.53463699999998,{"$f":"IF(Data[[#This Row],[Adj Close]]<E107,TRUE,\"\")","v":""},{"$f":"IF(F105=Data[[#This Row],[Up]],0,1)","v":1},{"$f":"SUM($G$26:G106)","v":45},44,null,null,81,{"$f":"INDEX(Data[Date],MATCH(Transform_Data[[#This Row],[Unique Index]],Data[Index],0))","v":"2022-08-10"},{"$f":"MAX( IF(Transform_Data[[#This Row],[Unique Index]]=Data[Index],Data[Adj Close]),\n               IF(Transform_Data[[#This Row],[Unique Index]]=Data[Lag Index],Data[Adj Close]))","v":287.73663299999998},{"$f":"MIN(IF(Transform_Data[[#This Row],[Unique Index]]=Data[Index],Data[Adj Close]),\n             IF(Transform_Data[[#This Row],[Unique Index]]=Data[Lag Index],Data[Adj Close]))","v":285.607147}]
[null,null,null,"2022-04-29",275.51220699999999,{"$f":"IF(Data[[#This Row],[Adj Close]]<E108,TRUE,\"\")","v":true},{"$f":"IF(F106=Data[[#This Row],[Up]],0,1)","v":1},{"$f":"SUM($G$26:G107)","v":46},45,null,null,82,{"$f":"INDEX(Data[Date],MATCH(Transform_Data[[#This Row],[Unique Index]],Data[Index],0))","v":"2022-08-11"},{"$f":"MAX( IF(Transform_Data[[#This Row],[Unique Index]]=Data[Index],Data[Adj Close]),\n               IF(Transform_Data[[#This Row],[Unique Index]]=Data[Lag Index],Data[Adj Close]))","v":292.02545199999997},{"$f":"MIN(IF(Transform_Data[[#This Row],[Unique Index]]=Data[Index],Data[Adj Close]),\n             IF(Transform_Data[[#This Row],[Unique Index]]=Data[Lag Index],Data[Adj Close]))","v":285.607147}]
[null,null,null,"2022-05-02",282.41195699999997,{"$f":"IF(Data[[#This Row],[Adj Close]]<E109,TRUE,\"\")","v":""},{"$f":"IF(F107=Data[[#This Row],[Up]],0,1)","v":1},{"$f":"SUM($G$26:G108)","v":47},46,null,null,83,{"$f":"INDEX(Data[Date],MATCH(Transform_Data[[#This Row],[Unique Index]],Data[Index],0))","v":"2022-08-15"},{"$f":"MAX( IF(Transform_Data[[#This Row],[Unique Index]]=Data[Index],Data[Adj Close]),\n               IF(Transform_Data[[#This Row],[Unique Index]]=Data[Lag Index],Data[Adj Close]))","v":292.02545199999997},{"$f":"MIN(IF(Transform_Data[[#This Row],[Unique Index]]=Data[Index],Data[Adj Close]),\n             IF(Transform_Data[[#This Row],[Unique Index]]=Data[Lag Index],Data[Adj Close]))","v":275.01498400000003}]
[null,null,null,"2022-05-03",279.74142499999999,{"$f":"IF(Data[[#This Row],[Adj Close]]<E110,TRUE,\"\")","v":true},{"$f":"IF(F108=Data[[#This Row],[Up]],0,1)","v":1},{"$f":"SUM($G$26:G109)","v":48},47,null,null,84,{"$f":"INDEX(Data[Date],MATCH(Transform_Data[[#This Row],[Unique Index]],Data[Index],0))","v":"2022-08-24"},{"$f":"MAX( IF(Transform_Data[[#This Row],[Unique Index]]=Data[Index],Data[Adj Close]),\n               IF(Transform_Data[[#This Row],[Unique Index]]=Data[Lag Index],Data[Adj Close]))","v":278.06637599999999},{"$f":"MIN(IF(Transform_Data[[#This Row],[Unique Index]]=Data[Index],Data[Adj Close]),\n             IF(Transform_Data[[#This Row],[Unique Index]]=Data[Lag Index],Data[Adj Close]))","v":275.01498400000003}]
[null,null,null,"2022-05-04",287.88211100000001,{"$f":"IF(Data[[#This Row],[Adj Close]]<E111,TRUE,\"\")","v":""},{"$f":"IF(F109=Data[[#This Row],[Up]],0,1)","v":1},{"$f":"SUM($G$26:G110)","v":49},48,null,null,85,{"$f":"INDEX(Data[Date],MATCH(Transform_Data[[#This Row],[Unique Index]],Data[Index],0))","v":"2022-08-25"},{"$f":"MAX( IF(Transform_Data[[#This Row],[Unique Index]]=Data[Index],Data[Adj Close]),\n               IF(Transform_Data[[#This Row],[Unique Index]]=Data[Lag Index],Data[Adj Close]))","v":278.06637599999999},{"$f":"MIN(IF(Transform_Data[[#This Row],[Unique Index]]=Data[Index],Data[Adj Close]),\n             IF(Transform_Data[[#This Row],[Unique Index]]=Data[Lag Index],Data[Adj Close]))","v":252.53829999999999}]
[null,null,null,"2022-05-05",275.34347500000001,{"$f":"IF(Data[[#This Row],[Adj Close]]<E112,TRUE,\"\")","v":""},{"$f":"IF(F110=Data[[#This Row],[Up]],0,1)","v":0},{"$f":"SUM($G$26:G111)","v":49},49,null,null,86,{"$f":"INDEX(Data[Date],MATCH(Transform_Data[[#This Row],[Unique Index]],Data[Index],0))","v":"2022-09-06"},{"$f":"MAX( IF(Transform_Data[[#This Row],[Unique Index]]=Data[Index],Data[Adj Close]),\n               IF(Transform_Data[[#This Row],[Unique Index]]=Data[Lag Index],Data[Adj Close]))","v":265.90063500000002},{"$f":"MIN(IF(Transform_Data[[#This Row],[Unique Index]]=Data[Index],Data[Adj Close]),\n             IF(Transform_Data[[#This Row],[Unique Index]]=Data[Lag Index],Data[Adj Close]))","v":252.53829999999999}]
[null,null,null,"2022-05-06",272.74243200000001,{"$f":"IF(Data[[#This Row],[Adj Close]]<E113,TRUE,\"\")","v":""},{"$f":"IF(F111=Data[[#This Row],[Up]],0,1)","v":0},{"$f":"SUM($G$26:G112)","v":49},49,null,null,87,{"$f":"INDEX(Data[Date],MATCH(Transform_Data[[#This Row],[Unique Index]],Data[Index],0))","v":"2022-09-12"},{"$f":"MAX( IF(Transform_Data[[#This Row],[Unique Index]]=Data[Index],Data[Adj Close]),\n               IF(Transform_Data[[#This Row],[Unique Index]]=Data[Lag Index],Data[Adj Close]))","v":265.90063500000002},{"$f":"MIN(IF(Transform_Data[[#This Row],[Unique Index]]=Data[Index],Data[Adj Close]),\n             IF(Transform_Data[[#This Row],[Unique Index]]=Data[Lag Index],Data[Adj Close]))","v":251.28185999999999}]
[null,null,null,"2022-05-09",262.665863,{"$f":"IF(Data[[#This Row],[Adj Close]]<E114,TRUE,\"\")","v":true},{"$f":"IF(F112=Data[[#This Row],[Up]],0,1)","v":1},{"$f":"SUM($G$26:G113)","v":50},49,null,null,88,{"$f":"INDEX(Data[Date],MATCH(Transform_Data[[#This Row],[Unique Index]],Data[Index],0))","v":"2022-09-13"},{"$f":"MAX( IF(Transform_Data[[#This Row],[Unique Index]]=Data[Index],Data[Adj Close]),\n               IF(Transform_Data[[#This Row],[Unique Index]]=Data[Lag Index],Data[Adj Close]))","v":251.5112},{"$f":"MIN(IF(Transform_Data[[#This Row],[Unique Index]]=Data[Index],Data[Adj Close]),\n             IF(Transform_Data[[#This Row],[Unique Index]]=Data[Lag Index],Data[Adj Close]))","v":251.28185999999999}]
[null,null,null,"2022-05-10",267.55026199999998,{"$f":"IF(Data[[#This Row],[Adj Close]]<E115,TRUE,\"\")","v":""},{"$f":"IF(F113=Data[[#This Row],[Up]],0,1)","v":1},{"$f":"SUM($G$26:G114)","v":51},50,null,null,89,{"$f":"INDEX(Data[Date],MATCH(Transform_Data[[#This Row],[Unique Index]],Data[Index],0))","v":"2022-09-14"},{"$f":"MAX( IF(Transform_Data[[#This Row],[Unique Index]]=Data[Index],Data[Adj Close]),\n               IF(Transform_Data[[#This Row],[Unique Index]]=Data[Lag Index],Data[Adj Close]))","v":251.5112},{"$f":"MIN(IF(Transform_Data[[#This Row],[Unique Index]]=Data[Index],Data[Adj Close]),\n             IF(Transform_Data[[#This Row],[Unique Index]]=Data[Lag Index],Data[Adj Close]))","v":238.27848800000001}]
[null,null,null,"2022-05-11",258.665009,{"$f":"IF(Data[[#This Row],[Adj Close]]<E116,TRUE,\"\")","v":""},{"$f":"IF(F114=Data[[#This Row],[Up]],0,1)","v":0},{"$f":"SUM($G$26:G115)","v":51},51,null,null,90,{"$f":"INDEX(Data[Date],MATCH(Transform_Data[[#This Row],[Unique Index]],Data[Index],0))","v":"2022-09-21"},{"$f":"MAX( IF(Transform_Data[[#This Row],[Unique Index]]=Data[Index],Data[Adj Close]),\n               IF(Transform_Data[[#This Row],[Unique Index]]=Data[Lag Index],Data[Adj Close]))","v":240.30278000000001},{"$f":"MIN(IF(Transform_Data[[#This Row],[Unique Index]]=Data[Index],Data[Adj Close]),\n             IF(Transform_Data[[#This Row],[Unique Index]]=Data[Lag Index],Data[Adj Close]))","v":238.27848800000001}]
[null,null,null,"2022-05-12",253.50264000000001,{"$f":"IF(Data[[#This Row],[Adj Close]]<E117,TRUE,\"\")","v":true},{"$f":"IF(F115=Data[[#This Row],[Up]],0,1)","v":1},{"$f":"SUM($G$26:G116)","v":52},51,null,null,91,{"$f":"INDEX(Data[Date],MATCH(Transform_Data[[#This Row],[Unique Index]],Data[Index],0))","v":"2022-09-22"},{"$f":"MAX( IF(Transform_Data[[#This Row],[Unique Index]]=Data[Index],Data[Adj Close]),\n               IF(Transform_Data[[#This Row],[Unique Index]]=Data[Lag Index],Data[Adj Close]))","v":240.30278000000001},{"$f":"MIN(IF(Transform_Data[[#This Row],[Unique Index]]=Data[Index],Data[Adj Close]),\n             IF(Transform_Data[[#This Row],[Unique Index]]=Data[Lag Index],Data[Adj Close]))","v":235.74563599999999}]
[null,null,null,"2022-05-13",259.23092700000001,{"$f":"IF(Data[[#This Row],[Adj Close]]<E118,TRUE,\"\")","v":true},{"$f":"IF(F116=Data[[#This Row],[Up]],0,1)","v":0},{"$f":"SUM($G$26:G117)","v":52},52,null,null,92,{"$f":"INDEX(Data[Date],MATCH(Transform_Data[[#This Row],[Unique Index]],Data[Index],0))","v":"2022-09-27"},{"$f":"MAX( IF(Transform_Data[[#This Row],[Unique Index]]=Data[Index],Data[Adj Close]),\n               IF(Transform_Data[[#This Row],[Unique Index]]=Data[Lag Index],Data[Adj Close]))","v":240.39254800000001},{"$f":"MIN(IF(Transform_Data[[#This Row],[Unique Index]]=Data[Index],Data[Adj Close]),\n             IF(Transform_Data[[#This Row],[Unique Index]]=Data[Lag Index],Data[Adj Close]))","v":235.74563599999999}]
[null,null,null,"2022-05-16",259.60815400000001,{"$f":"IF(Data[[#This Row],[Adj Close]]<E119,TRUE,\"\")","v":true},{"$f":"IF(F117=Data[[#This Row],[Up]],0,1)","v":0},{"$f":"SUM($G$26:G118)","v":52},52,null,null,93,{"$f":"INDEX(Data[Date],MATCH(Transform_Data[[#This Row],[Unique Index]],Data[Index],0))","v":"2022-09-28"},{"$f":"MAX( IF(Transform_Data[[#This Row],[Unique Index]]=Data[Index],Data[Adj Close]),\n               IF(Transform_Data[[#This Row],[Unique Index]]=Data[Lag Index],Data[Adj Close]))","v":240.39254800000001},{"$f":"MIN(IF(Transform_Data[[#This Row],[Unique Index]]=Data[Index],Data[Adj Close]),\n             IF(Transform_Data[[#This Row],[Unique Index]]=Data[Lag Index],Data[Adj Close]))","v":232.24548300000001}]
[null,null,null,"2022-05-17",264.889679,{"$f":"IF(Data[[#This Row],[Adj Close]]<E120,TRUE,\"\")","v":""},{"$f":"IF(F118=Data[[#This Row],[Up]],0,1)","v":1},{"$f":"SUM($G$26:G119)","v":53},52,null,null,94,{"$f":"INDEX(Data[Date],MATCH(Transform_Data[[#This Row],[Unique Index]],Data[Index],0))","v":"2022-09-30"},{"$f":"MAX( IF(Transform_Data[[#This Row],[Unique Index]]=Data[Index],Data[Adj Close]),\n               IF(Transform_Data[[#This Row],[Unique Index]]=Data[Lag Index],Data[Adj Close]))","v":248.49968000000001},{"$f":"MIN(IF(Transform_Data[[#This Row],[Unique Index]]=Data[Index],Data[Adj Close]),\n             IF(Transform_Data[[#This Row],[Unique Index]]=Data[Lag Index],Data[Adj Close]))","v":232.24548300000001}]
[null,null,null,"2022-05-18",252.82933,{"$f":"IF(Data[[#This Row],[Adj Close]]<E121,TRUE,\"\")","v":""},{"$f":"IF(F119=Data[[#This Row],[Up]],0,1)","v":0},{"$f":"SUM($G$26:G120)","v":53},53,null,null,95,{"$f":"INDEX(Data[Date],MATCH(Transform_Data[[#This Row],[Unique Index]],Data[Index],0))","v":"2022-10-05"},{"$f":"MAX( IF(Transform_Data[[#This Row],[Unique Index]]=Data[Index],Data[Adj Close]),\n               IF(Transform_Data[[#This Row],[Unique Index]]=Data[Lag Index],Data[Adj Close]))","v":248.49968000000001},{"$f":"MIN(IF(Transform_Data[[#This Row],[Unique Index]]=Data[Index],Data[Adj Close]),\n             IF(Transform_Data[[#This Row],[Unique Index]]=Data[Lag Index],Data[Adj Close]))","v":224.77654999999999}]
[null,null,null,"2022-05-19",251.89395099999999,{"$f":"IF(Data[[#This Row],[Adj Close]]<E122,TRUE,\"\")","v":""},{"$f":"IF(F120=Data[[#This Row],[Up]],0,1)","v":0},{"$f":"SUM($G$26:G121)","v":53},53,null,null,96,{"$f":"INDEX(Data[Date],MATCH(Transform_Data[[#This Row],[Unique Index]],Data[Index],0))","v":"2022-10-11"},{"$f":"MAX( IF(Transform_Data[[#This Row],[Unique Index]]=Data[Index],Data[Adj Close]),\n               IF(Transform_Data[[#This Row],[Unique Index]]=Data[Lag Index],Data[Adj Close]))","v":233.58174099999999},{"$f":"MIN(IF(Transform_Data[[#This Row],[Unique Index]]=Data[Index],Data[Adj Close]),\n             IF(Transform_Data[[#This Row],[Unique Index]]=Data[Lag Index],Data[Adj Close]))","v":224.77654999999999}]
[null,null,null,"2022-05-20",251.31680299999999,{"$f":"IF(Data[[#This Row],[Adj Close]]<E123,TRUE,\"\")","v":true},{"$f":"IF(F121=Data[[#This Row],[Up]],0,1)","v":1},{"$f":"SUM($G$26:G122)","v":54},53,null,null,{"$f":"N(L121)+1","v":97},{"$f":"INDEX(Data[Date],MATCH(Transform_Data[[#This Row],[Unique Index]],Data[Index],0))","v":"2022-10-13"},{"$f":"MAX( IF(Transform_Data[[#This Row],[Unique Index]]=Data[Index],Data[Adj Close]),\n               IF(Transform_Data[[#This Row],[Unique Index]]=Data[Lag Index],Data[Adj Close]))","v":233.58174099999999},{"$f":"MIN(IF(Transform_Data[[#This Row],[Unique Index]]=Data[Index],Data[Adj Close]),\n             IF(Transform_Data[[#This Row],[Unique Index]]=Data[Lag Index],Data[Adj Close]))","v":227.91769400000001}]
[null,null,null,"2022-05-23",259.36697400000003,{"$f":"IF(Data[[#This Row],[Adj Close]]<E124,TRUE,\"\")","v":""},{"$f":"IF(F122=Data[[#This Row],[Up]],0,1)","v":1},{"$f":"SUM($G$26:G123)","v":55},54,null,null,98,{"$f":"INDEX(Data[Date],MATCH(Transform_Data[[#This Row],[Unique Index]],Data[Index],0))","v":"2022-10-14"},{"$f":"MAX( IF(Transform_Data[[#This Row],[Unique Index]]=Data[Index],Data[Adj Close]),\n               IF(Transform_Data[[#This Row],[Unique Index]]=Data[Lag Index],Data[Adj Close]))","v":237.829758},{"$f":"MIN(IF(Transform_Data[[#This Row],[Unique Index]]=Data[Index],Data[Adj Close]),\n             IF(Transform_Data[[#This Row],[Unique Index]]=Data[Lag Index],Data[Adj Close]))","v":227.91769400000001}]
[null,null,null,"2022-05-24",258.34204099999999,{"$f":"IF(Data[[#This Row],[Adj Close]]<E125,TRUE,\"\")","v":true},{"$f":"IF(F123=Data[[#This Row],[Up]],0,1)","v":1},{"$f":"SUM($G$26:G124)","v":56},55,null,null,99,{"$f":"INDEX(Data[Date],MATCH(Transform_Data[[#This Row],[Unique Index]],Data[Index],0))","v":"2022-10-18"},{"$f":"MAX( IF(Transform_Data[[#This Row],[Unique Index]]=Data[Index],Data[Adj Close]),\n               IF(Transform_Data[[#This Row],[Unique Index]]=Data[Lag Index],Data[Adj Close]))","v":237.829758},{"$f":"MIN(IF(Transform_Data[[#This Row],[Unique Index]]=Data[Index],Data[Adj Close]),\n             IF(Transform_Data[[#This Row],[Unique Index]]=Data[Lag Index],Data[Adj Close]))","v":235.48635899999999}]
[null,null,null,"2022-05-25",261.22778299999999,{"$f":"IF(Data[[#This Row],[Adj Close]]<E126,TRUE,\"\")","v":true},{"$f":"IF(F124=Data[[#This Row],[Up]],0,1)","v":0},{"$f":"SUM($G$26:G125)","v":56},56,null,null,100,{"$f":"INDEX(Data[Date],MATCH(Transform_Data[[#This Row],[Unique Index]],Data[Index],0))","v":"2022-10-20"},{"$f":"MAX( IF(Transform_Data[[#This Row],[Unique Index]]=Data[Index],Data[Adj Close]),\n               IF(Transform_Data[[#This Row],[Unique Index]]=Data[Lag Index],Data[Adj Close]))","v":249.95558199999999},{"$f":"MIN(IF(Transform_Data[[#This Row],[Unique Index]]=Data[Index],Data[Adj Close]),\n             IF(Transform_Data[[#This Row],[Unique Index]]=Data[Lag Index],Data[Adj Close]))","v":235.48635899999999}]
[null,null,null,"2022-05-26",264.59112499999998,{"$f":"IF(Data[[#This Row],[Adj Close]]<E127,TRUE,\"\")","v":true},{"$f":"IF(F125=Data[[#This Row],[Up]],0,1)","v":0},{"$f":"SUM($G$26:G126)","v":56},56,null,null,101,{"$f":"INDEX(Data[Date],MATCH(Transform_Data[[#This Row],[Unique Index]],Data[Index],0))","v":"2022-10-25"},{"$f":"MAX( IF(Transform_Data[[#This Row],[Unique Index]]=Data[Index],Data[Adj Close]),\n               IF(Transform_Data[[#This Row],[Unique Index]]=Data[Lag Index],Data[Adj Close]))","v":249.95558199999999},{"$f":"MIN(IF(Transform_Data[[#This Row],[Unique Index]]=Data[Index],Data[Adj Close]),\n             IF(Transform_Data[[#This Row],[Unique Index]]=Data[Lag Index],Data[Adj Close]))","v":226.11277799999999}]
[null,null,null,"2022-05-27",271.89498900000001,{"$f":"IF(Data[[#This Row],[Adj Close]]<E128,TRUE,\"\")","v":""},{"$f":"IF(F126=Data[[#This Row],[Up]],0,1)","v":1},{"$f":"SUM($G$26:G127)","v":57},56,null,null,102,{"$f":"INDEX(Data[Date],MATCH(Transform_Data[[#This Row],[Unique Index]],Data[Index],0))","v":"2022-10-27"},{"$f":"MAX( IF(Transform_Data[[#This Row],[Unique Index]]=Data[Index],Data[Adj Close]),\n               IF(Transform_Data[[#This Row],[Unique Index]]=Data[Lag Index],Data[Adj Close]))","v":235.20713799999999},{"$f":"MIN(IF(Transform_Data[[#This Row],[Unique Index]]=Data[Index],Data[Adj Close]),\n             IF(Transform_Data[[#This Row],[Unique Index]]=Data[Lag Index],Data[Adj Close]))","v":226.11277799999999}]
[null,null,null,"2022-05-31",270.531769,{"$f":"IF(Data[[#This Row],[Adj Close]]<E129,TRUE,\"\")","v":true},{"$f":"IF(F127=Data[[#This Row],[Up]],0,1)","v":1},{"$f":"SUM($G$26:G128)","v":58},57,null,null,103,{"$f":"INDEX(Data[Date],MATCH(Transform_Data[[#This Row],[Unique Index]],Data[Index],0))","v":"2022-10-28"},{"$f":"MAX( IF(Transform_Data[[#This Row],[Unique Index]]=Data[Index],Data[Adj Close]),\n               IF(Transform_Data[[#This Row],[Unique Index]]=Data[Lag Index],Data[Adj Close]))","v":235.20713799999999},{"$f":"MIN(IF(Transform_Data[[#This Row],[Unique Index]]=Data[Index],Data[Adj Close]),\n             IF(Transform_Data[[#This Row],[Unique Index]]=Data[Lag Index],Data[Adj Close]))","v":213.64790300000001}]
[null,null,null,"2022-06-01",271.07904100000002,{"$f":"IF(Data[[#This Row],[Adj Close]]<E130,TRUE,\"\")","v":true},{"$f":"IF(F128=Data[[#This Row],[Up]],0,1)","v":0},{"$f":"SUM($G$26:G129)","v":58},58,null,null,104,{"$f":"INDEX(Data[Date],MATCH(Transform_Data[[#This Row],[Unique Index]],Data[Index],0))","v":"2022-11-03"},{"$f":"MAX( IF(Transform_Data[[#This Row],[Unique Index]]=Data[Index],Data[Adj Close]),\n               IF(Transform_Data[[#This Row],[Unique Index]]=Data[Lag Index],Data[Adj Close]))","v":228.226822},{"$f":"MIN(IF(Transform_Data[[#This Row],[Unique Index]]=Data[Index],Data[Adj Close]),\n             IF(Transform_Data[[#This Row],[Unique Index]]=Data[Lag Index],Data[Adj Close]))","v":213.64790300000001}]
[null,null,null,"2022-06-02",273.22839399999998,{"$f":"IF(Data[[#This Row],[Adj Close]]<E131,TRUE,\"\")","v":""},{"$f":"IF(F129=Data[[#This Row],[Up]],0,1)","v":1},{"$f":"SUM($G$26:G130)","v":59},58,null,null,105,{"$f":"INDEX(Data[Date],MATCH(Transform_Data[[#This Row],[Unique Index]],Data[Index],0))","v":"2022-11-08"},{"$f":"MAX( IF(Transform_Data[[#This Row],[Unique Index]]=Data[Index],Data[Adj Close]),\n               IF(Transform_Data[[#This Row],[Unique Index]]=Data[Lag Index],Data[Adj Close]))","v":228.226822},{"$f":"MIN(IF(Transform_Data[[#This Row],[Unique Index]]=Data[Index],Data[Adj Close]),\n             IF(Transform_Data[[#This Row],[Unique Index]]=Data[Lag Index],Data[Adj Close]))","v":223.879074}]
[null,null,null,"2022-06-03",268.69085699999999,{"$f":"IF(Data[[#This Row],[Adj Close]]<E132,TRUE,\"\")","v":""},{"$f":"IF(F130=Data[[#This Row],[Up]],0,1)","v":0},{"$f":"SUM($G$26:G131)","v":59},59,null,null,106,{"$f":"INDEX(Data[Date],MATCH(Transform_Data[[#This Row],[Unique Index]],Data[Index],0))","v":"2022-11-09"},{"$f":"MAX( IF(Transform_Data[[#This Row],[Unique Index]]=Data[Index],Data[Adj Close]),\n               IF(Transform_Data[[#This Row],[Unique Index]]=Data[Lag Index],Data[Adj Close]))","v":246.415558},{"$f":"MIN(IF(Transform_Data[[#This Row],[Unique Index]]=Data[Index],Data[Adj Close]),\n             IF(Transform_Data[[#This Row],[Unique Index]]=Data[Lag Index],Data[Adj Close]))","v":223.879074}]
[null,null,null,"2022-06-06",267.42709400000001,{"$f":"IF(Data[[#This Row],[Adj Close]]<E133,TRUE,\"\")","v":true},{"$f":"IF(F131=Data[[#This Row],[Up]],0,1)","v":1},{"$f":"SUM($G$26:G132)","v":60},59,null,null,107,{"$f":"INDEX(Data[Date],MATCH(Transform_Data[[#This Row],[Unique Index]],Data[Index],0))","v":"2022-11-11"},{"$f":"MAX( IF(Transform_Data[[#This Row],[Unique Index]]=Data[Index],Data[Adj Close]),\n               IF(Transform_Data[[#This Row],[Unique Index]]=Data[Lag Index],Data[Adj Close]))","v":246.415558},{"$f":"MIN(IF(Transform_Data[[#This Row],[Unique Index]]=Data[Index],Data[Adj Close]),\n             IF(Transform_Data[[#This Row],[Unique Index]]=Data[Lag Index],Data[Adj Close]))","v":240.871185}]
[null,null,null,"2022-06-07",271.158661,{"$f":"IF(Data[[#This Row],[Adj Close]]<E134,TRUE,\"\")","v":""},{"$f":"IF(F132=Data[[#This Row],[Up]],0,1)","v":1},{"$f":"SUM($G$26:G133)","v":61},60,null,null,108,{"$f":"INDEX(Data[Date],MATCH(Transform_Data[[#This Row],[Unique Index]],Data[Index],0))","v":"2022-11-14"},{"$f":"MAX( IF(Transform_Data[[#This Row],[Unique Index]]=Data[Index],Data[Adj Close]),\n               IF(Transform_Data[[#This Row],[Unique Index]]=Data[Lag Index],Data[Adj Close]))","v":241.729996},{"$f":"MIN(IF(Transform_Data[[#This Row],[Unique Index]]=Data[Index],Data[Adj Close]),\n             IF(Transform_Data[[#This Row],[Unique Index]]=Data[Lag Index],Data[Adj Close]))","v":240.871185}]
[null,null,null,"2022-06-08",269.07894900000002,{"$f":"IF(Data[[#This Row],[Adj Close]]<E135,TRUE,\"\")","v":""},{"$f":"IF(F133=Data[[#This Row],[Up]],0,1)","v":0},{"$f":"SUM($G$26:G134)","v":61},61,null,null,109,{"$f":"INDEX(Data[Date],MATCH(Transform_Data[[#This Row],[Unique Index]],Data[Index],0))","v":"2022-11-16"},{"$f":"MAX( IF(Transform_Data[[#This Row],[Unique Index]]=Data[Index],Data[Adj Close]),\n               IF(Transform_Data[[#This Row],[Unique Index]]=Data[Lag Index],Data[Adj Close]))","v":241.729996},{"$f":"MIN(IF(Transform_Data[[#This Row],[Unique Index]]=Data[Index],Data[Adj Close]),\n             IF(Transform_Data[[#This Row],[Unique Index]]=Data[Lag Index],Data[Adj Close]))","v":241.220001}]
[null,null,null,"2022-06-09",263.48663299999998,{"$f":"IF(Data[[#This Row],[Adj Close]]<E136,TRUE,\"\")","v":""},{"$f":"IF(F134=Data[[#This Row],[Up]],0,1)","v":0},{"$f":"SUM($G$26:G135)","v":61},61,null,null,110,{"$f":"INDEX(Data[Date],MATCH(Transform_Data[[#This Row],[Unique Index]],Data[Index],0))","v":"2022-11-18"},{"$f":"MAX( IF(Transform_Data[[#This Row],[Unique Index]]=Data[Index],Data[Adj Close]),\n               IF(Transform_Data[[#This Row],[Unique Index]]=Data[Lag Index],Data[Adj Close]))","v":247.58000200000001},{"$f":"MIN(IF(Transform_Data[[#This Row],[Unique Index]]=Data[Index],Data[Adj Close]),\n             IF(Transform_Data[[#This Row],[Unique Index]]=Data[Lag Index],Data[Adj Close]))","v":241.220001}]
[null,null,null,"2022-06-10",251.74468999999999,{"$f":"IF(Data[[#This Row],[Adj Close]]<E137,TRUE,\"\")","v":""},{"$f":"IF(F135=Data[[#This Row],[Up]],0,1)","v":0},{"$f":"SUM($G$26:G136)","v":61},61,null,null,111,{"$f":"INDEX(Data[Date],MATCH(Transform_Data[[#This Row],[Unique Index]],Data[Index],0))","v":"2022-11-23"},{"$f":"MAX( IF(Transform_Data[[#This Row],[Unique Index]]=Data[Index],Data[Adj Close]),\n               IF(Transform_Data[[#This Row],[Unique Index]]=Data[Lag Index],Data[Adj Close]))","v":247.58000200000001},{"$f":"MIN(IF(Transform_Data[[#This Row],[Unique Index]]=Data[Index],Data[Adj Close]),\n             IF(Transform_Data[[#This Row],[Unique Index]]=Data[Lag Index],Data[Adj Close]))","v":240.33000200000001}]
[null,null,null,"2022-06-13",241.06750500000001,{"$f":"IF(Data[[#This Row],[Adj Close]]<E138,TRUE,\"\")","v":true},{"$f":"IF(F136=Data[[#This Row],[Up]],0,1)","v":1},{"$f":"SUM($G$26:G137)","v":62},61,null,null,112,{"$f":"INDEX(Data[Date],MATCH(Transform_Data[[#This Row],[Unique Index]],Data[Index],0))","v":"2022-11-29"},{"$f":"MAX( IF(Transform_Data[[#This Row],[Unique Index]]=Data[Index],Data[Adj Close]),\n               IF(Transform_Data[[#This Row],[Unique Index]]=Data[Lag Index],Data[Adj Close]))","v":255.13999899999999},{"$f":"MIN(IF(Transform_Data[[#This Row],[Unique Index]]=Data[Index],Data[Adj Close]),\n             IF(Transform_Data[[#This Row],[Unique Index]]=Data[Lag Index],Data[Adj Close]))","v":240.33000200000001}]
[null,null,null,"2022-06-14",243.28653,{"$f":"IF(Data[[#This Row],[Adj Close]]<E139,TRUE,\"\")","v":true},{"$f":"IF(F137=Data[[#This Row],[Up]],0,1)","v":0},{"$f":"SUM($G$26:G138)","v":62},62,null,null,113,{"$f":"INDEX(Data[Date],MATCH(Transform_Data[[#This Row],[Unique Index]],Data[Index],0))","v":"2022-11-30"},{"$f":"MAX( IF(Transform_Data[[#This Row],[Unique Index]]=Data[Index],Data[Adj Close]),\n               IF(Transform_Data[[#This Row],[Unique Index]]=Data[Lag Index],Data[Adj Close]))","v":255.13999899999999},{"$f":"MIN(IF(Transform_Data[[#This Row],[Unique Index]]=Data[Index],Data[Adj Close]),\n             IF(Transform_Data[[#This Row],[Unique Index]]=Data[Lag Index],Data[Adj Close]))","v":254.69000199999999}]
[null,null,null,"2022-06-15",250.520737,{"$f":"IF(Data[[#This Row],[Adj Close]]<E140,TRUE,\"\")","v":""},{"$f":"IF(F138=Data[[#This Row],[Up]],0,1)","v":1},{"$f":"SUM($G$26:G139)","v":63},62,null,null,114,{"$f":"INDEX(Data[Date],MATCH(Transform_Data[[#This Row],[Unique Index]],Data[Index],0))","v":"2022-12-01"},{"$f":"MAX( IF(Transform_Data[[#This Row],[Unique Index]]=Data[Index],Data[Adj Close]),\n               IF(Transform_Data[[#This Row],[Unique Index]]=Data[Lag Index],Data[Adj Close]))","v":255.020004},{"$f":"MIN(IF(Transform_Data[[#This Row],[Unique Index]]=Data[Index],Data[Adj Close]),\n             IF(Transform_Data[[#This Row],[Unique Index]]=Data[Lag Index],Data[Adj Close]))","v":254.69000199999999}]
[null,null,null,"2022-06-16",243.76416,{"$f":"IF(Data[[#This Row],[Adj Close]]<E141,TRUE,\"\")","v":true},{"$f":"IF(F139=Data[[#This Row],[Up]],0,1)","v":1},{"$f":"SUM($G$26:G140)","v":64},63,null,null,115,{"$f":"INDEX(Data[Date],MATCH(Transform_Data[[#This Row],[Unique Index]],Data[Index],0))","v":"2022-12-02"},{"$f":"MAX( IF(Transform_Data[[#This Row],[Unique Index]]=Data[Index],Data[Adj Close]),\n               IF(Transform_Data[[#This Row],[Unique Index]]=Data[Lag Index],Data[Adj Close]))","v":255.020004},{"$f":"MIN(IF(Transform_Data[[#This Row],[Unique Index]]=Data[Index],Data[Adj Close]),\n             IF(Transform_Data[[#This Row],[Unique Index]]=Data[Lag Index],Data[Adj Close]))","v":244.36999499999999}]
[null,null,null,"2022-06-17",246.430969,{"$f":"IF(Data[[#This Row],[Adj Close]]<E142,TRUE,\"\")","v":true},{"$f":"IF(F140=Data[[#This Row],[Up]],0,1)","v":0},{"$f":"SUM($G$26:G141)","v":64},64,null,null,116,{"$f":"INDEX(Data[Date],MATCH(Transform_Data[[#This Row],[Unique Index]],Data[Index],0))","v":"2022-12-07"},{"$f":"MAX( IF(Transform_Data[[#This Row],[Unique Index]]=Data[Index],Data[Adj Close]),\n               IF(Transform_Data[[#This Row],[Unique Index]]=Data[Lag Index],Data[Adj Close]))","v":247.39999399999999},{"$f":"MIN(IF(Transform_Data[[#This Row],[Unique Index]]=Data[Index],Data[Adj Close]),\n             IF(Transform_Data[[#This Row],[Unique Index]]=Data[Lag Index],Data[Adj Close]))","v":244.36999499999999}]
[null,null,null,"2022-06-21",252.49099699999999,{"$f":"IF(Data[[#This Row],[Adj Close]]<E143,TRUE,\"\")","v":""},{"$f":"IF(F141=Data[[#This Row],[Up]],0,1)","v":1},{"$f":"SUM($G$26:G142)","v":65},64,null,null,117,{"$f":"INDEX(Data[Date],MATCH(Transform_Data[[#This Row],[Unique Index]],Data[Index],0))","v":"2022-12-08"},{"$f":"MAX( IF(Transform_Data[[#This Row],[Unique Index]]=Data[Index],Data[Adj Close]),\n               IF(Transform_Data[[#This Row],[Unique Index]]=Data[Lag Index],Data[Adj Close]))","v":247.39999399999999},{"$f":"MIN(IF(Transform_Data[[#This Row],[Unique Index]]=Data[Index],Data[Adj Close]),\n             IF(Transform_Data[[#This Row],[Unique Index]]=Data[Lag Index],Data[Adj Close]))","v":245.41999799999999}]
[null,null,null,"2022-06-22",251.88400300000001,{"$f":"IF(Data[[#This Row],[Adj Close]]<E144,TRUE,\"\")","v":true},{"$f":"IF(F142=Data[[#This Row],[Up]],0,1)","v":1},{"$f":"SUM($G$26:G143)","v":66},65,null,null,118,{"$f":"INDEX(Data[Date],MATCH(Transform_Data[[#This Row],[Unique Index]],Data[Index],0))","v":"2022-12-09"},{"$f":"MAX( IF(Transform_Data[[#This Row],[Unique Index]]=Data[Index],Data[Adj Close]),\n               IF(Transform_Data[[#This Row],[Unique Index]]=Data[Lag Index],Data[Adj Close]))","v":257.22000100000002},{"$f":"MIN(IF(Transform_Data[[#This Row],[Unique Index]]=Data[Index],Data[Adj Close]),\n             IF(Transform_Data[[#This Row],[Unique Index]]=Data[Lag Index],Data[Adj Close]))","v":245.41999799999999}]
[null,null,null,"2022-06-23",257.58578499999999,{"$f":"IF(Data[[#This Row],[Adj Close]]<E145,TRUE,\"\")","v":true},{"$f":"IF(F143=Data[[#This Row],[Up]],0,1)","v":0},{"$f":"SUM($G$26:G144)","v":66},66,null,null,119,{"$f":"INDEX(Data[Date],MATCH(Transform_Data[[#This Row],[Unique Index]],Data[Index],0))","v":"2022-12-14"},{"$f":"MAX( IF(Transform_Data[[#This Row],[Unique Index]]=Data[Index],Data[Adj Close]),\n               IF(Transform_Data[[#This Row],[Unique Index]]=Data[Lag Index],Data[Adj Close]))","v":257.22000100000002},{"$f":"MIN(IF(Transform_Data[[#This Row],[Unique Index]]=Data[Index],Data[Adj Close]),\n             IF(Transform_Data[[#This Row],[Unique Index]]=Data[Lag Index],Data[Adj Close]))","v":240.449997}]
[null,null,null,"2022-06-24",266.382294,{"$f":"IF(Data[[#This Row],[Adj Close]]<E146,TRUE,\"\")","v":""},{"$f":"IF(F144=Data[[#This Row],[Up]],0,1)","v":1},{"$f":"SUM($G$26:G145)","v":67},66,null,null,120,{"$f":"INDEX(Data[Date],MATCH(Transform_Data[[#This Row],[Unique Index]],Data[Index],0))","v":"2022-12-19"},{"$f":"MAX( IF(Transform_Data[[#This Row],[Unique Index]]=Data[Index],Data[Adj Close]),\n               IF(Transform_Data[[#This Row],[Unique Index]]=Data[Lag Index],Data[Adj Close]))","v":244.429993},{"$f":"MIN(IF(Transform_Data[[#This Row],[Unique Index]]=Data[Index],Data[Adj Close]),\n             IF(Transform_Data[[#This Row],[Unique Index]]=Data[Lag Index],Data[Adj Close]))","v":240.449997}]
[null,null,null,"2022-06-27",263.58612099999999,{"$f":"IF(Data[[#This Row],[Adj Close]]<E147,TRUE,\"\")","v":""},{"$f":"IF(F145=Data[[#This Row],[Up]],0,1)","v":0},{"$f":"SUM($G$26:G146)","v":67},67,null,null,121,{"$f":"INDEX(Data[Date],MATCH(Transform_Data[[#This Row],[Unique Index]],Data[Index],0))","v":"2022-12-21"},{"$f":"MAX( IF(Transform_Data[[#This Row],[Unique Index]]=Data[Index],Data[Adj Close]),\n               IF(Transform_Data[[#This Row],[Unique Index]]=Data[Lag Index],Data[Adj Close]))","v":244.429993},{"$f":"MIN(IF(Transform_Data[[#This Row],[Unique Index]]=Data[Index],Data[Adj Close]),\n             IF(Transform_Data[[#This Row],[Unique Index]]=Data[Lag Index],Data[Adj Close]))","v":238.19000199999999}]
[null,null,null,"2022-06-28",255.21751399999999,{"$f":"IF(Data[[#This Row],[Adj Close]]<E148,TRUE,\"\")","v":true},{"$f":"IF(F146=Data[[#This Row],[Up]],0,1)","v":1},{"$f":"SUM($G$26:G147)","v":68},67,null,null,122,{"$f":"INDEX(Data[Date],MATCH(Transform_Data[[#This Row],[Unique Index]],Data[Index],0))","v":"2022-12-22"},{"$f":"MAX( IF(Transform_Data[[#This Row],[Unique Index]]=Data[Index],Data[Adj Close]),\n               IF(Transform_Data[[#This Row],[Unique Index]]=Data[Lag Index],Data[Adj Close]))","v":238.729996},{"$f":"MIN(IF(Transform_Data[[#This Row],[Unique Index]]=Data[Index],Data[Adj Close]),\n             IF(Transform_Data[[#This Row],[Unique Index]]=Data[Lag Index],Data[Adj Close]))","v":238.19000199999999}]
[null,null,null,"2022-06-29",258.97891199999998,{"$f":"IF(Data[[#This Row],[Adj Close]]<E149,TRUE,\"\")","v":""},{"$f":"IF(F147=Data[[#This Row],[Up]],0,1)","v":1},{"$f":"SUM($G$26:G148)","v":69},68,null,null,123,{"$f":"INDEX(Data[Date],MATCH(Transform_Data[[#This Row],[Unique Index]],Data[Index],0))","v":"2022-12-23"},{"$f":"MAX( IF(Transform_Data[[#This Row],[Unique Index]]=Data[Index],Data[Adj Close]),\n               IF(Transform_Data[[#This Row],[Unique Index]]=Data[Lag Index],Data[Adj Close]))","v":238.729996},{"$f":"MIN(IF(Transform_Data[[#This Row],[Unique Index]]=Data[Index],Data[Adj Close]),\n             IF(Transform_Data[[#This Row],[Unique Index]]=Data[Lag Index],Data[Adj Close]))","v":234.529999}]
[null,null,null,"2022-06-30",255.56578099999999,{"$f":"IF(Data[[#This Row],[Adj Close]]<E150,TRUE,\"\")","v":true},{"$f":"IF(F148=Data[[#This Row],[Up]],0,1)","v":1},{"$f":"SUM($G$26:G149)","v":70},69,null,null,124,{"$f":"INDEX(Data[Date],MATCH(Transform_Data[[#This Row],[Unique Index]],Data[Index],0))","v":"2022-12-28"},{"$f":"MAX( IF(Transform_Data[[#This Row],[Unique Index]]=Data[Index],Data[Adj Close]),\n               IF(Transform_Data[[#This Row],[Unique Index]]=Data[Lag Index],Data[Adj Close]))","v":241.009995},{"$f":"MIN(IF(Transform_Data[[#This Row],[Unique Index]]=Data[Index],Data[Adj Close]),\n             IF(Transform_Data[[#This Row],[Unique Index]]=Data[Lag Index],Data[Adj Close]))","v":234.529999}]
[null,null,null,"2022-07-01",258.30221599999999,{"$f":"IF(Data[[#This Row],[Adj Close]]<E151,TRUE,\"\")","v":true},{"$f":"IF(F149=Data[[#This Row],[Up]],0,1)","v":0},{"$f":"SUM($G$26:G150)","v":70},70,null,null,125,{"$f":"INDEX(Data[Date],MATCH(Transform_Data[[#This Row],[Unique Index]],Data[Index],0))","v":"2022-12-29"},{"$f":"MAX( IF(Transform_Data[[#This Row],[Unique Index]]=Data[Index],Data[Adj Close]),\n               IF(Transform_Data[[#This Row],[Unique Index]]=Data[Lag Index],Data[Adj Close]))","v":241.009995},{"$f":"MIN(IF(Transform_Data[[#This Row],[Unique Index]]=Data[Index],Data[Adj Close]),\n             IF(Transform_Data[[#This Row],[Unique Index]]=Data[Lag Index],Data[Adj Close]))","v":222.30999800000001}]
[null,null,null,"2022-07-05",261.556152,{"$f":"IF(Data[[#This Row],[Adj Close]]<E152,TRUE,\"\")","v":true},{"$f":"IF(F150=Data[[#This Row],[Up]],0,1)","v":0},{"$f":"SUM($G$26:G151)","v":70},70,null,null,126,{"$f":"INDEX(Data[Date],MATCH(Transform_Data[[#This Row],[Unique Index]],Data[Index],0))","v":"2023-01-05"},{"$f":"MAX( IF(Transform_Data[[#This Row],[Unique Index]]=Data[Index],Data[Adj Close]),\n               IF(Transform_Data[[#This Row],[Unique Index]]=Data[Lag Index],Data[Adj Close]))","v":240.35000600000001},{"$f":"MIN(IF(Transform_Data[[#This Row],[Unique Index]]=Data[Index],Data[Adj Close]),\n             IF(Transform_Data[[#This Row],[Unique Index]]=Data[Lag Index],Data[Adj Close]))","v":222.30999800000001}]
[null,null,null,"2022-07-06",264.89959700000003,{"$f":"IF(Data[[#This Row],[Adj Close]]<E153,TRUE,\"\")","v":true},{"$f":"IF(F151=Data[[#This Row],[Up]],0,1)","v":0},{"$f":"SUM($G$26:G152)","v":70},70,null,null,127,{"$f":"INDEX(Data[Date],MATCH(Transform_Data[[#This Row],[Unique Index]],Data[Index],0))","v":"2023-01-17"},{"$f":"MAX( IF(Transform_Data[[#This Row],[Unique Index]]=Data[Index],Data[Adj Close]),\n               IF(Transform_Data[[#This Row],[Unique Index]]=Data[Lag Index],Data[Adj Close]))","v":240.35000600000001},{"$f":"MIN(IF(Transform_Data[[#This Row],[Unique Index]]=Data[Index],Data[Adj Close]),\n             IF(Transform_Data[[#This Row],[Unique Index]]=Data[Lag Index],Data[Adj Close]))","v":231.929993}]
[null,null,null,"2022-07-07",267.07882699999999,{"$f":"IF(Data[[#This Row],[Adj Close]]<E154,TRUE,\"\")","v":""},{"$f":"IF(F152=Data[[#This Row],[Up]],0,1)","v":1},{"$f":"SUM($G$26:G153)","v":71},70,null,null,128,{"$f":"INDEX(Data[Date],MATCH(Transform_Data[[#This Row],[Unique Index]],Data[Index],0))","v":"2023-01-19"},{"$f":"MAX( IF(Transform_Data[[#This Row],[Unique Index]]=Data[Index],Data[Adj Close]),\n               IF(Transform_Data[[#This Row],[Unique Index]]=Data[Lag Index],Data[Adj Close]))","v":242.58000200000001},{"$f":"MIN(IF(Transform_Data[[#This Row],[Unique Index]]=Data[Index],Data[Adj Close]),\n             IF(Transform_Data[[#This Row],[Unique Index]]=Data[Lag Index],Data[Adj Close]))","v":231.929993}]
[null,null,null,"2022-07-08",266.342468,{"$f":"IF(Data[[#This Row],[Adj Close]]<E155,TRUE,\"\")","v":""},{"$f":"IF(F153=Data[[#This Row],[Up]],0,1)","v":0},{"$f":"SUM($G$26:G154)","v":71},{"$f":"N(H153)","v":71},null,null,129,{"$f":"INDEX(Data[Date],MATCH(Transform_Data[[#This Row],[Unique Index]],Data[Index],0))","v":"2023-01-23"},{"$f":"MAX( IF(Transform_Data[[#This Row],[Unique Index]]=Data[Index],Data[Adj Close]),\n               IF(Transform_Data[[#This Row],[Unique Index]]=Data[Lag Index],Data[Adj Close]))","v":242.58000200000001},{"$f":"MIN(IF(Transform_Data[[#This Row],[Unique Index]]=Data[Index],Data[Adj Close]),\n             IF(Transform_Data[[#This Row],[Unique Index]]=Data[Lag Index],Data[Adj Close]))","v":240.61000100000001}]
[null,null,null,"2022-07-11",263.20797700000003,{"$f":"IF(Data[[#This Row],[Adj Close]]<E156,TRUE,\"\")","v":""},{"$f":"IF(F154=Data[[#This Row],[Up]],0,1)","v":0},{"$f":"SUM($G$26:G155)","v":71},71,null,null,130,{"$f":"INDEX(Data[Date],MATCH(Transform_Data[[#This Row],[Unique Index]],Data[Index],0))","v":"2023-01-25"},{"$f":"MAX( IF(Transform_Data[[#This Row],[Unique Index]]=Data[Index],Data[Adj Close]),\n               IF(Transform_Data[[#This Row],[Unique Index]]=Data[Lag Index],Data[Adj Close]))","v":248.16000399999999},{"$f":"MIN(IF(Transform_Data[[#This Row],[Unique Index]]=Data[Index],Data[Adj Close]),\n             IF(Transform_Data[[#This Row],[Unique Index]]=Data[Lag Index],Data[Adj Close]))","v":240.61000100000001}]
[null,null,null,"2022-07-12",252.42132599999999,{"$f":"IF(Data[[#This Row],[Adj Close]]<E157,TRUE,\"\")","v":""},{"$f":"IF(F155=Data[[#This Row],[Up]],0,1)","v":0},{"$f":"SUM($G$26:G156)","v":71},71]
[null,null,null,"2022-07-13",251.47601299999999,{"$f":"IF(Data[[#This Row],[Adj Close]]<E158,TRUE,\"\")","v":true},{"$f":"IF(F156=Data[[#This Row],[Up]],0,1)","v":1},{"$f":"SUM($G$26:G157)","v":72},71]
[null,null,null,"2022-07-14",252.82933,{"$f":"IF(Data[[#This Row],[Adj Close]]<E159,TRUE,\"\")","v":true},{"$f":"IF(F157=Data[[#This Row],[Up]],0,1)","v":0},{"$f":"SUM($G$26:G158)","v":72},72]
[null,null,null,"2022-07-15",255.45631399999999,{"$f":"IF(Data[[#This Row],[Adj Close]]<E160,TRUE,\"\")","v":""},{"$f":"IF(F158=Data[[#This Row],[Up]],0,1)","v":1},{"$f":"SUM($G$26:G159)","v":73},72]
[null,null,null,"2022-07-18",252.99847399999999,{"$f":"IF(Data[[#This Row],[Adj Close]]<E161,TRUE,\"\")","v":true},{"$f":"IF(F159=Data[[#This Row],[Up]],0,1)","v":1},{"$f":"SUM($G$26:G160)","v":74},73]
[null,null,null,"2022-07-19",258.25250199999999,{"$f":"IF(Data[[#This Row],[Adj Close]]<E162,TRUE,\"\")","v":true},{"$f":"IF(F160=Data[[#This Row],[Up]],0,1)","v":0},{"$f":"SUM($G$26:G161)","v":74},74]
[null,null,null,"2022-07-20",260.97900399999997,{"$f":"IF(Data[[#This Row],[Adj Close]]<E163,TRUE,\"\")","v":true},{"$f":"IF(F161=Data[[#This Row],[Up]],0,1)","v":0},{"$f":"SUM($G$26:G162)","v":74},74]
[null,null,null,"2022-07-21",263.53634599999998,{"$f":"IF(Data[[#This Row],[Adj Close]]<E164,TRUE,\"\")","v":""},{"$f":"IF(F162=Data[[#This Row],[Up]],0,1)","v":1},{"$f":"SUM($G$26:G163)","v":75},74]
[null,null,null,"2022-07-22",259.07839999999999,{"$f":"IF(Data[[#This Row],[Adj Close]]<E165,TRUE,\"\")","v":""},{"$f":"IF(F163=Data[[#This Row],[Up]],0,1)","v":0},{"$f":"SUM($G$26:G164)","v":75},75]
[null,null,null,"2022-07-25",257.55590799999999,{"$f":"IF(Data[[#This Row],[Adj Close]]<E166,TRUE,\"\")","v":""},{"$f":"IF(F164=Data[[#This Row],[Up]],0,1)","v":0},{"$f":"SUM($G$26:G165)","v":75},75]
[null,null,null,"2022-07-26",250.660034,{"$f":"IF(Data[[#This Row],[Adj Close]]<E167,TRUE,\"\")","v":true},{"$f":"IF(F165=Data[[#This Row],[Up]],0,1)","v":1},{"$f":"SUM($G$26:G166)","v":76},75]
[null,null,null,"2022-07-27",267.417145,{"$f":"IF(Data[[#This Row],[Adj Close]]<E168,TRUE,\"\")","v":true},{"$f":"IF(F166=Data[[#This Row],[Up]],0,1)","v":0},{"$f":"SUM($G$26:G167)","v":76},76]
[null,null,null,"2022-07-28",275.04940800000003,{"$f":"IF(Data[[#This Row],[Adj Close]]<E169,TRUE,\"\")","v":true},{"$f":"IF(F167=Data[[#This Row],[Up]],0,1)","v":0},{"$f":"SUM($G$26:G168)","v":76},76]
[null,null,null,"2022-07-29",279.358093,{"$f":"IF(Data[[#This Row],[Adj Close]]<E170,TRUE,\"\")","v":""},{"$f":"IF(F168=Data[[#This Row],[Up]],0,1)","v":1},{"$f":"SUM($G$26:G169)","v":77},76]
[null,null,null,"2022-08-01",276.64154100000002,{"$f":"IF(Data[[#This Row],[Adj Close]]<E171,TRUE,\"\")","v":""},{"$f":"IF(F169=Data[[#This Row],[Up]],0,1)","v":0},{"$f":"SUM($G$26:G170)","v":77},77]
[null,null,null,"2022-08-02",273.46722399999999,{"$f":"IF(Data[[#This Row],[Adj Close]]<E172,TRUE,\"\")","v":true},{"$f":"IF(F170=Data[[#This Row],[Up]],0,1)","v":1},{"$f":"SUM($G$26:G171)","v":78},77]
[null,null,null,"2022-08-03",281.07955900000002,{"$f":"IF(Data[[#This Row],[Adj Close]]<E173,TRUE,\"\")","v":true},{"$f":"IF(F171=Data[[#This Row],[Up]],0,1)","v":0},{"$f":"SUM($G$26:G172)","v":78},78]
[null,null,null,"2022-08-04",282.25375400000001,{"$f":"IF(Data[[#This Row],[Adj Close]]<E174,TRUE,\"\")","v":""},{"$f":"IF(F172=Data[[#This Row],[Up]],0,1)","v":1},{"$f":"SUM($G$26:G173)","v":79},78]
[null,null,null,"2022-08-05",281.51739500000002,{"$f":"IF(Data[[#This Row],[Adj Close]]<E175,TRUE,\"\")","v":""},{"$f":"IF(F173=Data[[#This Row],[Up]],0,1)","v":0},{"$f":"SUM($G$26:G174)","v":79},79]
[null,null,null,"2022-08-08",278.940155,{"$f":"IF(Data[[#This Row],[Adj Close]]<E176,TRUE,\"\")","v":true},{"$f":"IF(F174=Data[[#This Row],[Up]],0,1)","v":1},{"$f":"SUM($G$26:G175)","v":80},79]
[null,null,null,"2022-08-09",280.91039999999998,{"$f":"IF(Data[[#This Row],[Adj Close]]<E177,TRUE,\"\")","v":true},{"$f":"IF(F175=Data[[#This Row],[Up]],0,1)","v":0},{"$f":"SUM($G$26:G176)","v":80},80]
[null,null,null,"2022-08-10",287.73663299999998,{"$f":"IF(Data[[#This Row],[Adj Close]]<E178,TRUE,\"\")","v":""},{"$f":"IF(F176=Data[[#This Row],[Up]],0,1)","v":1},{"$f":"SUM($G$26:G177)","v":81},80]
[null,null,null,"2022-08-11",285.607147,{"$f":"IF(Data[[#This Row],[Adj Close]]<E179,TRUE,\"\")","v":true},{"$f":"IF(F177=Data[[#This Row],[Up]],0,1)","v":1},{"$f":"SUM($G$26:G178)","v":82},81]
[null,null,null,"2022-08-12",290.47311400000001,{"$f":"IF(Data[[#This Row],[Adj Close]]<E180,TRUE,\"\")","v":true},{"$f":"IF(F178=Data[[#This Row],[Up]],0,1)","v":0},{"$f":"SUM($G$26:G179)","v":82},82]
[null,null,null,"2022-08-15",292.02545199999997,{"$f":"IF(Data[[#This Row],[Adj Close]]<E181,TRUE,\"\")","v":""},{"$f":"IF(F179=Data[[#This Row],[Up]],0,1)","v":1},{"$f":"SUM($G$26:G180)","v":83},82]
[null,null,null,"2022-08-16",291.26916499999999,{"$f":"IF(Data[[#This Row],[Adj Close]]<E182,TRUE,\"\")","v":""},{"$f":"IF(F180=Data[[#This Row],[Up]],0,1)","v":0},{"$f":"SUM($G$26:G181)","v":83},83]
[null,null,null,"2022-08-17",290.50134300000002,{"$f":"IF(Data[[#This Row],[Adj Close]]<E183,TRUE,\"\")","v":""},{"$f":"IF(F181=Data[[#This Row],[Up]],0,1)","v":0},{"$f":"SUM($G$26:G182)","v":83},83]
[null,null,null,"2022-08-18",289.35455300000001,{"$f":"IF(Data[[#This Row],[Adj Close]]<E184,TRUE,\"\")","v":""},{"$f":"IF(F182=Data[[#This Row],[Up]],0,1)","v":0},{"$f":"SUM($G$26:G183)","v":83},83]
[null,null,null,"2022-08-19",285.34585600000003,{"$f":"IF(Data[[#This Row],[Adj Close]]<E185,TRUE,\"\")","v":""},{"$f":"IF(F183=Data[[#This Row],[Up]],0,1)","v":0},{"$f":"SUM($G$26:G184)","v":83},83]
[null,null,null,"2022-08-22",276.96945199999999,{"$f":"IF(Data[[#This Row],[Adj Close]]<E186,TRUE,\"\")","v":""},{"$f":"IF(F184=Data[[#This Row],[Up]],0,1)","v":0},{"$f":"SUM($G$26:G185)","v":83},83]
[null,null,null,"2022-08-23",275.66314699999998,{"$f":"IF(Data[[#This Row],[Adj Close]]<E187,TRUE,\"\")","v":""},{"$f":"IF(F185=Data[[#This Row],[Up]],0,1)","v":0},{"$f":"SUM($G$26:G186)","v":83},83]
[null,null,null,"2022-08-24",275.01498400000003,{"$f":"IF(Data[[#This Row],[Adj Close]]<E188,TRUE,\"\")","v":true},{"$f":"IF(F186=Data[[#This Row],[Up]],0,1)","v":1},{"$f":"SUM($G$26:G187)","v":84},83]
[null,null,null,"2022-08-25",278.06637599999999,{"$f":"IF(Data[[#This Row],[Adj Close]]<E189,TRUE,\"\")","v":""},{"$f":"IF(F187=Data[[#This Row],[Up]],0,1)","v":1},{"$f":"SUM($G$26:G188)","v":85},84]
[null,null,null,"2022-08-26",267.33660900000001,{"$f":"IF(Data[[#This Row],[Adj Close]]<E190,TRUE,\"\")","v":""},{"$f":"IF(F188=Data[[#This Row],[Up]],0,1)","v":0},{"$f":"SUM($G$26:G189)","v":85},85]
[null,null,null,"2022-08-29",264.48464999999999,{"$f":"IF(Data[[#This Row],[Adj Close]]<E191,TRUE,\"\")","v":""},{"$f":"IF(F189=Data[[#This Row],[Up]],0,1)","v":0},{"$f":"SUM($G$26:G190)","v":85},85]
[null,null,null,"2022-08-30",262.23098800000002,{"$f":"IF(Data[[#This Row],[Adj Close]]<E192,TRUE,\"\")","v":""},{"$f":"IF(F190=Data[[#This Row],[Up]],0,1)","v":0},{"$f":"SUM($G$26:G191)","v":85},85]
[null,null,null,"2022-08-31",260.73519900000002,{"$f":"IF(Data[[#This Row],[Adj Close]]<E193,TRUE,\"\")","v":""},{"$f":"IF(F191=Data[[#This Row],[Up]],0,1)","v":0},{"$f":"SUM($G$26:G192)","v":85},85]
[null,null,null,"2022-09-01",259.66821299999998,{"$f":"IF(Data[[#This Row],[Adj Close]]<E194,TRUE,\"\")","v":""},{"$f":"IF(F192=Data[[#This Row],[Up]],0,1)","v":0},{"$f":"SUM($G$26:G193)","v":85},85]
[null,null,null,"2022-09-02",255.340408,{"$f":"IF(Data[[#This Row],[Adj Close]]<E195,TRUE,\"\")","v":""},{"$f":"IF(F193=Data[[#This Row],[Up]],0,1)","v":0},{"$f":"SUM($G$26:G194)","v":85},85]
[null,null,null,"2022-09-06",252.53829999999999,{"$f":"IF(Data[[#This Row],[Adj Close]]<E196,TRUE,\"\")","v":true},{"$f":"IF(F194=Data[[#This Row],[Up]],0,1)","v":1},{"$f":"SUM($G$26:G195)","v":86},85]
[null,null,null,"2022-09-07",257.36471599999999,{"$f":"IF(Data[[#This Row],[Adj Close]]<E197,TRUE,\"\")","v":true},{"$f":"IF(F195=Data[[#This Row],[Up]],0,1)","v":0},{"$f":"SUM($G$26:G196)","v":86},86]
[null,null,null,"2022-09-08",257.79348800000002,{"$f":"IF(Data[[#This Row],[Adj Close]]<E198,TRUE,\"\")","v":true},{"$f":"IF(F196=Data[[#This Row],[Up]],0,1)","v":0},{"$f":"SUM($G$26:G197)","v":86},86]
[null,null,null,"2022-09-09",263.71679699999999,{"$f":"IF(Data[[#This Row],[Adj Close]]<E199,TRUE,\"\")","v":true},{"$f":"IF(F197=Data[[#This Row],[Up]],0,1)","v":0},{"$f":"SUM($G$26:G198)","v":86},86]
[null,null,null,"2022-09-12",265.90063500000002,{"$f":"IF(Data[[#This Row],[Adj Close]]<E200,TRUE,\"\")","v":""},{"$f":"IF(F198=Data[[#This Row],[Up]],0,1)","v":1},{"$f":"SUM($G$26:G199)","v":87},86]
[null,null,null,"2022-09-13",251.28185999999999,{"$f":"IF(Data[[#This Row],[Adj Close]]<E201,TRUE,\"\")","v":true},{"$f":"IF(F199=Data[[#This Row],[Up]],0,1)","v":1},{"$f":"SUM($G$26:G200)","v":88},87]
[null,null,null,"2022-09-14",251.5112,{"$f":"IF(Data[[#This Row],[Adj Close]]<E202,TRUE,\"\")","v":""},{"$f":"IF(F200=Data[[#This Row],[Up]],0,1)","v":1},{"$f":"SUM($G$26:G201)","v":89},88]
[null,null,null,"2022-09-15",244.69042999999999,{"$f":"IF(Data[[#This Row],[Adj Close]]<E203,TRUE,\"\")","v":""},{"$f":"IF(F201=Data[[#This Row],[Up]],0,1)","v":0},{"$f":"SUM($G$26:G202)","v":89},89]
[null,null,null,"2022-09-16",244.05223100000001,{"$f":"IF(Data[[#This Row],[Adj Close]]<E204,TRUE,\"\")","v":""},{"$f":"IF(F202=Data[[#This Row],[Up]],0,1)","v":0},{"$f":"SUM($G$26:G203)","v":89},89]
[null,null,null,"2022-09-19",243.83284,{"$f":"IF(Data[[#This Row],[Adj Close]]<E205,TRUE,\"\")","v":""},{"$f":"IF(F203=Data[[#This Row],[Up]],0,1)","v":0},{"$f":"SUM($G$26:G204)","v":89},89]
[null,null,null,"2022-09-20",241.76866100000001,{"$f":"IF(Data[[#This Row],[Adj Close]]<E206,TRUE,\"\")","v":""},{"$f":"IF(F204=Data[[#This Row],[Up]],0,1)","v":0},{"$f":"SUM($G$26:G205)","v":89},89]
[null,null,null,"2022-09-21",238.27848800000001,{"$f":"IF(Data[[#This Row],[Adj Close]]<E207,TRUE,\"\")","v":true},{"$f":"IF(F205=Data[[#This Row],[Up]],0,1)","v":1},{"$f":"SUM($G$26:G206)","v":90},89]
[null,null,null,"2022-09-22",240.30278000000001,{"$f":"IF(Data[[#This Row],[Adj Close]]<E208,TRUE,\"\")","v":""},{"$f":"IF(F206=Data[[#This Row],[Up]],0,1)","v":1},{"$f":"SUM($G$26:G207)","v":91},90]
[null,null,null,"2022-09-23",237.25138899999999,{"$f":"IF(Data[[#This Row],[Adj Close]]<E209,TRUE,\"\")","v":""},{"$f":"IF(F207=Data[[#This Row],[Up]],0,1)","v":0},{"$f":"SUM($G$26:G208)","v":91},91]
[null,null,null,"2022-09-26",236.78270000000001,{"$f":"IF(Data[[#This Row],[Adj Close]]<E210,TRUE,\"\")","v":""},{"$f":"IF(F208=Data[[#This Row],[Up]],0,1)","v":0},{"$f":"SUM($G$26:G209)","v":91},91]
[null,null,null,"2022-09-27",235.74563599999999,{"$f":"IF(Data[[#This Row],[Adj Close]]<E211,TRUE,\"\")","v":true},{"$f":"IF(F209=Data[[#This Row],[Up]],0,1)","v":1},{"$f":"SUM($G$26:G210)","v":92},91]
[null,null,null,"2022-09-28",240.39254800000001,{"$f":"IF(Data[[#This Row],[Adj Close]]<E212,TRUE,\"\")","v":""},{"$f":"IF(F210=Data[[#This Row],[Up]],0,1)","v":1},{"$f":"SUM($G$26:G211)","v":93},92]
[null,null,null,"2022-09-29",236.83256499999999,{"$f":"IF(Data[[#This Row],[Adj Close]]<E213,TRUE,\"\")","v":""},{"$f":"IF(F211=Data[[#This Row],[Up]],0,1)","v":0},{"$f":"SUM($G$26:G212)","v":93},93]
[null,null,null,"2022-09-30",232.24548300000001,{"$f":"IF(Data[[#This Row],[Adj Close]]<E214,TRUE,\"\")","v":true},{"$f":"IF(F212=Data[[#This Row],[Up]],0,1)","v":1},{"$f":"SUM($G$26:G213)","v":94},93]
[null,null,null,"2022-10-03",240.06346099999999,{"$f":"IF(Data[[#This Row],[Adj Close]]<E215,TRUE,\"\")","v":true},{"$f":"IF(F213=Data[[#This Row],[Up]],0,1)","v":0},{"$f":"SUM($G$26:G214)","v":94},94]
[null,null,null,"2022-10-04",248.180588,{"$f":"IF(Data[[#This Row],[Adj Close]]<E216,TRUE,\"\")","v":true},{"$f":"IF(F214=Data[[#This Row],[Up]],0,1)","v":0},{"$f":"SUM($G$26:G215)","v":94},94]
[null,null,null,"2022-10-05",248.49968000000001,{"$f":"IF(Data[[#This Row],[Adj Close]]<E217,TRUE,\"\")","v":""},{"$f":"IF(F215=Data[[#This Row],[Up]],0,1)","v":1},{"$f":"SUM($G$26:G216)","v":95},94]
[null,null,null,"2022-10-06",246.096451,{"$f":"IF(Data[[#This Row],[Adj Close]]<E218,TRUE,\"\")","v":""},{"$f":"IF(F216=Data[[#This Row],[Up]],0,1)","v":0},{"$f":"SUM($G$26:G217)","v":95},95]
[null,null,null,"2022-10-07",233.58174099999999,{"$f":"IF(Data[[#This Row],[Adj Close]]<E219,TRUE,\"\")","v":""},{"$f":"IF(F217=Data[[#This Row],[Up]],0,1)","v":0},{"$f":"SUM($G$26:G218)","v":95},{"$f":"N(H217)","v":95}]
[null,null,null,"2022-10-10",228.60575900000001,{"$f":"IF(Data[[#This Row],[Adj Close]]<E220,TRUE,\"\")","v":""},{"$f":"IF(F218=Data[[#This Row],[Up]],0,1)","v":0},{"$f":"SUM($G$26:G219)","v":95},95]
[null,null,null,"2022-10-11",224.77654999999999,{"$f":"IF(Data[[#This Row],[Adj Close]]<E221,TRUE,\"\")","v":true},{"$f":"IF(F219=Data[[#This Row],[Up]],0,1)","v":1},{"$f":"SUM($G$26:G220)","v":96},95]
[null,null,null,"2022-10-12",225.11558500000001,{"$f":"IF(Data[[#This Row],[Adj Close]]<E222,TRUE,\"\")","v":true},{"$f":"IF(F220=Data[[#This Row],[Up]],0,1)","v":0},{"$f":"SUM($G$26:G221)","v":96},96]
[null,null,null,"2022-10-13",233.58174099999999,{"$f":"IF(Data[[#This Row],[Adj Close]]<E223,TRUE,\"\")","v":""},{"$f":"IF(F221=Data[[#This Row],[Up]],0,1)","v":1},{"$f":"SUM($G$26:G222)","v":97},96]
[null,null,null,"2022-10-14",227.91769400000001,{"$f":"IF(Data[[#This Row],[Adj Close]]<E224,TRUE,\"\")","v":true},{"$f":"IF(F222=Data[[#This Row],[Up]],0,1)","v":1},{"$f":"SUM($G$26:G223)","v":98},97]
[null,null,null,"2022-10-17",236.86248800000001,{"$f":"IF(Data[[#This Row],[Adj Close]]<E225,TRUE,\"\")","v":true},{"$f":"IF(F223=Data[[#This Row],[Up]],0,1)","v":0},{"$f":"SUM($G$26:G224)","v":98},98]
[null,null,null,"2022-10-18",237.829758,{"$f":"IF(Data[[#This Row],[Adj Close]]<E226,TRUE,\"\")","v":""},{"$f":"IF(F224=Data[[#This Row],[Up]],0,1)","v":1},{"$f":"SUM($G$26:G225)","v":99},98]
[null,null,null,"2022-10-19",235.81542999999999,{"$f":"IF(Data[[#This Row],[Adj Close]]<E227,TRUE,\"\")","v":""},{"$f":"IF(F225=Data[[#This Row],[Up]],0,1)","v":0},{"$f":"SUM($G$26:G226)","v":99},99]
[null,null,null,"2022-10-20",235.48635899999999,{"$f":"IF(Data[[#This Row],[Adj Close]]<E228,TRUE,\"\")","v":true},{"$f":"IF(F226=Data[[#This Row],[Up]],0,1)","v":1},{"$f":"SUM($G$26:G227)","v":100},99]
[null,null,null,"2022-10-21",241.43957499999999,{"$f":"IF(Data[[#This Row],[Adj Close]]<E229,TRUE,\"\")","v":true},{"$f":"IF(F227=Data[[#This Row],[Up]],0,1)","v":0},{"$f":"SUM($G$26:G228)","v":100},100]
[null,null,null,"2022-10-24",246.55517599999999,{"$f":"IF(Data[[#This Row],[Adj Close]]<E230,TRUE,\"\")","v":true},{"$f":"IF(F228=Data[[#This Row],[Up]],0,1)","v":0},{"$f":"SUM($G$26:G229)","v":100},100]
[null,null,null,"2022-10-25",249.95558199999999,{"$f":"IF(Data[[#This Row],[Adj Close]]<E231,TRUE,\"\")","v":""},{"$f":"IF(F229=Data[[#This Row],[Up]],0,1)","v":1},{"$f":"SUM($G$26:G230)","v":101},100]
[null,null,null,"2022-10-26",230.669937,{"$f":"IF(Data[[#This Row],[Adj Close]]<E232,TRUE,\"\")","v":""},{"$f":"IF(F230=Data[[#This Row],[Up]],0,1)","v":0},{"$f":"SUM($G$26:G231)","v":101},101]
[null,null,null,"2022-10-27",226.11277799999999,{"$f":"IF(Data[[#This Row],[Adj Close]]<E233,TRUE,\"\")","v":true},{"$f":"IF(F231=Data[[#This Row],[Up]],0,1)","v":1},{"$f":"SUM($G$26:G232)","v":102},101]
[null,null,null,"2022-10-28",235.20713799999999,{"$f":"IF(Data[[#This Row],[Adj Close]]<E234,TRUE,\"\")","v":""},{"$f":"IF(F232=Data[[#This Row],[Up]],0,1)","v":1},{"$f":"SUM($G$26:G233)","v":103},102]
[null,null,null,"2022-10-31",231.47766100000001,{"$f":"IF(Data[[#This Row],[Adj Close]]<E235,TRUE,\"\")","v":""},{"$f":"IF(F233=Data[[#This Row],[Up]],0,1)","v":0},{"$f":"SUM($G$26:G234)","v":103},103]
[null,null,null,"2022-11-01",227.52879300000001,{"$f":"IF(Data[[#This Row],[Adj Close]]<E236,TRUE,\"\")","v":""},{"$f":"IF(F234=Data[[#This Row],[Up]],0,1)","v":0},{"$f":"SUM($G$26:G235)","v":103},103]
[null,null,null,"2022-11-02",219.48147599999999,{"$f":"IF(Data[[#This Row],[Adj Close]]<E237,TRUE,\"\")","v":""},{"$f":"IF(F235=Data[[#This Row],[Up]],0,1)","v":0},{"$f":"SUM($G$26:G236)","v":103},103]
[null,null,null,"2022-11-03",213.64790300000001,{"$f":"IF(Data[[#This Row],[Adj Close]]<E238,TRUE,\"\")","v":true},{"$f":"IF(F236=Data[[#This Row],[Up]],0,1)","v":1},{"$f":"SUM($G$26:G237)","v":104},103]
[null,null,null,"2022-11-04",220.76783800000001,{"$f":"IF(Data[[#This Row],[Adj Close]]<E239,TRUE,\"\")","v":true},{"$f":"IF(F237=Data[[#This Row],[Up]],0,1)","v":0},{"$f":"SUM($G$26:G238)","v":104},104]
[null,null,null,"2022-11-07",227.22962999999999,{"$f":"IF(Data[[#This Row],[Adj Close]]<E240,TRUE,\"\")","v":true},{"$f":"IF(F238=Data[[#This Row],[Up]],0,1)","v":0},{"$f":"SUM($G$26:G239)","v":104},104]
[null,null,null,"2022-11-08",228.226822,{"$f":"IF(Data[[#This Row],[Adj Close]]<E241,TRUE,\"\")","v":""},{"$f":"IF(F239=Data[[#This Row],[Up]],0,1)","v":1},{"$f":"SUM($G$26:G240)","v":105},104]
[null,null,null,"2022-11-09",223.879074,{"$f":"IF(Data[[#This Row],[Adj Close]]<E242,TRUE,\"\")","v":true},{"$f":"IF(F240=Data[[#This Row],[Up]],0,1)","v":1},{"$f":"SUM($G$26:G241)","v":106},105]
[null,null,null,"2022-11-10",242.29716500000001,{"$f":"IF(Data[[#This Row],[Adj Close]]<E243,TRUE,\"\")","v":true},{"$f":"IF(F241=Data[[#This Row],[Up]],0,1)","v":0},{"$f":"SUM($G$26:G242)","v":106},106]
[null,null,null,"2022-11-11",246.415558,{"$f":"IF(Data[[#This Row],[Adj Close]]<E244,TRUE,\"\")","v":""},{"$f":"IF(F242=Data[[#This Row],[Up]],0,1)","v":1},{"$f":"SUM($G$26:G243)","v":107},106]
[null,null,null,"2022-11-14",240.871185,{"$f":"IF(Data[[#This Row],[Adj Close]]<E245,TRUE,\"\")","v":true},{"$f":"IF(F243=Data[[#This Row],[Up]],0,1)","v":1},{"$f":"SUM($G$26:G244)","v":108},107]
[null,null,null,"2022-11-15",241.290009,{"$f":"IF(Data[[#This Row],[Adj Close]]<E246,TRUE,\"\")","v":true},{"$f":"IF(F244=Data[[#This Row],[Up]],0,1)","v":0},{"$f":"SUM($G$26:G245)","v":108},108]
[null,null,null,"2022-11-16",241.729996,{"$f":"IF(Data[[#This Row],[Adj Close]]<E247,TRUE,\"\")","v":""},{"$f":"IF(F245=Data[[#This Row],[Up]],0,1)","v":1},{"$f":"SUM($G$26:G246)","v":109},108]
[null,null,null,"2022-11-17",241.679993,{"$f":"IF(Data[[#This Row],[Adj Close]]<E248,TRUE,\"\")","v":""},{"$f":"IF(F246=Data[[#This Row],[Up]],0,1)","v":0},{"$f":"SUM($G$26:G247)","v":109},109]
[null,null,null,"2022-11-18",241.220001,{"$f":"IF(Data[[#This Row],[Adj Close]]<E249,TRUE,\"\")","v":true},{"$f":"IF(F247=Data[[#This Row],[Up]],0,1)","v":1},{"$f":"SUM($G$26:G248)","v":110},109]
[null,null,null,"2022-11-21",242.050003,{"$f":"IF(Data[[#This Row],[Adj Close]]<E250,TRUE,\"\")","v":true},{"$f":"IF(F248=Data[[#This Row],[Up]],0,1)","v":0},{"$f":"SUM($G$26:G249)","v":110},110]
[null,null,null,"2022-11-22",245.029999,{"$f":"IF(Data[[#This Row],[Adj Close]]<E251,TRUE,\"\")","v":true},{"$f":"IF(F249=Data[[#This Row],[Up]],0,1)","v":0},{"$f":"SUM($G$26:G250)","v":110},110]
[null,null,null,"2022-11-23",247.58000200000001,{"$f":"IF(Data[[#This Row],[Adj Close]]<E252,TRUE,\"\")","v":""},{"$f":"IF(F250=Data[[#This Row],[Up]],0,1)","v":1},{"$f":"SUM($G$26:G251)","v":111},110]
[null,null,null,"2022-11-25",247.490005,{"$f":"IF(Data[[#This Row],[Adj Close]]<E253,TRUE,\"\")","v":""},{"$f":"IF(F251=Data[[#This Row],[Up]],0,1)","v":0},{"$f":"SUM($G$26:G252)","v":111},111]
[null,null,null,"2022-11-28",241.759995,{"$f":"IF(Data[[#This Row],[Adj Close]]<E254,TRUE,\"\")","v":""},{"$f":"IF(F252=Data[[#This Row],[Up]],0,1)","v":0},{"$f":"SUM($G$26:G253)","v":111},111]
[null,null,null,"2022-11-29",240.33000200000001,{"$f":"IF(Data[[#This Row],[Adj Close]]<E255,TRUE,\"\")","v":true},{"$f":"IF(F253=Data[[#This Row],[Up]],0,1)","v":1},{"$f":"SUM($G$26:G254)","v":112},111]
[null,null,null,"2022-11-30",255.13999899999999,{"$f":"IF(Data[[#This Row],[Adj Close]]<E256,TRUE,\"\")","v":""},{"$f":"IF(F254=Data[[#This Row],[Up]],0,1)","v":1},{"$f":"SUM($G$26:G255)","v":113},112]
[null,null,null,"2022-12-01",254.69000199999999,{"$f":"IF(Data[[#This Row],[Adj Close]]<E257,TRUE,\"\")","v":true},{"$f":"IF(F255=Data[[#This Row],[Up]],0,1)","v":1},{"$f":"SUM($G$26:G256)","v":114},113]
[null,null,null,"2022-12-02",255.020004,{"$f":"IF(Data[[#This Row],[Adj Close]]<E258,TRUE,\"\")","v":""},{"$f":"IF(F256=Data[[#This Row],[Up]],0,1)","v":1},{"$f":"SUM($G$26:G257)","v":115},114]
[null,null,null,"2022-12-05",250.199997,{"$f":"IF(Data[[#This Row],[Adj Close]]<E259,TRUE,\"\")","v":""},{"$f":"IF(F257=Data[[#This Row],[Up]],0,1)","v":0},{"$f":"SUM($G$26:G258)","v":115},115]
[null,null,null,"2022-12-06",245.11999499999999,{"$f":"IF(Data[[#This Row],[Adj Close]]<E260,TRUE,\"\")","v":""},{"$f":"IF(F258=Data[[#This Row],[Up]],0,1)","v":0},{"$f":"SUM($G$26:G259)","v":115},115]
[null,null,null,"2022-12-07",244.36999499999999,{"$f":"IF(Data[[#This Row],[Adj Close]]<E261,TRUE,\"\")","v":true},{"$f":"IF(F259=Data[[#This Row],[Up]],0,1)","v":1},{"$f":"SUM($G$26:G260)","v":116},115]
[null,null,null,"2022-12-08",247.39999399999999,{"$f":"IF(Data[[#This Row],[Adj Close]]<E262,TRUE,\"\")","v":""},{"$f":"IF(F260=Data[[#This Row],[Up]],0,1)","v":1},{"$f":"SUM($G$26:G261)","v":117},116]
[null,null,null,"2022-12-09",245.41999799999999,{"$f":"IF(Data[[#This Row],[Adj Close]]<E263,TRUE,\"\")","v":true},{"$f":"IF(F261=Data[[#This Row],[Up]],0,1)","v":1},{"$f":"SUM($G$26:G262)","v":118},117]
[null,null,null,"2022-12-12",252.509995,{"$f":"IF(Data[[#This Row],[Adj Close]]<E264,TRUE,\"\")","v":true},{"$f":"IF(F262=Data[[#This Row],[Up]],0,1)","v":0},{"$f":"SUM($G$26:G263)","v":118},118]
[null,null,null,"2022-12-13",256.92001299999998,{"$f":"IF(Data[[#This Row],[Adj Close]]<E265,TRUE,\"\")","v":true},{"$f":"IF(F263=Data[[#This Row],[Up]],0,1)","v":0},{"$f":"SUM($G$26:G264)","v":118},118]
[null,null,null,"2022-12-14",257.22000100000002,{"$f":"IF(Data[[#This Row],[Adj Close]]<E266,TRUE,\"\")","v":""},{"$f":"IF(F264=Data[[#This Row],[Up]],0,1)","v":1},{"$f":"SUM($G$26:G265)","v":119},118]
[null,null,null,"2022-12-15",249.009995,{"$f":"IF(Data[[#This Row],[Adj Close]]<E267,TRUE,\"\")","v":""},{"$f":"IF(F265=Data[[#This Row],[Up]],0,1)","v":0},{"$f":"SUM($G$26:G266)","v":119},119]
[null,null,null,"2022-12-16",244.69000199999999,{"$f":"IF(Data[[#This Row],[Adj Close]]<E268,TRUE,\"\")","v":""},{"$f":"IF(F266=Data[[#This Row],[Up]],0,1)","v":0},{"$f":"SUM($G$26:G267)","v":119},119]
[null,null,null,"2022-12-19",240.449997,{"$f":"IF(Data[[#This Row],[Adj Close]]<E269,TRUE,\"\")","v":true},{"$f":"IF(F267=Data[[#This Row],[Up]],0,1)","v":1},{"$f":"SUM($G$26:G268)","v":120},119]
[null,null,null,"2022-12-20",241.800003,{"$f":"IF(Data[[#This Row],[Adj Close]]<E270,TRUE,\"\")","v":true},{"$f":"IF(F268=Data[[#This Row],[Up]],0,1)","v":0},{"$f":"SUM($G$26:G269)","v":120},120]
[null,null,null,"2022-12-21",244.429993,{"$f":"IF(Data[[#This Row],[Adj Close]]<E271,TRUE,\"\")","v":""},{"$f":"IF(F269=Data[[#This Row],[Up]],0,1)","v":1},{"$f":"SUM($G$26:G270)","v":121},120]
[null,null,null,"2022-12-22",238.19000199999999,{"$f":"IF(Data[[#This Row],[Adj Close]]<E272,TRUE,\"\")","v":true},{"$f":"IF(F270=Data[[#This Row],[Up]],0,1)","v":1},{"$f":"SUM($G$26:G271)","v":122},121]
[null,null,null,"2022-12-23",238.729996,{"$f":"IF(Data[[#This Row],[Adj Close]]<E273,TRUE,\"\")","v":""},{"$f":"IF(F271=Data[[#This Row],[Up]],0,1)","v":1},{"$f":"SUM($G$26:G272)","v":123},122]
[null,null,null,"2022-12-27",236.96000699999999,{"$f":"IF(Data[[#This Row],[Adj Close]]<E274,TRUE,\"\")","v":""},{"$f":"IF(F272=Data[[#This Row],[Up]],0,1)","v":0},{"$f":"SUM($G$26:G273)","v":123},123]
[null,null,null,"2022-12-28",234.529999,{"$f":"IF(Data[[#This Row],[Adj Close]]<E275,TRUE,\"\")","v":true},{"$f":"IF(F273=Data[[#This Row],[Up]],0,1)","v":1},{"$f":"SUM($G$26:G274)","v":124},123]
[null,null,null,"2022-12-29",241.009995,{"$f":"IF(Data[[#This Row],[Adj Close]]<E276,TRUE,\"\")","v":""},{"$f":"IF(F274=Data[[#This Row],[Up]],0,1)","v":1},{"$f":"SUM($G$26:G275)","v":125},124]
[null,null,null,"2022-12-30",239.820007,{"$f":"IF(Data[[#This Row],[Adj Close]]<E277,TRUE,\"\")","v":""},{"$f":"IF(F275=Data[[#This Row],[Up]],0,1)","v":0},{"$f":"SUM($G$26:G276)","v":125},125]
[null,null,null,"2023-01-03",239.58000200000001,{"$f":"IF(Data[[#This Row],[Adj Close]]<E278,TRUE,\"\")","v":""},{"$f":"IF(F276=Data[[#This Row],[Up]],0,1)","v":0},{"$f":"SUM($G$26:G277)","v":125},125]
[null,null,null,"2023-01-04",229.10000600000001,{"$f":"IF(Data[[#This Row],[Adj Close]]<E279,TRUE,\"\")","v":""},{"$f":"IF(F277=Data[[#This Row],[Up]],0,1)","v":0},{"$f":"SUM($G$26:G278)","v":125},125]
[null,null,null,"2023-01-05",222.30999800000001,{"$f":"IF(Data[[#This Row],[Adj Close]]<E280,TRUE,\"\")","v":true},{"$f":"IF(F278=Data[[#This Row],[Up]],0,1)","v":1},{"$f":"SUM($G$26:G279)","v":126},125]
[null,null,null,"2023-01-06",224.929993,{"$f":"IF(Data[[#This Row],[Adj Close]]<E281,TRUE,\"\")","v":true},{"$f":"IF(F279=Data[[#This Row],[Up]],0,1)","v":0},{"$f":"SUM($G$26:G280)","v":126},126]
[null,null,null,"2023-01-09",227.11999499999999,{"$f":"IF(Data[[#This Row],[Adj Close]]<E282,TRUE,\"\")","v":true},{"$f":"IF(F280=Data[[#This Row],[Up]],0,1)","v":0},{"$f":"SUM($G$26:G281)","v":126},126]
[null,null,null,"2023-01-10",228.85000600000001,{"$f":"IF(Data[[#This Row],[Adj Close]]<E283,TRUE,\"\")","v":true},{"$f":"IF(F281=Data[[#This Row],[Up]],0,1)","v":0},{"$f":"SUM($G$26:G282)","v":126},{"$f":"N(H281)","v":126}]
[null,null,null,"2023-01-11",235.770004,{"$f":"IF(Data[[#This Row],[Adj Close]]<E284,TRUE,\"\")","v":true},{"$f":"IF(F282=Data[[#This Row],[Up]],0,1)","v":0},{"$f":"SUM($G$26:G283)","v":126},126]
[null,null,null,"2023-01-12",238.509995,{"$f":"IF(Data[[#This Row],[Adj Close]]<E285,TRUE,\"\")","v":true},{"$f":"IF(F283=Data[[#This Row],[Up]],0,1)","v":0},{"$f":"SUM($G$26:G284)","v":126},126]
[null,null,null,"2023-01-13",239.229996,{"$f":"IF(Data[[#This Row],[Adj Close]]<E286,TRUE,\"\")","v":true},{"$f":"IF(F284=Data[[#This Row],[Up]],0,1)","v":0},{"$f":"SUM($G$26:G285)","v":126},126]
[null,null,null,"2023-01-17",240.35000600000001,{"$f":"IF(Data[[#This Row],[Adj Close]]<E287,TRUE,\"\")","v":""},{"$f":"IF(F285=Data[[#This Row],[Up]],0,1)","v":1},{"$f":"SUM($G$26:G286)","v":127},126]
[null,null,null,"2023-01-18",235.80999800000001,{"$f":"IF(Data[[#This Row],[Adj Close]]<E288,TRUE,\"\")","v":""},{"$f":"IF(F286=Data[[#This Row],[Up]],0,1)","v":0},{"$f":"SUM($G$26:G287)","v":127},127]
[null,null,null,"2023-01-19",231.929993,{"$f":"IF(Data[[#This Row],[Adj Close]]<E289,TRUE,\"\")","v":true},{"$f":"IF(F287=Data[[#This Row],[Up]],0,1)","v":1},{"$f":"SUM($G$26:G288)","v":128},127]
[null,null,null,"2023-01-20",240.220001,{"$f":"IF(Data[[#This Row],[Adj Close]]<E290,TRUE,\"\")","v":true},{"$f":"IF(F288=Data[[#This Row],[Up]],0,1)","v":0},{"$f":"SUM($G$26:G289)","v":128},128]
[null,null,null,"2023-01-23",242.58000200000001,{"$f":"IF(Data[[#This Row],[Adj Close]]<E291,TRUE,\"\")","v":""},{"$f":"IF(F289=Data[[#This Row],[Up]],0,1)","v":1},{"$f":"SUM($G$26:G290)","v":129},128]
[null,null,null,"2023-01-24",242.03999300000001,{"$f":"IF(Data[[#This Row],[Adj Close]]<E292,TRUE,\"\")","v":""},{"$f":"IF(F290=Data[[#This Row],[Up]],0,1)","v":0},{"$f":"SUM($G$26:G291)","v":129},129]
[null,null,null,"2023-01-25",240.61000100000001,{"$f":"IF(Data[[#This Row],[Adj Close]]<E293,TRUE,\"\")","v":true},{"$f":"IF(F291=Data[[#This Row],[Up]],0,1)","v":1},{"$f":"SUM($G$26:G292)","v":130},129]
[null,null,null,"2023-01-26",248,{"$f":"IF(Data[[#This Row],[Adj Close]]<E294,TRUE,\"\")","v":true},{"$f":"IF(F292=Data[[#This Row],[Up]],0,1)","v":0},{"$f":"SUM($G$26:G293)","v":130},130]
[null,null,null,"2023-01-27",248.16000399999999,{"$f":"IF(Data[[#This Row],[Adj Close]]<E295,TRUE,\"\")","v":""},{"$f":"IF(F293=Data[[#This Row],[Up]],0,1)","v":1},{"$f":"SUM($G$26:G294)","v":131},130]

{"sheet":"PnF-CSE","index":5,"n_rows":40,"n_cols":136,"rows_kept":40,"cut":false,"hidden":false,"merged":[[2,0,2,4]]}
[{"$f":"IF(ISERROR(RIGHT(CELL(\"filename\",A1),LEN(CELL(\"filename\",A1))-FIND(\"]\",CELL(\"filename\",A1)))),\n\"\",\nRIGHT(CELL(\"filename\",A1),LEN(CELL(\"filename\",A1))-FIND(\"]\",CELL(\"filename\",A1))))","v":"PnF-CSE"}]
[{"$f":"Model_Name","v":"SP Point and Figure Chart - Complete.xlsm"}]
["Navigator"]
[null,"Error Checks:",null,null,null,{"$f":"Overall_Error_Check","v":0}]
[]
[null,{"$f":"MAX($B$5:$B5)+1","v":1},{"$f":"A1","v":"PnF-CSE"}]
[]
[null,null,null,null,null,null,"Date"]
[null,null,null,null,null,null,{"$f":"TRANSPOSE(Transform_Data[[Unique Index]:[Date]])","v":1},2,3,4,5,6,7,8,9,10,11,12,13,14,15,16,17,18,19,20,21,22,23,24,25,26,27,28,29,30,31,32,33,34,35,36,37,38,39,40,41,42,43,44,45,46,47,48,49,50,51,52,53,54,55,56,57,58,59,60,61,62,63,64,65,66,67,68,69,70,71,72,73,74,75,76,77,78,79,80,81,82,83,84,85,86,87,88,89,90,91,92,93,94,95,96,97,98,99,100,101,102,103,104,105,106,107,108,109,110,111,112,113,114,115,116,117,118,119,120,121,122,123,124,125,126,127,128,129,130]
[null,null,null,null,"Lower Bin","Upper Bin","2022-01-03","2022-01-06","2022-01-12","2022-01-13","2022-01-14","2022-01-18","2022-01-19","2022-01-21","2022-01-24","2022-01-25","2022-01-31","2022-02-01","2022-02-02","2022-02-03","2022-02-04","2022-02-07","2022-02-09","2022-02-14","2022-02-15","2022-02-23","2022-02-28","2022-03-01","2022-03-02","2022-03-08","2022-03-09","2022-03-14","2022-03-18","2022-03-21","2022-03-22","2022-03-23","2022-03-24","2022-03-25","2022-03-29","2022-03-31","2022-04-04","2022-04-06","2022-04-07","2022-04-12","2022-04-13","2022-04-14","2022-04-20","2022-04-22","2022-04-25","2022-04-26","2022-04-28","2022-04-29","2022-05-02","2022-05-03","2022-05-04","2022-05-09","2022-05-10","2022-05-12","2022-05-17","2022-05-20","2022-05-23","2022-05-24","2022-05-27","2022-05-31","2022-06-02","2022-06-06","2022-06-07","2022-06-13","2022-06-15","2022-06-16","2022-06-21","2022-06-22","2022-06-24","2022-06-28","2022-06-29","2022-06-30","2022-07-07","2022-07-13","2022-07-15","2022-07-18","2022-07-21","2022-07-26","2022-07-29","2022-08-02","2022-08-04","2022-08-08","2022-08-10","2022-08-11","2022-08-15","2022-08-24","2022-08-25","2022-09-06","2022-09-12","2022-09-13","2022-09-14","2022-09-21","2022-09-22","2022-09-27","2022-09-28","2022-09-30","2022-10-05","2022-10-11","2022-10-13","2022-10-14","2022-10-18","2022-10-20","2022-10-25","2022-10-27","2022-10-28","2022-11-03","2022-11-08","2022-11-09","2022-11-11","2022-11-14","2022-11-16","2022-11-18","2022-11-23","2022-11-29","2022-11-30","2022-12-01","2022-12-02","2022-12-07","2022-12-08","2022-12-09","2022-12-14","2022-12-19","2022-12-21","2022-12-22","2022-12-23","2022-12-28","2022-12-29","2023-01-05","2023-01-17","2023-01-19","2023-01-23","2023-01-25"]
[null,null,null,"$",{"$f":"Max-Width*ROW(INDIRECT(\"A1:A\"&Number_of_Bins))","v":327.08826343333334},{"$f":"Max-Width*(ROW(INDIRECT(\"A1:A\"&Number_of_Bins))-1)","v":331},{"$f":"IF((Upper_Bin_Column>=TRANSPOSE(Transform_Data[Min]))\n     *(Lower_Bin_Column<=TRANSPOSE(Transform_Data[Max])),\n\n_xlfn.IFS(Starting_Symbol=Up_Symbol,IF(MOD(Index_Row,2)=1,Up_Symbol,Down_Symbol),\n Starting_Symbol=Down_Symbol,IF(MOD(Index_Row,2)=1,Down_Symbol,Up_Symbol)),\"\")","v":"O"},"","","","","","","","","","","","","","","","","","","","","","","","","","","","","","","","","","","","","","","","","","","","","","","","","","","","","","","","","","","","","","","","","","","","","","","","","","","","","","","","","","","","","","","","","","","","","","","","","","","","","","","","","","","","","","","","","","","","","","","","","","","","","","","","",""]
[null,null,null,null,323.17652686666668,327.08826343333334,"O","","","","","","","","","","","","","","","","","","","","","","","","","","","","","","","","","","","","","","","","","","","","","","","","","","","","","","","","","","","","","","","","","","","","","","","","","","","","","","","","","","","","","","","","","","","","","","","","","","","","","","","","","","","","","","","","","","","","","","","","","","","","","","","","",""]
[null,null,null,null,319.26479030000002,323.17652686666668,"O","","","","","","","","","","","","","","","","","","","","","","","","","","","","","","","","","","","","","","","","","","","","","","","","","","","","","","","","","","","","","","","","","","","","","","","","","","","","","","","","","","","","","","","","","","","","","","","","","","","","","","","","","","","","","","","","","","","","","","","","","","","","","","","","",""]
[null,null,null,null,315.35305373333335,319.26479030000002,"O","","","","","","","","","","","","","","","","","","","","","","","","","","","","","","","","","","","","","","","","","","","","","","","","","","","","","","","","","","","","","","","","","","","","","","","","","","","","","","","","","","","","","","","","","","","","","","","","","","","","","","","","","","","","","","","","","","","","","","","","","","","","","","","","",""]
[null,null,null,null,311.44131716666669,315.35305373333335,"O","X","O","","","","","","","","","","","","","","","","","","","","","","","","","","","","","X","O","X","O","","","","","","","","","","","","","","","","","","","","","","","","","","","","","","","","","","","","","","","","","","","","","","","","","","","","","","","","","","","","","","","","","","","","","","","","","","","","","","","","","","","","","","","","","","","","","","",""]
[null,null,null,null,307.52958060000003,311.44131716666669,"O","X","O","","","","","","","X","O","X","O","","","X","O","","","","","","","","","","","","","","","X","O","X","O","","","","","","","","","","","","","","","","","","","","","","","","","","","","","","","","","","","","","","","","","","","","","","","","","","","","","","","","","","","","","","","","","","","","","","","","","","","","","","","","","","","","","","","","","","","","","","",""]
[null,null,null,null,303.61784403333331,307.52958060000003,"","","O","X","O","","","","","X","O","X","O","","","X","O","","","","","","","","","","","","","","","X","O","X","O","","","","","","","","","","","","","","","","","","","","","","","","","","","","","","","","","","","","","","","","","","","","","","","","","","","","","","","","","","","","","","","","","","","","","","","","","","","","","","","","","","","","","","","","","","","","","","",""]
[null,null,null,null,299.70610746666665,303.61784403333331,"","","O","X","O","X","O","","","X","","","O","X","O","X","O","","","","","","","","","","","X","O","X","O","X","","","O","","","","","","","","","","","","","","","","","","","","","","","","","","","","","","","","","","","","","","","","","","","","","","","","","","","","","","","","","","","","","","","","","","","","","","","","","","","","","","","","","","","","","","","","","","","","","","",""]
[null,null,null,null,295.79437089999999,299.70610746666665,"","","","","","","O","","","X","","","O","X","O","X","O","X","O","X","O","X","O","","","X","O","X","O","X","","","","","O","X","O","","","","","","","","","","","","","","","","","","","","","","","","","","","","","","","","","","","","","","","","","","","","","","","","","","","","","","","","","","","","","","","","","","","","","","","","","","","","","","","","","","","","","","","","","","","","",""]
[null,null,null,null,291.88263433333333,295.79437089999999,"","","","","","","O","X","O","X","","","","","","","O","X","O","X","O","X","O","","","X","","","","","","","","","","","O","","","","","","","","","","","","","","","","","","","","","","","","","","","","","","","","","","","","","","","","","","","","","X","O","","","","","","","","","","","","","","","","","","","","","","","","","","","","","","","","","","","","","","","","","","","","","","",""]
[null,null,null,null,287.97089776666667,291.88263433333333,"","","","","","","","","O","X","","","","","","","","","O","X","","","O","","","X","","","","","","","","","","","O","","","","","","","","","","","","","","","","","","","","","","","","","","","","","","","","","","","","","","","","","","","","","X","O","","","","","","","","","","","","","","","","","","","","","","","","","","","","","","","","","","","","","","","","","","","","","","",""]
[null,null,null,null,284.05916120000001,287.97089776666667,"","","","","","","","","O","X","","","","","","","","","O","X","","","O","X","O","X","","","","","","","","","","","O","X","O","X","O","","","X","O","","","X","O","","","","","","","","","","","","","","","","","","","","","","","","","","","","","","","X","O","X","O","","","","","","","","","","","","","","","","","","","","","","","","","","","","","","","","","","","","","","","","","","","","","","",""]
[null,null,null,null,280.14742463333334,284.05916120000001,"","","","","","","","","","","","","","","","","","","O","X","","","O","X","O","X","","","","","","","","","","","O","X","O","X","O","","","X","O","X","O","X","O","","","","","","","","","","","","","","","","","","","","","","","","","","","","","X","O","X","","","O","","","","","","","","","","","","","","","","","","","","","","","","","","","","","","","","","","","","","","","","","","","","","","",""]
[null,null,null,null,276.23568806666668,280.14742463333334,"","","","","","","","","","","","","","","","","","","O","X","","","O","X","O","X","","","","","","","","","","","O","X","O","X","O","X","O","X","O","X","O","X","O","","","","","","","","","","","","","","","","","","","","","","","","","","","X","O","X","O","X","","","O","X","O","","","","","","","","","","","","","","","","","","","","","","","","","","","","","","","","","","","","","","","","","","","","",""]
[null,null,null,null,272.32395150000002,276.23568806666668,"","","","","","","","","","","","","","","","","","","","","","","O","X","O","X","","","","","","","","","","","","","","","O","X","O","X","O","X","","","O","","","","","","","","","X","O","","","","","","","","","","","","","","","","","X","O","X","","","","","O","X","O","","","","","","","","","","","","","","","","","","","","","","","","","","","","","","","","","","","","","","","","","","","","",""]
[null,null,null,null,268.41221493333336,272.32395150000002,"","","","","","","","","","","","","","","","","","","","","","","","","","","","","","","","","","","","","","","","","O","X","O","X","","","","","O","","","","","","","X","O","X","O","X","O","","","","","","","","","","","","","","","X","","","","","","","","","O","","","","","","","","","","","","","","","","","","","","","","","","","","","","","","","","","","","","","","","","","","","","",""]
[null,null,null,null,264.5004783666667,268.41221493333336,"","","","","","","","","","","","","","","","","","","","","","","","","","","","","","","","","","","","","","","","","","","O","X","","","","","O","X","O","X","O","","","X","","","O","X","O","","","","","X","O","","","X","O","","","","","X","","","","","","","","","O","X","O","","","","","","","","","","","","","","","","","","","","","","","","","","","","","","","","","","","","","","","","","","",""]
[null,null,null,null,260.58874179999998,264.5004783666667,"","","","","","","","","","","","","","","","","","","","","","","","","","","","","","","","","","","","","","","","","","","","","","","","","O","X","O","X","O","","","X","","","","","O","","","","","X","O","","","X","O","","","X","O","X","","","","","","","","","O","X","O","","","","","","","","","","","","","","","","","","","","","","","","","","","","","","","","","","","","","","","","","","",""]
[null,null,null,null,256.67700523333332,260.58874179999998,"","","","","","","","","","","","","","","","","","","","","","","","","","","","","","","","","","","","","","","","","","","","","","","","","","","O","X","O","X","O","X","","","","","O","","","","","X","O","X","O","X","O","","","X","O","X","","","","","","","","","O","X","O","","","","","","","","","","","","","","","","","","","","","","","","","","","","","","","X","O","","","","","","","","","","",""]
[null,null,null,null,252.76526866666666,256.67700523333332,"","","","","","","","","","","","","","","","","","","","","","","","","","","","","","","","","","","","","","","","","","","","","","","","","","","O","X","O","X","","","","","","","O","","","","","X","O","X","O","X","O","X","O","X","O","X","","","","","","","","","O","X","O","","","","","","","","","","","","","","","","","","","","","","","","","X","O","X","O","","","X","O","","","","","","","","","","",""]
[null,null,null,null,248.8535321,252.76526866666666,"","","","","","","","","","","","","","","","","","","","","","","","","","","","","","","","","","","","","","","","","","","","","","","","","","","","","O","X","","","","","","","O","X","O","X","O","X","","","","","O","X","","","O","X","","","","","","","","","O","X","O","X","O","","","","","","","","","","","X","O","","","","","","","","","","","X","","","O","","","X","O","","","","","","","","","","",""]
[null,null,null,null,244.94179553333333,248.8535321,"","","","","","","","","","","","","","","","","","","","","","","","","","","","","","","","","","","","","","","","","","","","","","","","","","","","","","","","","","","","","O","X","O","X","","","","","","","","","","","","","","","","","","","","","","","","","O","","","","","X","O","","","","","X","O","","","","","X","O","","","X","O","X","","","O","X","O","X","O","","","","","","","","","","","X"]
[null,null,null,null,241.03005896666667,244.94179553333333,"","","","","","","","","","","","","","","","","","","","","","","","","","","","","","","","","","","","","","","","","","","","","","","","","","","","","","","","","","","","","O","X","O","X","","","","","","","","","","","","","","","","","","","","","","","","","O","","","","","X","O","","","","","X","O","","","","","X","O","X","O","X","O","X","","","O","X","","","O","X","O","","","","","","","X","O","X"]
[null,null,null,null,237.11832240000001,241.03005896666667,"","","","","","","","","","","","","","","","","","","","","","","","","","","","","","","","","","","","","","","","","","","","","","","","","","","","","","","","","","","","","","","","","","","","","","","","","","","","","","","","","","","","","","","","","O","X","O","X","O","X","O","","","X","O","X","O","","","","","X","O","X","","","O","X","","","","","","","O","X","O","X","O","X","O","X","O","X","O","X"]
[null,null,null,null,233.20658583333335,237.11832240000001,"","","","","","","","","","","","","","","","","","","","","","","","","","","","","","","","","","","","","","","","","","","","","","","","","","","","","","","","","","","","","","","","","","","","","","","","","","","","","","","","","","","","","","","","","","","O","X","O","X","O","X","O","X","O","X","O","X","O","","","X","","","","","","","","","","","","","","","","","O","X","O","X","O","X","",""]
[null,null,null,null,229.29484926666669,233.20658583333335,"","","","","","","","","","","","","","","","","","","","","","","","","","","","","","","","","","","","","","","","","","","","","","","","","","","","","","","","","","","","","","","","","","","","","","","","","","","","","","","","","","","","","","","","","","","","","O","X","O","X","O","X","","","O","X","O","","","X","","","","","","","","","","","","","","","","","","","O","X","O","X","",""]
[null,null,null,null,225.38311270000003,229.29484926666669,"","","","","","","","","","","","","","","","","","","","","","","","","","","","","","","","","","","","","","","","","","","","","","","","","","","","","","","","","","","","","","","","","","","","","","","","","","","","","","","","","","","","","","","","","","","","","","","O","X","O","X","","","O","X","O","X","O","X","","","","","","","","","","","","","","","","","","","O","X","","","",""]
[null,null,null,null,221.47137613333334,225.38311270000003,"","","","","","","","","","","","","","","","","","","","","","","","","","","","","","","","","","","","","","","","","","","","","","","","","","","","","","","","","","","","","","","","","","","","","","","","","","","","","","","","","","","","","","","","","","","","","","","O","X","","","","","","","O","X","O","X","","","","","","","","","","","","","","","","","","","O","X","","","",""]
[null,null,null,null,217.55963956666668,221.47137613333334,"","","","","","","","","","","","","","","","","","","","","","","","","","","","","","","","","","","","","","","","","","","","","","","","","","","","","","","","","","","","","","","","","","","","","","","","","","","","","","","","","","","","","","","","","","","","","","","","","","","","","","","O","X","","","","","","","","","","","","","","","","","","","","","","","","","",""]
[null,null,null,null,213.64790300000001,217.55963956666668,"","","","","","","","","","","","","","","","","","","","","","","","","","","","","","","","","","","","","","","","","","","","","","","","","","","","","","","","","","","","","","","","","","","","","","","","","","","","","","","","","","","","","","","","","","","","","","","","","","","","","","","O","X","","","","","","","","","","","","","","","","","","","","","","","","","",""]

{"sheet":"PnF-DA","index":6,"n_rows":40,"n_cols":136,"rows_kept":40,"cut":false,"hidden":false,"merged":[[2,0,2,4]]}
[{"$f":"IF(ISERROR(RIGHT(CELL(\"filename\",A1),LEN(CELL(\"filename\",A1))-FIND(\"]\",CELL(\"filename\",A1)))),\n\"\",\nRIGHT(CELL(\"filename\",A1),LEN(CELL(\"filename\",A1))-FIND(\"]\",CELL(\"filename\",A1))))","v":"PnF-DA"}]
[{"$f":"Model_Name","v":"SP Point and Figure Chart - Complete.xlsm"}]
["Navigator"]
[null,"Error Checks:",null,null,null,{"$f":"Overall_Error_Check","v":0}]
[]
[null,{"$f":"MAX($B$5:$B5)+1","v":1},{"$f":"A1","v":"PnF-DA"}]
[]
[null,null,null,null,null,null,"Date"]
[null,null,null,null,null,null,{"$f":"TRANSPOSE(Transform_Data[Unique Index])","v":1},2,3,4,5,6,7,8,9,10,11,12,13,14,15,16,17,18,19,20,21,22,23,24,25,26,27,28,29,30,31,32,33,34,35,36,37,38,39,40,41,42,43,44,45,46,47,48,49,50,51,52,53,54,55,56,57,58,59,60,61,62,63,64,65,66,67,68,69,70,71,72,73,74,75,76,77,78,79,80,81,82,83,84,85,86,87,88,89,90,91,92,93,94,95,96,97,98,99,100,101,102,103,104,105,106,107,108,109,110,111,112,113,114,115,116,117,118,119,120,121,122,123,124,125,126,127,128,129,130]
[null,null,null,null,"Lower Bin","Upper Bin",{"$f":"TRANSPOSE(Transform_Data[Date])","v":"2022-01-03"},"2022-01-06","2022-01-12","2022-01-13","2022-01-14","2022-01-18","2022-01-19","2022-01-21","2022-01-24","2022-01-25","2022-01-31","2022-02-01","2022-02-02","2022-02-03","2022-02-04","2022-02-07","2022-02-09","2022-02-14","2022-02-15","2022-02-23","2022-02-28","2022-03-01","2022-03-02","2022-03-08","2022-03-09","2022-03-14","2022-03-18","2022-03-21","2022-03-22","2022-03-23","2022-03-24","2022-03-25","2022-03-29","2022-03-31","2022-04-04","2022-04-06","2022-04-07","2022-04-12","2022-04-13","2022-04-14","2022-04-20","2022-04-22","2022-04-25","2022-04-26","2022-04-28","2022-04-29","2022-05-02","2022-05-03","2022-05-04","2022-05-09","2022-05-10","2022-05-12","2022-05-17","2022-05-20","2022-05-23","2022-05-24","2022-05-27","2022-05-31","2022-06-02","2022-06-06","2022-06-07","2022-06-13","2022-06-15","2022-06-16","2022-06-21","2022-06-22","2022-06-24","2022-06-28","2022-06-29","2022-06-30","2022-07-07","2022-07-13","2022-07-15","2022-07-18","2022-07-21","2022-07-26","2022-07-29","2022-08-02","2022-08-04","2022-08-08","2022-08-10","2022-08-11","2022-08-15","2022-08-24","2022-08-25","2022-09-06","2022-09-12","2022-09-13","2022-09-14","2022-09-21","2022-09-22","2022-09-27","2022-09-28","2022-09-30","2022-10-05","2022-10-11","2022-10-13","2022-10-14","2022-10-18","2022-10-20","2022-10-25","2022-10-27","2022-10-28","2022-11-03","2022-11-08","2022-11-09","2022-11-11","2022-11-14","2022-11-16","2022-11-18","2022-11-23","2022-11-29","2022-11-30","2022-12-01","2022-12-02","2022-12-07","2022-12-08","2022-12-09","2022-12-14","2022-12-19","2022-12-21","2022-12-22","2022-12-23","2022-12-28","2022-12-29","2023-01-05","2023-01-17","2023-01-19","2023-01-23","2023-01-25"]
[null,null,null,"$",{"$f":"Max-Width*_xlfn.SEQUENCE(Number_of_Bins)","v":327.08826343333334},{"$f":"Max-Width*(_xlfn.SEQUENCE(Number_of_Bins)-1)","v":331},{"$f":"IF((_xlfn.ANCHORARRAY(F11)>=TRANSPOSE(Transform_Data[Min]))\n     *(_xlfn.ANCHORARRAY(E11)<=TRANSPOSE(Transform_Data[Max])),\n\n_xlfn.IFS(Starting_Symbol=Up_Symbol,IF(MOD(_xlfn.ANCHORARRAY(G9),2)=1,Up_Symbol,Down_Symbol),\n Starting_Symbol=Down_Symbol,IF(MOD(_xlfn.ANCHORARRAY(G9),2)=1,Down_Symbol,Up_Symbol)),\"\")","v":"O"},"","","","","","","","","","","","","","","","","","","","","","","","","","","","","","","","","","","","","","","","","","","","","","","","","","","","","","","","","","","","","","","","","","","","","","","","","","","","","","","","","","","","","","","","","","","","","","","","","","","","","","","","","","","","","","","","","","","","","","","","","","","","","","","","",""]
[null,null,null,null,323.17652686666668,327.08826343333334,"O","","","","","","","","","","","","","","","","","","","","","","","","","","","","","","","","","","","","","","","","","","","","","","","","","","","","","","","","","","","","","","","","","","","","","","","","","","","","","","","","","","","","","","","","","","","","","","","","","","","","","","","","","","","","","","","","","","","","","","","","","","","","","","","","",""]
[null,null,null,null,319.26479030000002,323.17652686666668,"O","","","","","","","","","","","","","","","","","","","","","","","","","","","","","","","","","","","","","","","","","","","","","","","","","","","","","","","","","","","","","","","","","","","","","","","","","","","","","","","","","","","","","","","","","","","","","","","","","","","","","","","","","","","","","","","","","","","","","","","","","","","","","","","","",""]
[null,null,null,null,315.35305373333335,319.26479030000002,"O","","","","","","","","","","","","","","","","","","","","","","","","","","","","","","","","","","","","","","","","","","","","","","","","","","","","","","","","","","","","","","","","","","","","","","","","","","","","","","","","","","","","","","","","","","","","","","","","","","","","","","","","","","","","","","","","","","","","","","","","","","","","","","","","",""]
[null,null,null,null,311.44131716666669,315.35305373333335,"O","X","O","","","","","","","","","","","","","","","","","","","","","","","","","","","","","X","O","X","O","","","","","","","","","","","","","","","","","","","","","","","","","","","","","","","","","","","","","","","","","","","","","","","","","","","","","","","","","","","","","","","","","","","","","","","","","","","","","","","","","","","","","","","","","","","","","","",""]
[null,null,null,null,307.52958060000003,311.44131716666669,"O","X","O","","","","","","","X","O","X","O","","","X","O","","","","","","","","","","","","","","","X","O","X","O","","","","","","","","","","","","","","","","","","","","","","","","","","","","","","","","","","","","","","","","","","","","","","","","","","","","","","","","","","","","","","","","","","","","","","","","","","","","","","","","","","","","","","","","","","","","","","",""]
[null,null,null,null,303.61784403333331,307.52958060000003,"","","O","X","O","","","","","X","O","X","O","","","X","O","","","","","","","","","","","","","","","X","O","X","O","","","","","","","","","","","","","","","","","","","","","","","","","","","","","","","","","","","","","","","","","","","","","","","","","","","","","","","","","","","","","","","","","","","","","","","","","","","","","","","","","","","","","","","","","","","","","","",""]
[null,null,null,null,299.70610746666665,303.61784403333331,"","","O","X","O","X","O","","","X","","","O","X","O","X","O","","","","","","","","","","","X","O","X","O","X","","","O","","","","","","","","","","","","","","","","","","","","","","","","","","","","","","","","","","","","","","","","","","","","","","","","","","","","","","","","","","","","","","","","","","","","","","","","","","","","","","","","","","","","","","","","","","","","","","",""]
[null,null,null,null,295.79437089999999,299.70610746666665,"","","","","","","O","","","X","","","O","X","O","X","O","X","O","X","O","X","O","","","X","O","X","O","X","","","","","O","X","O","","","","","","","","","","","","","","","","","","","","","","","","","","","","","","","","","","","","","","","","","","","","","","","","","","","","","","","","","","","","","","","","","","","","","","","","","","","","","","","","","","","","","","","","","","","","",""]
[null,null,null,null,291.88263433333333,295.79437089999999,"","","","","","","O","X","O","X","","","","","","","O","X","O","X","O","X","O","","","X","","","","","","","","","","","O","","","","","","","","","","","","","","","","","","","","","","","","","","","","","","","","","","","","","","","","","","","","","X","O","","","","","","","","","","","","","","","","","","","","","","","","","","","","","","","","","","","","","","","","","","","","","","",""]
[null,null,null,null,287.97089776666667,291.88263433333333,"","","","","","","","","O","X","","","","","","","","","O","X","","","O","","","X","","","","","","","","","","","O","","","","","","","","","","","","","","","","","","","","","","","","","","","","","","","","","","","","","","","","","","","","","X","O","","","","","","","","","","","","","","","","","","","","","","","","","","","","","","","","","","","","","","","","","","","","","","",""]
[null,null,null,null,284.05916120000001,287.97089776666667,"","","","","","","","","O","X","","","","","","","","","O","X","","","O","X","O","X","","","","","","","","","","","O","X","O","X","O","","","X","O","","","X","O","","","","","","","","","","","","","","","","","","","","","","","","","","","","","","","X","O","X","O","","","","","","","","","","","","","","","","","","","","","","","","","","","","","","","","","","","","","","","","","","","","","","",""]
[null,null,null,null,280.14742463333334,284.05916120000001,"","","","","","","","","","","","","","","","","","","O","X","","","O","X","O","X","","","","","","","","","","","O","X","O","X","O","","","X","O","X","O","X","O","","","","","","","","","","","","","","","","","","","","","","","","","","","","","X","O","X","","","O","","","","","","","","","","","","","","","","","","","","","","","","","","","","","","","","","","","","","","","","","","","","","","",""]
[null,null,null,null,276.23568806666668,280.14742463333334,"","","","","","","","","","","","","","","","","","","O","X","","","O","X","O","X","","","","","","","","","","","O","X","O","X","O","X","O","X","O","X","O","X","O","","","","","","","","","","","","","","","","","","","","","","","","","","","X","O","X","O","X","","","O","X","O","","","","","","","","","","","","","","","","","","","","","","","","","","","","","","","","","","","","","","","","","","","","",""]
[null,null,null,null,272.32395150000002,276.23568806666668,"","","","","","","","","","","","","","","","","","","","","","","O","X","O","X","","","","","","","","","","","","","","","O","X","O","X","O","X","","","O","","","","","","","","","X","O","","","","","","","","","","","","","","","","","X","O","X","","","","","O","X","O","","","","","","","","","","","","","","","","","","","","","","","","","","","","","","","","","","","","","","","","","","","","",""]
[null,null,null,null,268.41221493333336,272.32395150000002,"","","","","","","","","","","","","","","","","","","","","","","","","","","","","","","","","","","","","","","","","O","X","O","X","","","","","O","","","","","","","X","O","X","O","X","O","","","","","","","","","","","","","","","X","","","","","","","","","O","","","","","","","","","","","","","","","","","","","","","","","","","","","","","","","","","","","","","","","","","","","","",""]
[null,null,null,null,264.5004783666667,268.41221493333336,"","","","","","","","","","","","","","","","","","","","","","","","","","","","","","","","","","","","","","","","","","","O","X","","","","","O","X","O","X","O","","","X","","","O","X","O","","","","","X","O","","","X","O","","","","","X","","","","","","","","","O","X","O","","","","","","","","","","","","","","","","","","","","","","","","","","","","","","","","","","","","","","","","","","",""]
[null,null,null,null,260.58874179999998,264.5004783666667,"","","","","","","","","","","","","","","","","","","","","","","","","","","","","","","","","","","","","","","","","","","","","","","","","O","X","O","X","O","","","X","","","","","O","","","","","X","O","","","X","O","","","X","O","X","","","","","","","","","O","X","O","","","","","","","","","","","","","","","","","","","","","","","","","","","","","","","","","","","","","","","","","","",""]
[null,null,null,null,256.67700523333332,260.58874179999998,"","","","","","","","","","","","","","","","","","","","","","","","","","","","","","","","","","","","","","","","","","","","","","","","","","","O","X","O","X","O","X","","","","","O","","","","","X","O","X","O","X","O","","","X","O","X","","","","","","","","","O","X","O","","","","","","","","","","","","","","","","","","","","","","","","","","","","","","","X","O","","","","","","","","","","",""]
[null,null,null,null,252.76526866666666,256.67700523333332,"","","","","","","","","","","","","","","","","","","","","","","","","","","","","","","","","","","","","","","","","","","","","","","","","","","O","X","O","X","","","","","","","O","","","","","X","O","X","O","X","O","X","O","X","O","X","","","","","","","","","O","X","O","","","","","","","","","","","","","","","","","","","","","","","","","X","O","X","O","","","X","O","","","","","","","","","","",""]
[null,null,null,null,248.8535321,252.76526866666666,"","","","","","","","","","","","","","","","","","","","","","","","","","","","","","","","","","","","","","","","","","","","","","","","","","","","","O","X","","","","","","","O","X","O","X","O","X","","","","","O","X","","","O","X","","","","","","","","","O","X","O","X","O","","","","","","","","","","","X","O","","","","","","","","","","","X","","","O","","","X","O","","","","","","","","","","",""]
[null,null,null,null,244.94179553333333,248.8535321,"","","","","","","","","","","","","","","","","","","","","","","","","","","","","","","","","","","","","","","","","","","","","","","","","","","","","","","","","","","","","O","X","O","X","","","","","","","","","","","","","","","","","","","","","","","","","O","","","","","X","O","","","","","X","O","","","","","X","O","","","X","O","X","","","O","X","O","X","O","","","","","","","","","","","X"]
[null,null,null,null,241.03005896666667,244.94179553333333,"","","","","","","","","","","","","","","","","","","","","","","","","","","","","","","","","","","","","","","","","","","","","","","","","","","","","","","","","","","","","O","X","O","X","","","","","","","","","","","","","","","","","","","","","","","","","O","","","","","X","O","","","","","X","O","","","","","X","O","X","O","X","O","X","","","O","X","","","O","X","O","","","","","","","X","O","X"]
[null,null,null,null,237.11832240000001,241.03005896666667,"","","","","","","","","","","","","","","","","","","","","","","","","","","","","","","","","","","","","","","","","","","","","","","","","","","","","","","","","","","","","","","","","","","","","","","","","","","","","","","","","","","","","","","","","O","X","O","X","O","X","O","","","X","O","X","O","","","","","X","O","X","","","O","X","","","","","","","O","X","O","X","O","X","O","X","O","X","O","X"]
[null,null,null,null,233.20658583333335,237.11832240000001,"","","","","","","","","","","","","","","","","","","","","","","","","","","","","","","","","","","","","","","","","","","","","","","","","","","","","","","","","","","","","","","","","","","","","","","","","","","","","","","","","","","","","","","","","","","O","X","O","X","O","X","O","X","O","X","O","X","O","","","X","","","","","","","","","","","","","","","","","O","X","O","X","O","X","",""]
[null,null,null,null,229.29484926666669,233.20658583333335,"","","","","","","","","","","","","","","","","","","","","","","","","","","","","","","","","","","","","","","","","","","","","","","","","","","","","","","","","","","","","","","","","","","","","","","","","","","","","","","","","","","","","","","","","","","","","O","X","O","X","O","X","","","O","X","O","","","X","","","","","","","","","","","","","","","","","","","O","X","O","X","",""]
[null,null,null,null,225.38311270000003,229.29484926666669,"","","","","","","","","","","","","","","","","","","","","","","","","","","","","","","","","","","","","","","","","","","","","","","","","","","","","","","","","","","","","","","","","","","","","","","","","","","","","","","","","","","","","","","","","","","","","","","O","X","O","X","","","O","X","O","X","O","X","","","","","","","","","","","","","","","","","","","O","X","","","",""]
[null,null,null,null,221.47137613333334,225.38311270000003,"","","","","","","","","","","","","","","","","","","","","","","","","","","","","","","","","","","","","","","","","","","","","","","","","","","","","","","","","","","","","","","","","","","","","","","","","","","","","","","","","","","","","","","","","","","","","","","O","X","","","","","","","O","X","O","X","","","","","","","","","","","","","","","","","","","O","X","","","",""]
[null,null,null,null,217.55963956666668,221.47137613333334,"","","","","","","","","","","","","","","","","","","","","","","","","","","","","","","","","","","","","","","","","","","","","","","","","","","","","","","","","","","","","","","","","","","","","","","","","","","","","","","","","","","","","","","","","","","","","","","","","","","","","","","O","X","","","","","","","","","","","","","","","","","","","","","","","","","",""]
[null,null,null,null,213.64790300000001,217.55963956666668,"","","","","","","","","","","","","","","","","","","","","","","","","","","","","","","","","","","","","","","","","","","","","","","","","","","","","","","","","","","","","","","","","","","","","","","","","","","","","","","","","","","","","","","","","","","","","","","","","","","","","","","O","X","","","","","","","","","","","","","","","","","","","","","","","","","",""]

{"sheet":"Data_BB","index":7,"n_rows":301,"n_cols":21,"rows_kept":301,"cut":false,"hidden":false,"merged":[[2,0,2,4]]}
[{"$f":"IF(ISERROR(RIGHT(CELL(\"filename\",A1),LEN(CELL(\"filename\",A1))-FIND(\"]\",CELL(\"filename\",A1)))),\n\"\",\nRIGHT(CELL(\"filename\",A1),LEN(CELL(\"filename\",A1))-FIND(\"]\",CELL(\"filename\",A1))))","v":"Data_BB"}]
[{"$f":"Model_Name","v":"SP Point and Figure Chart - Complete.xlsm"}]
["Navigator"]
[null,"Error Checks:",null,null,null,{"$f":"Overall_Error_Check","v":0}]
[]
[null,{"$f":"MAX($B$5:$B5)+1","v":1},{"$f":"A1","v":"Data_BB"}]
[]
[null,null,"Summary Data"]
[]
[null,null,null,"Min",null,{"$f":"SMALL(Data_BB[Lower Bollinger Band],2)","v":202.95293435169449}]
[null,null,null,"Max",null,{"$f":"MAX(Data_BB[Upper Bollinger Band])","v":350.58437925611059}]
[null,null,null,"Range",null,{"$f":"Max_BB-Min_BB","v":147.6314449044161}]
[]
[null,null,null,"Bin Width",null,30]
[null,null,null,"Width",null,{"$f":"Range_BB/Number_of_Bins_BB","v":4.9210481634805365}]
[]
[null,null,null,"Up Symbol",null,"X"]
[null,null,null,"Down Symbol",null,"O"]
[null,null,null,"Starting Symbol",null,{"$f":"IF(F33<>\"\",Up_Symbol_BB,Down_Symbol_BB)","v":"O"}]
[]
[]
[null,null,"Bollinger Band Data"]
[]
[null,null,null,"Standard Deviation",null,3]
[null,null,null,"Range",null,20]
[]
[null,null,null,"Bollinger Band Symbol",null,"+++"]
[]
[]
[null,null,"Data Table",null,null,null,null,null,null,null,null,null,"Date"]
[null,null,null,"The Adjusted Close Price is took from MSFT stock on Yahoo Finance"]
[null,null,null,"Date","Adj Close","Up","Switch Location","Index","Lag Index U","Upper Bollinger Band","Lower Bollinger Band",null,null,"Unique Index","Date","Max Stock","Min Stock","Max Upper Band","Min Upper Band","Max Lower Band","Min Lower Band"]
[null,null,null,"2022-01-03",331,{"$f":"IF(Data_BB[[#This Row],[Adj Close]]<E34,TRUE,\"\")","v":""},{"$f":"IF(F32=Data_BB[[#This Row],[Up]],0,1)","v":1},{"$f":"SUM($G$33:G33)","v":1},{"$f":"N(H32)","v":0},{"$f":"AVERAGE(OFFSET(E32,1,,-MIN(Bollinger_Band_Range_BB,COUNTA(E$32:E32)))+Standard_Deviation_BB*IFERROR(STDEV(OFFSET(E32,1,,-MIN(Bollinger_Band_Range_BB,COUNTA(E$32:E32)))),0))","v":331},{"$f":"IFERROR(AVERAGE(OFFSET(E32,1,,-MIN(Bollinger_Band_Range_BB,COUNTA(E$32:E32)))-Standard_Deviation_BB*IFERROR(STDEV(OFFSET(E32,1,,-MIN(Bollinger_Band_Range_BB,COUNTA(E$32:E32)))),0)),0)","v":331},null,null,{"$f":"N(N32)+1","v":1},{"$f":"INDEX(Data_BB[Date],MATCH(N33,Data_BB[Index],0))","v":"2022-01-03"},{"$f":"MAX(IF(N33=Data_BB[Index],Data_BB[Adj Close],0),IF(N33=Data_BB[Lag Index U],Data_BB[Adj Close],0))","v":331},{"$f":"MIN(IF(N33=Data_BB[Index],Data_BB[Adj Close]),IF(N33=Data_BB[Lag Index U],Data_BB[Adj Close]))","v":310.96621699999997},{"$f":"MAX(IF(N33=Data_BB[Index],Data_BB[Upper Bollinger Band],0),IF(N33=Data_BB[Lag Index U],Data_BB[Upper Bollinger Band],0))","v":350.58437925611059},{"$f":"MIN(IF(N33=Data_BB[Index],Data_BB[Upper Bollinger Band]),IF(N33=Data_BB[Lag Index U],Data_BB[Upper Bollinger Band]))","v":331},{"$f":"MAX(IF(N33=Data_BB[Index],Data_BB[Lower Bollinger Band],0),IF(N33=Data_BB[Lag Index U],Data_BB[Lower Bollinger Band],0))","v":331},{"$f":"MIN(IF(N33=Data_BB[Index],Data_BB[Lower Bollinger Band]),IF(N33=Data_BB[Lag Index U],Data_BB[Lower Bollinger Band]))","v":291.32699753868945}]
[null,null,null,"2022-01-04",325.95575000000002,{"$f":"IF(Data_BB[[#This Row],[Adj Close]]<E35,TRUE,\"\")","v":""},{"$f":"IF(F33=Data_BB[[#This Row],[Up]],0,1)","v":0},{"$f":"SUM($G$33:G34)","v":1},1,{"$f":"AVERAGE(OFFSET(E33,1,,-MIN(Bollinger_Band_Range_BB,COUNTA(E$32:E33)))+Standard_Deviation_BB*IFERROR(STDEV(OFFSET(E33,1,,-MIN(Bollinger_Band_Range_BB,COUNTA(E$32:E33)))),0))","v":339.17834514300068},{"$f":"IFERROR(AVERAGE(OFFSET(E33,1,,-MIN(Bollinger_Band_Range_BB,COUNTA(E$32:E33)))-Standard_Deviation_BB*IFERROR(STDEV(OFFSET(E33,1,,-MIN(Bollinger_Band_Range_BB,COUNTA(E$32:E33)))),0)),0)","v":317.77740485699928},null,null,{"$f":"N(N33)+1","v":2},{"$f":"INDEX(Data_BB[Date],MATCH(N34,Data_BB[Index],0))","v":"2022-01-06"},{"$f":"MAX(IF(N34=Data_BB[Index],Data_BB[Adj Close],0),IF(N34=Data_BB[Lag Index U],Data_BB[Adj Close],0))","v":315.31542999999999},{"$f":"MIN(IF(N34=Data_BB[Index],Data_BB[Adj Close]),IF(N34=Data_BB[Lag Index U],Data_BB[Adj Close]))","v":310.96621699999997},{"$f":"MAX(IF(N34=Data_BB[Index],Data_BB[Upper Bollinger Band],0),IF(N34=Data_BB[Lag Index U],Data_BB[Upper Bollinger Band],0))","v":349.3554824613106},{"$f":"MIN(IF(N34=Data_BB[Index],Data_BB[Upper Bollinger Band]),IF(N34=Data_BB[Lag Index U],Data_BB[Upper Bollinger Band]))","v":339.53130002539012},{"$f":"MAX(IF(N34=Data_BB[Index],Data_BB[Lower Bollinger Band],0),IF(N34=Data_BB[Lag Index U],Data_BB[Lower Bollinger Band],0))","v":293.27212122460998},{"$f":"MIN(IF(N34=Data_BB[Index],Data_BB[Lower Bollinger Band]),IF(N34=Data_BB[Lag Index U],Data_BB[Lower Bollinger Band]))","v":290.49313085990696}]
[null,null,null,"2022-01-05",313.442993,{"$f":"IF(Data_BB[[#This Row],[Adj Close]]<E36,TRUE,\"\")","v":""},{"$f":"IF(F34=Data_BB[[#This Row],[Up]],0,1)","v":0},{"$f":"SUM($G$33:G35)","v":1},1,{"$f":"AVERAGE(OFFSET(E34,1,,-MIN(Bollinger_Band_Range_BB,COUNTA(E$32:E34)))+Standard_Deviation_BB*IFERROR(STDEV(OFFSET(E34,1,,-MIN(Bollinger_Band_Range_BB,COUNTA(E$32:E34)))),0))","v":350.58437925611059},{"$f":"IFERROR(AVERAGE(OFFSET(E34,1,,-MIN(Bollinger_Band_Range_BB,COUNTA(E$32:E34)))-Standard_Deviation_BB*IFERROR(STDEV(OFFSET(E34,1,,-MIN(Bollinger_Band_Range_BB,COUNTA(E$32:E34)))),0)),0)","v":296.34811607722276},null,null,3,{"$f":"INDEX(Data_BB[Date],MATCH(N35,Data_BB[Index],0))","v":"2022-01-12"},{"$f":"MAX(IF(N35=Data_BB[Index],Data_BB[Adj Close],0),IF(N35=Data_BB[Lag Index U],Data_BB[Adj Close],0))","v":315.31542999999999},{"$f":"MIN(IF(N35=Data_BB[Index],Data_BB[Adj Close]),IF(N35=Data_BB[Lag Index U],Data_BB[Adj Close]))","v":301.97048999999998},{"$f":"MAX(IF(N35=Data_BB[Index],Data_BB[Upper Bollinger Band],0),IF(N35=Data_BB[Lag Index U],Data_BB[Upper Bollinger Band],0))","v":340.80527526008586},{"$f":"MIN(IF(N35=Data_BB[Index],Data_BB[Upper Bollinger Band]),IF(N35=Data_BB[Lag Index U],Data_BB[Upper Bollinger Band]))","v":339.53130002539012},{"$f":"MAX(IF(N35=Data_BB[Index],Data_BB[Lower Bollinger Band],0),IF(N35=Data_BB[Lag Index U],Data_BB[Lower Bollinger Band],0))","v":293.27212122460998},{"$f":"MIN(IF(N35=Data_BB[Index],Data_BB[Lower Bollinger Band]),IF(N35=Data_BB[Lag Index U],Data_BB[Lower Bollinger Band]))","v":288.79120807324756}]
[null,null,null,"2022-01-06",310.96621699999997,{"$f":"IF(Data_BB[[#This Row],[Adj Close]]<E37,TRUE,\"\")","v":true},{"$f":"IF(F35=Data_BB[[#This Row],[Up]],0,1)","v":1},{"$f":"SUM($G$33:G36)","v":2},1,{"$f":"AVERAGE(OFFSET(E35,1,,-MIN(Bollinger_Band_Range_BB,COUNTA(E$32:E35)))+Standard_Deviation_BB*IFERROR(STDEV(OFFSET(E35,1,,-MIN(Bollinger_Band_Range_BB,COUNTA(E$32:E35)))),0))","v":349.3554824613106},{"$f":"IFERROR(AVERAGE(OFFSET(E35,1,,-MIN(Bollinger_Band_Range_BB,COUNTA(E$32:E35)))-Standard_Deviation_BB*IFERROR(STDEV(OFFSET(E35,1,,-MIN(Bollinger_Band_Range_BB,COUNTA(E$32:E35)))),0)),0)","v":291.32699753868945},null,null,4,{"$f":"INDEX(Data_BB[Date],MATCH(N36,Data_BB[Index],0))","v":"2022-01-13"},{"$f":"MAX(IF(N36=Data_BB[Index],Data_BB[Adj Close],0),IF(N36=Data_BB[Lag Index U],Data_BB[Adj Close],0))","v":307.320404},{"$f":"MIN(IF(N36=Data_BB[Index],Data_BB[Adj Close]),IF(N36=Data_BB[Lag Index U],Data_BB[Adj Close]))","v":301.97048999999998},{"$f":"MAX(IF(N36=Data_BB[Index],Data_BB[Upper Bollinger Band],0),IF(N36=Data_BB[Lag Index U],Data_BB[Upper Bollinger Band],0))","v":340.80527526008586},{"$f":"MIN(IF(N36=Data_BB[Index],Data_BB[Upper Bollinger Band]),IF(N36=Data_BB[Lag Index U],Data_BB[Upper Bollinger Band]))","v":339.57574519972803},{"$f":"MAX(IF(N36=Data_BB[Index],Data_BB[Lower Bollinger Band],0),IF(N36=Data_BB[Lag Index U],Data_BB[Lower Bollinger Band],0))","v":288.79120807324756},{"$f":"MIN(IF(N36=Data_BB[Index],Data_BB[Lower Bollinger Band]),IF(N36=Data_BB[Lag Index U],Data_BB[Lower Bollinger Band]))","v":288.52517060027202}]
[null,null,null,"2022-01-07",311.12472500000001,{"$f":"IF(Data_BB[[#This Row],[Adj Close]]<E38,TRUE,\"\")","v":true},{"$f":"IF(F36=Data_BB[[#This Row],[Up]],0,1)","v":0},{"$f":"SUM($G$33:G37)","v":2},2,{"$f":"AVERAGE(OFFSET(E36,1,,-MIN(Bollinger_Band_Range_BB,COUNTA(E$32:E36)))+Standard_Deviation_BB*IFERROR(STDEV(OFFSET(E36,1,,-MIN(Bollinger_Band_Range_BB,COUNTA(E$32:E36)))),0))","v":346.502743140093},{"$f":"IFERROR(AVERAGE(OFFSET(E36,1,,-MIN(Bollinger_Band_Range_BB,COUNTA(E$32:E36)))-Standard_Deviation_BB*IFERROR(STDEV(OFFSET(E36,1,,-MIN(Bollinger_Band_Range_BB,COUNTA(E$32:E36)))),0)),0)","v":290.49313085990696},null,null,5,{"$f":"INDEX(Data_BB[Date],MATCH(N37,Data_BB[Index],0))","v":"2022-01-14"},{"$f":"MAX(IF(N37=Data_BB[Index],Data_BB[Adj Close],0),IF(N37=Data_BB[Lag Index U],Data_BB[Adj Close],0))","v":307.320404},{"$f":"MIN(IF(N37=Data_BB[Index],Data_BB[Adj Close]),IF(N37=Data_BB[Lag Index U],Data_BB[Adj Close]))","v":299.84045400000002},{"$f":"MAX(IF(N37=Data_BB[Index],Data_BB[Upper Bollinger Band],0),IF(N37=Data_BB[Lag Index U],Data_BB[Upper Bollinger Band],0))","v":340.17390847627979},{"$f":"MIN(IF(N37=Data_BB[Index],Data_BB[Upper Bollinger Band]),IF(N37=Data_BB[Lag Index U],Data_BB[Upper Bollinger Band]))","v":339.57574519972803},{"$f":"MAX(IF(N37=Data_BB[Index],Data_BB[Lower Bollinger Band],0),IF(N37=Data_BB[Lag Index U],Data_BB[Lower Bollinger Band],0))","v":288.52517060027202},{"$f":"MIN(IF(N37=Data_BB[Index],Data_BB[Lower Bollinger Band]),IF(N37=Data_BB[Lag Index U],Data_BB[Lower Bollinger Band]))","v":285.34337025099285}]
[null,null,null,"2022-01-10",311.35257000000001,{"$f":"IF(Data_BB[[#This Row],[Adj Close]]<E39,TRUE,\"\")","v":true},{"$f":"IF(F37=Data_BB[[#This Row],[Up]],0,1)","v":0},{"$f":"SUM($G$33:G38)","v":2},2,{"$f":"AVERAGE(OFFSET(E37,1,,-MIN(Bollinger_Band_Range_BB,COUNTA(E$32:E37)))+Standard_Deviation_BB*IFERROR(STDEV(OFFSET(E37,1,,-MIN(Bollinger_Band_Range_BB,COUNTA(E$32:E37)))),0))","v":343.84003588375504},{"$f":"IFERROR(AVERAGE(OFFSET(E37,1,,-MIN(Bollinger_Band_Range_BB,COUNTA(E$32:E37)))-Standard_Deviation_BB*IFERROR(STDEV(OFFSET(E37,1,,-MIN(Bollinger_Band_Range_BB,COUNTA(E$32:E37)))),0)),0)","v":290.77404911624495},null,null,6,{"$f":"INDEX(Data_BB[Date],MATCH(N38,Data_BB[Index],0))","v":"2022-01-18"},{"$f":"MAX(IF(N38=Data_BB[Index],Data_BB[Adj Close],0),IF(N38=Data_BB[Lag Index U],Data_BB[Adj Close],0))","v":300.51409899999999},{"$f":"MIN(IF(N38=Data_BB[Index],Data_BB[Adj Close]),IF(N38=Data_BB[Lag Index U],Data_BB[Adj Close]))","v":299.84045400000002},{"$f":"MAX(IF(N38=Data_BB[Index],Data_BB[Upper Bollinger Band],0),IF(N38=Data_BB[Lag Index U],Data_BB[Upper Bollinger Band],0))","v":340.17390847627979},{"$f":"MIN(IF(N38=Data_BB[Index],Data_BB[Upper Bollinger Band]),IF(N38=Data_BB[Lag Index U],Data_BB[Upper Bollinger Band]))","v":339.94670935908624},{"$f":"MAX(IF(N38=Data_BB[Index],Data_BB[Lower Bollinger Band],0),IF(N38=Data_BB[Lag Index U],Data_BB[Lower Bollinger Band],0))","v":285.34337025099285},{"$f":"MIN(IF(N38=Data_BB[Index],Data_BB[Lower Bollinger Band]),IF(N38=Data_BB[Lag Index U],Data_BB[Lower Bollinger Band]))","v":283.52981264091375}]
[null,null,null,"2022-01-11",312.05599999999998,{"$f":"IF(Data_BB[[#This Row],[Adj Close]]<E40,TRUE,\"\")","v":true},{"$f":"IF(F38=Data_BB[[#This Row],[Up]],0,1)","v":0},{"$f":"SUM($G$33:G39)","v":2},2,{"$f":"AVERAGE(OFFSET(E38,1,,-MIN(Bollinger_Band_Range_BB,COUNTA(E$32:E38)))+Standard_Deviation_BB*IFERROR(STDEV(OFFSET(E38,1,,-MIN(Bollinger_Band_Range_BB,COUNTA(E$32:E38)))),0))","v":341.49918743946142},{"$f":"IFERROR(AVERAGE(OFFSET(E38,1,,-MIN(Bollinger_Band_Range_BB,COUNTA(E$32:E38)))-Standard_Deviation_BB*IFERROR(STDEV(OFFSET(E38,1,,-MIN(Bollinger_Band_Range_BB,COUNTA(E$32:E38)))),0)),0)","v":291.6145997033957},null,null,7,{"$f":"INDEX(Data_BB[Date],MATCH(N39,Data_BB[Index],0))","v":"2022-01-19"},{"$f":"MAX(IF(N39=Data_BB[Index],Data_BB[Adj Close],0),IF(N39=Data_BB[Lag Index U],Data_BB[Adj Close],0))","v":300.51409899999999},{"$f":"MIN(IF(N39=Data_BB[Index],Data_BB[Adj Close]),IF(N39=Data_BB[Lag Index U],Data_BB[Adj Close]))","v":293.28189099999997},{"$f":"MAX(IF(N39=Data_BB[Index],Data_BB[Upper Bollinger Band],0),IF(N39=Data_BB[Lag Index U],Data_BB[Upper Bollinger Band],0))","v":340.74118108163321},{"$f":"MIN(IF(N39=Data_BB[Index],Data_BB[Upper Bollinger Band]),IF(N39=Data_BB[Lag Index U],Data_BB[Upper Bollinger Band]))","v":339.81698277491756},{"$f":"MAX(IF(N39=Data_BB[Index],Data_BB[Lower Bollinger Band],0),IF(N39=Data_BB[Lag Index U],Data_BB[Lower Bollinger Band],0))","v":283.52981264091375},{"$f":"MIN(IF(N39=Data_BB[Index],Data_BB[Lower Bollinger Band]),IF(N39=Data_BB[Lag Index U],Data_BB[Lower Bollinger Band]))","v":278.2504180612238}]
[null,null,null,"2022-01-12",315.31542999999999,{"$f":"IF(Data_BB[[#This Row],[Adj Close]]<E41,TRUE,\"\")","v":""},{"$f":"IF(F39=Data_BB[[#This Row],[Up]],0,1)","v":1},{"$f":"SUM($G$33:G40)","v":3},2,{"$f":"AVERAGE(OFFSET(E39,1,,-MIN(Bollinger_Band_Range_BB,COUNTA(E$32:E39)))+Standard_Deviation_BB*IFERROR(STDEV(OFFSET(E39,1,,-MIN(Bollinger_Band_Range_BB,COUNTA(E$32:E39)))),0))","v":339.53130002539012},{"$f":"IFERROR(AVERAGE(OFFSET(E39,1,,-MIN(Bollinger_Band_Range_BB,COUNTA(E$32:E39)))-Standard_Deviation_BB*IFERROR(STDEV(OFFSET(E39,1,,-MIN(Bollinger_Band_Range_BB,COUNTA(E$32:E39)))),0)),0)","v":293.27212122460998},null,null,8,{"$f":"INDEX(Data_BB[Date],MATCH(N40,Data_BB[Index],0))","v":"2022-01-21"},{"$f":"MAX(IF(N40=Data_BB[Index],Data_BB[Adj Close],0),IF(N40=Data_BB[Lag Index U],Data_BB[Adj Close],0))","v":293.61874399999999},{"$f":"MIN(IF(N40=Data_BB[Index],Data_BB[Adj Close]),IF(N40=Data_BB[Lag Index U],Data_BB[Adj Close]))","v":293.28189099999997},{"$f":"MAX(IF(N40=Data_BB[Index],Data_BB[Upper Bollinger Band],0),IF(N40=Data_BB[Lag Index U],Data_BB[Upper Bollinger Band],0))","v":340.96099065343844},{"$f":"MIN(IF(N40=Data_BB[Index],Data_BB[Upper Bollinger Band]),IF(N40=Data_BB[Lag Index U],Data_BB[Upper Bollinger Band]))","v":340.74118108163321},{"$f":"MAX(IF(N40=Data_BB[Index],Data_BB[Lower Bollinger Band],0),IF(N40=Data_BB[Lag Index U],Data_BB[Lower Bollinger Band],0))","v":278.2504180612238},{"$f":"MIN(IF(N40=Data_BB[Index],Data_BB[Lower Bollinger Band]),IF(N40=Data_BB[Lag Index U],Data_BB[Lower Bollinger Band]))","v":275.91366774656149}]
[null,null,null,"2022-01-13",301.97048999999998,{"$f":"IF(Data_BB[[#This Row],[Adj Close]]<E42,TRUE,\"\")","v":true},{"$f":"IF(F40=Data_BB[[#This Row],[Up]],0,1)","v":1},{"$f":"SUM($G$33:G41)","v":4},3,{"$f":"AVERAGE(OFFSET(E40,1,,-MIN(Bollinger_Band_Range_BB,COUNTA(E$32:E40)))+Standard_Deviation_BB*IFERROR(STDEV(OFFSET(E40,1,,-MIN(Bollinger_Band_Range_BB,COUNTA(E$32:E40)))),0))","v":340.80527526008586},{"$f":"IFERROR(AVERAGE(OFFSET(E40,1,,-MIN(Bollinger_Band_Range_BB,COUNTA(E$32:E40)))-Standard_Deviation_BB*IFERROR(STDEV(OFFSET(E40,1,,-MIN(Bollinger_Band_Range_BB,COUNTA(E$32:E40)))),0)),0)","v":288.79120807324756},null,null,9,{"$f":"INDEX(Data_BB[Date],MATCH(N41,Data_BB[Index],0))","v":"2022-01-24"},{"$f":"MAX(IF(N41=Data_BB[Index],Data_BB[Adj Close],0),IF(N41=Data_BB[Lag Index U],Data_BB[Adj Close],0))","v":293.61874399999999},{"$f":"MIN(IF(N41=Data_BB[Index],Data_BB[Adj Close]),IF(N41=Data_BB[Lag Index U],Data_BB[Adj Close]))","v":285.81191999999999},{"$f":"MAX(IF(N41=Data_BB[Index],Data_BB[Upper Bollinger Band],0),IF(N41=Data_BB[Lag Index U],Data_BB[Upper Bollinger Band],0))","v":342.73343868056469},{"$f":"MIN(IF(N41=Data_BB[Index],Data_BB[Upper Bollinger Band]),IF(N41=Data_BB[Lag Index U],Data_BB[Upper Bollinger Band]))","v":340.96099065343844},{"$f":"MAX(IF(N41=Data_BB[Index],Data_BB[Lower Bollinger Band],0),IF(N41=Data_BB[Lag Index U],Data_BB[Lower Bollinger Band],0))","v":275.91366774656149},{"$f":"MIN(IF(N41=Data_BB[Index],Data_BB[Lower Bollinger Band]),IF(N41=Data_BB[Lag Index U],Data_BB[Lower Bollinger Band]))","v":271.31304356943531}]
[null,null,null,"2022-01-14",307.320404,{"$f":"IF(Data_BB[[#This Row],[Adj Close]]<E43,TRUE,\"\")","v":""},{"$f":"IF(F41=Data_BB[[#This Row],[Up]],0,1)","v":1},{"$f":"SUM($G$33:G42)","v":5},4,{"$f":"AVERAGE(OFFSET(E41,1,,-MIN(Bollinger_Band_Range_BB,COUNTA(E$32:E41)))+Standard_Deviation_BB*IFERROR(STDEV(OFFSET(E41,1,,-MIN(Bollinger_Band_Range_BB,COUNTA(E$32:E41)))),0))","v":339.57574519972803},{"$f":"IFERROR(AVERAGE(OFFSET(E41,1,,-MIN(Bollinger_Band_Range_BB,COUNTA(E$32:E41)))-Standard_Deviation_BB*IFERROR(STDEV(OFFSET(E41,1,,-MIN(Bollinger_Band_Range_BB,COUNTA(E$32:E41)))),0)),0)","v":288.52517060027202},null,null,10,{"$f":"INDEX(Data_BB[Date],MATCH(N42,Data_BB[Index],0))","v":"2022-01-25"},{"$f":"MAX(IF(N42=Data_BB[Index],Data_BB[Adj Close],0),IF(N42=Data_BB[Lag Index U],Data_BB[Adj Close],0))","v":308.09310900000003},{"$f":"MIN(IF(N42=Data_BB[Index],Data_BB[Adj Close]),IF(N42=Data_BB[Lag Index U],Data_BB[Adj Close]))","v":285.81191999999999},{"$f":"MAX(IF(N42=Data_BB[Index],Data_BB[Upper Bollinger Band],0),IF(N42=Data_BB[Lag Index U],Data_BB[Upper Bollinger Band],0))","v":342.73343868056469},{"$f":"MIN(IF(N42=Data_BB[Index],Data_BB[Upper Bollinger Band]),IF(N42=Data_BB[Lag Index U],Data_BB[Upper Bollinger Band]))","v":339.35953300329521},{"$f":"MAX(IF(N42=Data_BB[Index],Data_BB[Lower Bollinger Band],0),IF(N42=Data_BB[Lag Index U],Data_BB[Lower Bollinger Band],0))","v":272.32801589670487},{"$f":"MIN(IF(N42=Data_BB[Index],Data_BB[Lower Bollinger Band]),IF(N42=Data_BB[Lag Index U],Data_BB[Lower Bollinger Band]))","v":270.35174275584342}]
[null,null,null,"2022-01-18",299.84045400000002,{"$f":"IF(Data_BB[[#This Row],[Adj Close]]<E44,TRUE,\"\")","v":true},{"$f":"IF(F42=Data_BB[[#This Row],[Up]],0,1)","v":1},{"$f":"SUM($G$33:G43)","v":6},5,{"$f":"AVERAGE(OFFSET(E42,1,,-MIN(Bollinger_Band_Range_BB,COUNTA(E$32:E42)))+Standard_Deviation_BB*IFERROR(STDEV(OFFSET(E42,1,,-MIN(Bollinger_Band_Range_BB,COUNTA(E$32:E42)))),0))","v":340.17390847627979},{"$f":"IFERROR(AVERAGE(OFFSET(E42,1,,-MIN(Bollinger_Band_Range_BB,COUNTA(E$32:E42)))-Standard_Deviation_BB*IFERROR(STDEV(OFFSET(E42,1,,-MIN(Bollinger_Band_Range_BB,COUNTA(E$32:E42)))),0)),0)","v":285.34337025099285},null,null,11,{"$f":"INDEX(Data_BB[Date],MATCH(N43,Data_BB[Index],0))","v":"2022-01-31"},{"$f":"MAX(IF(N43=Data_BB[Index],Data_BB[Adj Close],0),IF(N43=Data_BB[Lag Index U],Data_BB[Adj Close],0))","v":308.09310900000003},{"$f":"MIN(IF(N43=Data_BB[Index],Data_BB[Adj Close]),IF(N43=Data_BB[Lag Index U],Data_BB[Adj Close]))","v":305.89373799999998},{"$f":"MAX(IF(N43=Data_BB[Index],Data_BB[Upper Bollinger Band],0),IF(N43=Data_BB[Lag Index U],Data_BB[Upper Bollinger Band],0))","v":339.35953300329521},{"$f":"MIN(IF(N43=Data_BB[Index],Data_BB[Upper Bollinger Band]),IF(N43=Data_BB[Lag Index U],Data_BB[Upper Bollinger Band]))","v":333.02460467086593},{"$f":"MAX(IF(N43=Data_BB[Index],Data_BB[Lower Bollinger Band],0),IF(N43=Data_BB[Lag Index U],Data_BB[Lower Bollinger Band],0))","v":276.15231802913411},{"$f":"MIN(IF(N43=Data_BB[Index],Data_BB[Lower Bollinger Band]),IF(N43=Data_BB[Lag Index U],Data_BB[Lower Bollinger Band]))","v":272.32801589670487}]
[null,null,null,"2022-01-19",300.51409899999999,{"$f":"IF(Data_BB[[#This Row],[Adj Close]]<E45,TRUE,\"\")","v":""},{"$f":"IF(F43=Data_BB[[#This Row],[Up]],0,1)","v":1},{"$f":"SUM($G$33:G44)","v":7},6,{"$f":"AVERAGE(OFFSET(E43,1,,-MIN(Bollinger_Band_Range_BB,COUNTA(E$32:E43)))+Standard_Deviation_BB*IFERROR(STDEV(OFFSET(E43,1,,-MIN(Bollinger_Band_Range_BB,COUNTA(E$32:E43)))),0))","v":339.94670935908624},{"$f":"IFERROR(AVERAGE(OFFSET(E43,1,,-MIN(Bollinger_Band_Range_BB,COUNTA(E$32:E43)))-Standard_Deviation_BB*IFERROR(STDEV(OFFSET(E43,1,,-MIN(Bollinger_Band_Range_BB,COUNTA(E$32:E43)))),0)),0)","v":283.52981264091375},null,null,12,{"$f":"INDEX(Data_BB[Date],MATCH(N44,Data_BB[Index],0))","v":"2022-02-01"},{"$f":"MAX(IF(N44=Data_BB[Index],Data_BB[Adj Close],0),IF(N44=Data_BB[Lag Index U],Data_BB[Adj Close],0))","v":310.55007899999998},{"$f":"MIN(IF(N44=Data_BB[Index],Data_BB[Adj Close]),IF(N44=Data_BB[Lag Index U],Data_BB[Adj Close]))","v":305.89373799999998},{"$f":"MAX(IF(N44=Data_BB[Index],Data_BB[Upper Bollinger Band],0),IF(N44=Data_BB[Lag Index U],Data_BB[Upper Bollinger Band],0))","v":333.02460467086593},{"$f":"MIN(IF(N44=Data_BB[Index],Data_BB[Upper Bollinger Band]),IF(N44=Data_BB[Lag Index U],Data_BB[Upper Bollinger Band]))","v":328.38568825006922},{"$f":"MAX(IF(N44=Data_BB[Index],Data_BB[Lower Bollinger Band],0),IF(N44=Data_BB[Lag Index U],Data_BB[Lower Bollinger Band],0))","v":279.25066734993078},{"$f":"MIN(IF(N44=Data_BB[Index],Data_BB[Lower Bollinger Band]),IF(N44=Data_BB[Lag Index U],Data_BB[Lower Bollinger Band]))","v":276.15231802913411}]
[null,null,null,"2022-01-20",298.80017099999998,{"$f":"IF(Data_BB[[#This Row],[Adj Close]]<E46,TRUE,\"\")","v":""},{"$f":"IF(F44=Data_BB[[#This Row],[Up]],0,1)","v":0},{"$f":"SUM($G$33:G45)","v":7},7,{"$f":"AVERAGE(OFFSET(E44,1,,-MIN(Bollinger_Band_Range_BB,COUNTA(E$32:E44)))+Standard_Deviation_BB*IFERROR(STDEV(OFFSET(E44,1,,-MIN(Bollinger_Band_Range_BB,COUNTA(E$32:E44)))),0))","v":339.81698277491756},{"$f":"IFERROR(AVERAGE(OFFSET(E44,1,,-MIN(Bollinger_Band_Range_BB,COUNTA(E$32:E44)))-Standard_Deviation_BB*IFERROR(STDEV(OFFSET(E44,1,,-MIN(Bollinger_Band_Range_BB,COUNTA(E$32:E44)))),0)),0)","v":281.669063840467},null,null,13,{"$f":"INDEX(Data_BB[Date],MATCH(N45,Data_BB[Index],0))","v":"2022-02-02"},{"$f":"MAX(IF(N45=Data_BB[Index],Data_BB[Adj Close],0),IF(N45=Data_BB[Lag Index U],Data_BB[Adj Close],0))","v":310.55007899999998},{"$f":"MIN(IF(N45=Data_BB[Index],Data_BB[Adj Close]),IF(N45=Data_BB[Lag Index U],Data_BB[Adj Close]))","v":298.45343000000003},{"$f":"MAX(IF(N45=Data_BB[Index],Data_BB[Upper Bollinger Band],0),IF(N45=Data_BB[Lag Index U],Data_BB[Upper Bollinger Band],0))","v":328.38568825006922},{"$f":"MIN(IF(N45=Data_BB[Index],Data_BB[Upper Bollinger Band]),IF(N45=Data_BB[Lag Index U],Data_BB[Upper Bollinger Band]))","v":326.90130749476322},{"$f":"MAX(IF(N45=Data_BB[Index],Data_BB[Lower Bollinger Band],0),IF(N45=Data_BB[Lag Index U],Data_BB[Lower Bollinger Band],0))","v":279.25066734993078},{"$f":"MIN(IF(N45=Data_BB[Index],Data_BB[Lower Bollinger Band]),IF(N45=Data_BB[Lag Index U],Data_BB[Lower Bollinger Band]))","v":279.23609180523681}]
[null,null,null,"2022-01-21",293.28189099999997,{"$f":"IF(Data_BB[[#This Row],[Adj Close]]<E47,TRUE,\"\")","v":true},{"$f":"IF(F45=Data_BB[[#This Row],[Up]],0,1)","v":1},{"$f":"SUM($G$33:G46)","v":8},7,{"$f":"AVERAGE(OFFSET(E45,1,,-MIN(Bollinger_Band_Range_BB,COUNTA(E$32:E45)))+Standard_Deviation_BB*IFERROR(STDEV(OFFSET(E45,1,,-MIN(Bollinger_Band_Range_BB,COUNTA(E$32:E45)))),0))","v":340.74118108163321},{"$f":"IFERROR(AVERAGE(OFFSET(E45,1,,-MIN(Bollinger_Band_Range_BB,COUNTA(E$32:E45)))-Standard_Deviation_BB*IFERROR(STDEV(OFFSET(E45,1,,-MIN(Bollinger_Band_Range_BB,COUNTA(E$32:E45)))),0)),0)","v":278.2504180612238},null,null,14,{"$f":"INDEX(Data_BB[Date],MATCH(N46,Data_BB[Index],0))","v":"2022-02-03"},{"$f":"MAX(IF(N46=Data_BB[Index],Data_BB[Adj Close],0),IF(N46=Data_BB[Lag Index U],Data_BB[Adj Close],0))","v":303.09988399999997},{"$f":"MIN(IF(N46=Data_BB[Index],Data_BB[Adj Close]),IF(N46=Data_BB[Lag Index U],Data_BB[Adj Close]))","v":298.45343000000003},{"$f":"MAX(IF(N46=Data_BB[Index],Data_BB[Upper Bollinger Band],0),IF(N46=Data_BB[Lag Index U],Data_BB[Upper Bollinger Band],0))","v":326.90130749476322},{"$f":"MIN(IF(N46=Data_BB[Index],Data_BB[Upper Bollinger Band]),IF(N46=Data_BB[Lag Index U],Data_BB[Upper Bollinger Band]))","v":325.84829916567224},{"$f":"MAX(IF(N46=Data_BB[Index],Data_BB[Lower Bollinger Band],0),IF(N46=Data_BB[Lag Index U],Data_BB[Lower Bollinger Band],0))","v":279.50246683432772},{"$f":"MIN(IF(N46=Data_BB[Index],Data_BB[Lower Bollinger Band]),IF(N46=Data_BB[Lag Index U],Data_BB[Lower Bollinger Band]))","v":279.23609180523681}]
[null,null,null,"2022-01-24",293.61874399999999,{"$f":"IF(Data_BB[[#This Row],[Adj Close]]<E48,TRUE,\"\")","v":""},{"$f":"IF(F46=Data_BB[[#This Row],[Up]],0,1)","v":1},{"$f":"SUM($G$33:G47)","v":9},8,{"$f":"AVERAGE(OFFSET(E46,1,,-MIN(Bollinger_Band_Range_BB,COUNTA(E$32:E46)))+Standard_Deviation_BB*IFERROR(STDEV(OFFSET(E46,1,,-MIN(Bollinger_Band_Range_BB,COUNTA(E$32:E46)))),0))","v":340.96099065343844},{"$f":"IFERROR(AVERAGE(OFFSET(E46,1,,-MIN(Bollinger_Band_Range_BB,COUNTA(E$32:E46)))-Standard_Deviation_BB*IFERROR(STDEV(OFFSET(E46,1,,-MIN(Bollinger_Band_Range_BB,COUNTA(E$32:E46)))),0)),0)","v":275.91366774656149},null,null,15,{"$f":"INDEX(Data_BB[Date],MATCH(N47,Data_BB[Index],0))","v":"2022-02-04"},{"$f":"MAX(IF(N47=Data_BB[Index],Data_BB[Adj Close],0),IF(N47=Data_BB[Lag Index U],Data_BB[Adj Close],0))","v":303.09988399999997},{"$f":"MIN(IF(N47=Data_BB[Index],Data_BB[Adj Close]),IF(N47=Data_BB[Lag Index U],Data_BB[Adj Close]))","v":298.15621900000002},{"$f":"MAX(IF(N47=Data_BB[Index],Data_BB[Upper Bollinger Band],0),IF(N47=Data_BB[Lag Index U],Data_BB[Upper Bollinger Band],0))","v":325.84829916567224},{"$f":"MIN(IF(N47=Data_BB[Index],Data_BB[Upper Bollinger Band]),IF(N47=Data_BB[Lag Index U],Data_BB[Upper Bollinger Band]))","v":324.58483417421758},{"$f":"MAX(IF(N47=Data_BB[Index],Data_BB[Lower Bollinger Band],0),IF(N47=Data_BB[Lag Index U],Data_BB[Lower Bollinger Band],0))","v":279.50246683432772},{"$f":"MIN(IF(N47=Data_BB[Index],Data_BB[Lower Bollinger Band]),IF(N47=Data_BB[Lag Index U],Data_BB[Lower Bollinger Band]))","v":279.46908122578236}]
[null,null,null,"2022-01-25",285.81191999999999,{"$f":"IF(Data_BB[[#This Row],[Adj Close]]<E49,TRUE,\"\")","v":true},{"$f":"IF(F47=Data_BB[[#This Row],[Up]],0,1)","v":1},{"$f":"SUM($G$33:G48)","v":10},9,{"$f":"AVERAGE(OFFSET(E47,1,,-MIN(Bollinger_Band_Range_BB,COUNTA(E$32:E47)))+Standard_Deviation_BB*IFERROR(STDEV(OFFSET(E47,1,,-MIN(Bollinger_Band_Range_BB,COUNTA(E$32:E47)))),0))","v":342.73343868056469},{"$f":"IFERROR(AVERAGE(OFFSET(E47,1,,-MIN(Bollinger_Band_Range_BB,COUNTA(E$32:E47)))-Standard_Deviation_BB*IFERROR(STDEV(OFFSET(E47,1,,-MIN(Bollinger_Band_Range_BB,COUNTA(E$32:E47)))),0)),0)","v":271.31304356943531},null,null,16,{"$f":"INDEX(Data_BB[Date],MATCH(N48,Data_BB[Index],0))","v":"2022-02-07"},{"$f":"MAX(IF(N48=Data_BB[Index],Data_BB[Adj Close],0),IF(N48=Data_BB[Lag Index U],Data_BB[Adj Close],0))","v":308.32095299999997},{"$f":"MIN(IF(N48=Data_BB[Index],Data_BB[Adj Close]),IF(N48=Data_BB[Lag Index U],Data_BB[Adj Close]))","v":298.15621900000002},{"$f":"MAX(IF(N48=Data_BB[Index],Data_BB[Upper Bollinger Band],0),IF(N48=Data_BB[Lag Index U],Data_BB[Upper Bollinger Band],0))","v":324.58483417421758},{"$f":"MIN(IF(N48=Data_BB[Index],Data_BB[Upper Bollinger Band]),IF(N48=Data_BB[Lag Index U],Data_BB[Upper Bollinger Band]))","v":322.20628503686538},{"$f":"MAX(IF(N48=Data_BB[Index],Data_BB[Lower Bollinger Band],0),IF(N48=Data_BB[Lag Index U],Data_BB[Lower Bollinger Band],0))","v":280.51213836313457},{"$f":"MIN(IF(N48=Data_BB[Index],Data_BB[Lower Bollinger Band]),IF(N48=Data_BB[Lag Index U],Data_BB[Lower Bollinger Band]))","v":279.46908122578236}]
[null,null,null,"2022-01-26",293.95559700000001,{"$f":"IF(Data_BB[[#This Row],[Adj Close]]<E50,TRUE,\"\")","v":true},{"$f":"IF(F48=Data_BB[[#This Row],[Up]],0,1)","v":0},{"$f":"SUM($G$33:G49)","v":10},10,{"$f":"AVERAGE(OFFSET(E48,1,,-MIN(Bollinger_Band_Range_BB,COUNTA(E$32:E48)))+Standard_Deviation_BB*IFERROR(STDEV(OFFSET(E48,1,,-MIN(Bollinger_Band_Range_BB,COUNTA(E$32:E48)))),0))","v":342.1142993926594},{"$f":"IFERROR(AVERAGE(OFFSET(E48,1,,-MIN(Bollinger_Band_Range_BB,COUNTA(E$32:E48)))-Standard_Deviation_BB*IFERROR(STDEV(OFFSET(E48,1,,-MIN(Bollinger_Band_Range_BB,COUNTA(E$32:E48)))),0)),0)","v":270.3948129602818},null,null,17,{"$f":"INDEX(Data_BB[Date],MATCH(N49,Data_BB[Index],0))","v":"2022-02-09"},{"$f":"MAX(IF(N49=Data_BB[Index],Data_BB[Adj Close],0),IF(N49=Data_BB[Lag Index U],Data_BB[Adj Close],0))","v":308.32095299999997},{"$f":"MIN(IF(N49=Data_BB[Index],Data_BB[Adj Close]),IF(N49=Data_BB[Lag Index U],Data_BB[Adj Close]))","v":292.26147500000002},{"$f":"MAX(IF(N49=Data_BB[Index],Data_BB[Upper Bollinger Band],0),IF(N49=Data_BB[Lag Index U],Data_BB[Upper Bollinger Band],0))","v":322.20628503686538},{"$f":"MIN(IF(N49=Data_BB[Index],Data_BB[Upper Bollinger Band]),IF(N49=Data_BB[Lag Index U],Data_BB[Upper Bollinger Band]))","v":318.46992654029009},{"$f":"MAX(IF(N49=Data_BB[Index],Data_BB[Lower Bollinger Band],0),IF(N49=Data_BB[Lag Index U],Data_BB[Lower Bollinger Band],0))","v":282.18785949406742},{"$f":"MIN(IF(N49=Data_BB[Index],Data_BB[Lower Bollinger Band]),IF(N49=Data_BB[Lag Index U],Data_BB[Lower Bollinger Band]))","v":280.20142035970991}]
[null,null,null,"2022-01-27",297.05654900000002,{"$f":"IF(Data_BB[[#This Row],[Adj Close]]<E51,TRUE,\"\")","v":true},{"$f":"IF(F49=Data_BB[[#This Row],[Up]],0,1)","v":0},{"$f":"SUM($G$33:G50)","v":10},10,{"$f":"AVERAGE(OFFSET(E49,1,,-MIN(Bollinger_Band_Range_BB,COUNTA(E$32:E49)))+Standard_Deviation_BB*IFERROR(STDEV(OFFSET(E49,1,,-MIN(Bollinger_Band_Range_BB,COUNTA(E$32:E49)))),0))","v":341.13536879971207},{"$f":"IFERROR(AVERAGE(OFFSET(E49,1,,-MIN(Bollinger_Band_Range_BB,COUNTA(E$32:E49)))-Standard_Deviation_BB*IFERROR(STDEV(OFFSET(E49,1,,-MIN(Bollinger_Band_Range_BB,COUNTA(E$32:E49)))),0)),0)","v":270.35174275584342},null,null,18,{"$f":"INDEX(Data_BB[Date],MATCH(N50,Data_BB[Index],0))","v":"2022-02-14"},{"$f":"MAX(IF(N50=Data_BB[Index],Data_BB[Adj Close],0),IF(N50=Data_BB[Lag Index U],Data_BB[Adj Close],0))","v":297.68069500000001},{"$f":"MIN(IF(N50=Data_BB[Index],Data_BB[Adj Close]),IF(N50=Data_BB[Lag Index U],Data_BB[Adj Close]))","v":292.26147500000002},{"$f":"MAX(IF(N50=Data_BB[Index],Data_BB[Upper Bollinger Band],0),IF(N50=Data_BB[Lag Index U],Data_BB[Upper Bollinger Band],0))","v":318.46992654029009},{"$f":"MIN(IF(N50=Data_BB[Index],Data_BB[Upper Bollinger Band]),IF(N50=Data_BB[Lag Index U],Data_BB[Upper Bollinger Band]))","v":318.38978005370416},{"$f":"MAX(IF(N50=Data_BB[Index],Data_BB[Lower Bollinger Band],0),IF(N50=Data_BB[Lag Index U],Data_BB[Lower Bollinger Band],0))","v":280.20142035970991},{"$f":"MIN(IF(N50=Data_BB[Index],Data_BB[Lower Bollinger Band]),IF(N50=Data_BB[Lag Index U],Data_BB[Lower Bollinger Band]))","v":280.06559094629586}]
[null,null,null,"2022-01-28",305.39837599999998,{"$f":"IF(Data_BB[[#This Row],[Adj Close]]<E52,TRUE,\"\")","v":true},{"$f":"IF(F50=Data_BB[[#This Row],[Up]],0,1)","v":0},{"$f":"SUM($G$33:G51)","v":10},10,{"$f":"AVERAGE(OFFSET(E50,1,,-MIN(Bollinger_Band_Range_BB,COUNTA(E$32:E50)))+Standard_Deviation_BB*IFERROR(STDEV(OFFSET(E50,1,,-MIN(Bollinger_Band_Range_BB,COUNTA(E$32:E50)))),0))","v":340.12086874052193},{"$f":"IFERROR(AVERAGE(OFFSET(E50,1,,-MIN(Bollinger_Band_Range_BB,COUNTA(E$32:E50)))-Standard_Deviation_BB*IFERROR(STDEV(OFFSET(E50,1,,-MIN(Bollinger_Band_Range_BB,COUNTA(E$32:E50)))),0)),0)","v":271.32990810158344},null,null,19,{"$f":"INDEX(Data_BB[Date],MATCH(N51,Data_BB[Index],0))","v":"2022-02-15"},{"$f":"MAX(IF(N51=Data_BB[Index],Data_BB[Adj Close],0),IF(N51=Data_BB[Lag Index U],Data_BB[Adj Close],0))","v":297.68069500000001},{"$f":"MIN(IF(N51=Data_BB[Index],Data_BB[Adj Close]),IF(N51=Data_BB[Lag Index U],Data_BB[Adj Close]))","v":278.24230999999997},{"$f":"MAX(IF(N51=Data_BB[Index],Data_BB[Upper Bollinger Band],0),IF(N51=Data_BB[Lag Index U],Data_BB[Upper Bollinger Band],0))","v":322.98332767114516},{"$f":"MIN(IF(N51=Data_BB[Index],Data_BB[Upper Bollinger Band]),IF(N51=Data_BB[Lag Index U],Data_BB[Upper Bollinger Band]))","v":318.24838071951802},{"$f":"MAX(IF(N51=Data_BB[Index],Data_BB[Lower Bollinger Band],0),IF(N51=Data_BB[Lag Index U],Data_BB[Lower Bollinger Band],0))","v":280.06559094629586},{"$f":"MIN(IF(N51=Data_BB[Index],Data_BB[Lower Bollinger Band]),IF(N51=Data_BB[Lag Index U],Data_BB[Lower Bollinger Band]))","v":271.83811692885479}]
[null,null,null,"2022-01-31",308.09310900000003,{"$f":"IF(Data_BB[[#This Row],[Adj Close]]<E53,TRUE,\"\")","v":""},{"$f":"IF(F51=Data_BB[[#This Row],[Up]],0,1)","v":1},{"$f":"SUM($G$33:G52)","v":11},10,{"$f":"AVERAGE(OFFSET(E51,1,,-MIN(Bollinger_Band_Range_BB,COUNTA(E$32:E51)))+Standard_Deviation_BB*IFERROR(STDEV(OFFSET(E51,1,,-MIN(Bollinger_Band_Range_BB,COUNTA(E$32:E51)))),0))","v":339.35953300329521},{"$f":"IFERROR(AVERAGE(OFFSET(E51,1,,-MIN(Bollinger_Band_Range_BB,COUNTA(E$32:E51)))-Standard_Deviation_BB*IFERROR(STDEV(OFFSET(E51,1,,-MIN(Bollinger_Band_Range_BB,COUNTA(E$32:E51)))),0)),0)","v":272.32801589670487},null,null,20,{"$f":"INDEX(Data_BB[Date],MATCH(N52,Data_BB[Index],0))","v":"2022-02-23"},{"$f":"MAX(IF(N52=Data_BB[Index],Data_BB[Adj Close],0),IF(N52=Data_BB[Lag Index U],Data_BB[Adj Close],0))","v":296.62835699999999},{"$f":"MIN(IF(N52=Data_BB[Index],Data_BB[Adj Close]),IF(N52=Data_BB[Lag Index U],Data_BB[Adj Close]))","v":278.24230999999997},{"$f":"MAX(IF(N52=Data_BB[Index],Data_BB[Upper Bollinger Band],0),IF(N52=Data_BB[Lag Index U],Data_BB[Upper Bollinger Band],0))","v":323.02373836049571},{"$f":"MIN(IF(N52=Data_BB[Index],Data_BB[Upper Bollinger Band]),IF(N52=Data_BB[Lag Index U],Data_BB[Upper Bollinger Band]))","v":321.87887506414114},{"$f":"MAX(IF(N52=Data_BB[Index],Data_BB[Lower Bollinger Band],0),IF(N52=Data_BB[Lag Index U],Data_BB[Lower Bollinger Band],0))","v":271.83811692885479},{"$f":"MIN(IF(N52=Data_BB[Index],Data_BB[Lower Bollinger Band]),IF(N52=Data_BB[Lag Index U],Data_BB[Lower Bollinger Band]))","v":271.51186861638155}]
[null,null,null,"2022-02-01",305.89373799999998,{"$f":"IF(Data_BB[[#This Row],[Adj Close]]<E54,TRUE,\"\")","v":true},{"$f":"IF(F52=Data_BB[[#This Row],[Up]],0,1)","v":1},{"$f":"SUM($G$33:G53)","v":12},11,{"$f":"AVERAGE(OFFSET(E52,1,,-MIN(Bollinger_Band_Range_BB,COUNTA(E$32:E52)))+Standard_Deviation_BB*IFERROR(STDEV(OFFSET(E52,1,,-MIN(Bollinger_Band_Range_BB,COUNTA(E$32:E52)))),0))","v":333.02460467086593},{"$f":"IFERROR(AVERAGE(OFFSET(E52,1,,-MIN(Bollinger_Band_Range_BB,COUNTA(E$32:E52)))-Standard_Deviation_BB*IFERROR(STDEV(OFFSET(E52,1,,-MIN(Bollinger_Band_Range_BB,COUNTA(E$32:E52)))),0)),0)","v":276.15231802913411},null,null,21,{"$f":"INDEX(Data_BB[Date],MATCH(N53,Data_BB[Index],0))","v":"2022-02-28"},{"$f":"MAX(IF(N53=Data_BB[Index],Data_BB[Adj Close],0),IF(N53=Data_BB[Lag Index U],Data_BB[Adj Close],0))","v":296.62835699999999},{"$f":"MIN(IF(N53=Data_BB[Index],Data_BB[Adj Close]),IF(N53=Data_BB[Lag Index U],Data_BB[Adj Close]))","v":292.81616200000002},{"$f":"MAX(IF(N53=Data_BB[Index],Data_BB[Upper Bollinger Band],0),IF(N53=Data_BB[Lag Index U],Data_BB[Upper Bollinger Band],0))","v":321.87887506414114},{"$f":"MIN(IF(N53=Data_BB[Index],Data_BB[Upper Bollinger Band]),IF(N53=Data_BB[Lag Index U],Data_BB[Upper Bollinger Band]))","v":319.92254074503461},{"$f":"MAX(IF(N53=Data_BB[Index],Data_BB[Lower Bollinger Band],0),IF(N53=Data_BB[Lag Index U],Data_BB[Lower Bollinger Band],0))","v":272.15477245496538},{"$f":"MIN(IF(N53=Data_BB[Index],Data_BB[Lower Bollinger Band]),IF(N53=Data_BB[Lag Index U],Data_BB[Lower Bollinger Band]))","v":271.72613283585889}]
[null,null,null,"2022-02-02",310.55007899999998,{"$f":"IF(Data_BB[[#This Row],[Adj Close]]<E55,TRUE,\"\")","v":""},{"$f":"IF(F53=Data_BB[[#This Row],[Up]],0,1)","v":1},{"$f":"SUM($G$33:G54)","v":13},12,{"$f":"AVERAGE(OFFSET(E53,1,,-MIN(Bollinger_Band_Range_BB,COUNTA(E$32:E53)))+Standard_Deviation_BB*IFERROR(STDEV(OFFSET(E53,1,,-MIN(Bollinger_Band_Range_BB,COUNTA(E$32:E53)))),0))","v":328.38568825006922},{"$f":"IFERROR(AVERAGE(OFFSET(E53,1,,-MIN(Bollinger_Band_Range_BB,COUNTA(E$32:E53)))-Standard_Deviation_BB*IFERROR(STDEV(OFFSET(E53,1,,-MIN(Bollinger_Band_Range_BB,COUNTA(E$32:E53)))),0)),0)","v":279.25066734993078},null,null,22,{"$f":"INDEX(Data_BB[Date],MATCH(N54,Data_BB[Index],0))","v":"2022-03-01"},{"$f":"MAX(IF(N54=Data_BB[Index],Data_BB[Adj Close],0),IF(N54=Data_BB[Lag Index U],Data_BB[Adj Close],0))","v":298.01825000000002},{"$f":"MIN(IF(N54=Data_BB[Index],Data_BB[Adj Close]),IF(N54=Data_BB[Lag Index U],Data_BB[Adj Close]))","v":292.81616200000002},{"$f":"MAX(IF(N54=Data_BB[Index],Data_BB[Upper Bollinger Band],0),IF(N54=Data_BB[Lag Index U],Data_BB[Upper Bollinger Band],0))","v":319.92254074503461},{"$f":"MIN(IF(N54=Data_BB[Index],Data_BB[Upper Bollinger Band]),IF(N54=Data_BB[Lag Index U],Data_BB[Upper Bollinger Band]))","v":318.55387086431938},{"$f":"MAX(IF(N54=Data_BB[Index],Data_BB[Lower Bollinger Band],0),IF(N54=Data_BB[Lag Index U],Data_BB[Lower Bollinger Band],0))","v":272.73589353568065},{"$f":"MIN(IF(N54=Data_BB[Index],Data_BB[Lower Bollinger Band]),IF(N54=Data_BB[Lag Index U],Data_BB[Lower Bollinger Band]))","v":272.15477245496538}]
[null,null,null,"2022-02-03",298.45343000000003,{"$f":"IF(Data_BB[[#This Row],[Adj Close]]<E56,TRUE,\"\")","v":true},{"$f":"IF(F54=Data_BB[[#This Row],[Up]],0,1)","v":1},{"$f":"SUM($G$33:G55)","v":14},13,{"$f":"AVERAGE(OFFSET(E54,1,,-MIN(Bollinger_Band_Range_BB,COUNTA(E$32:E54)))+Standard_Deviation_BB*IFERROR(STDEV(OFFSET(E54,1,,-MIN(Bollinger_Band_Range_BB,COUNTA(E$32:E54)))),0))","v":326.90130749476322},{"$f":"IFERROR(AVERAGE(OFFSET(E54,1,,-MIN(Bollinger_Band_Range_BB,COUNTA(E$32:E54)))-Standard_Deviation_BB*IFERROR(STDEV(OFFSET(E54,1,,-MIN(Bollinger_Band_Range_BB,COUNTA(E$32:E54)))),0)),0)","v":279.23609180523681},null,null,23,{"$f":"INDEX(Data_BB[Date],MATCH(N55,Data_BB[Index],0))","v":"2022-03-02"},{"$f":"MAX(IF(N55=Data_BB[Index],Data_BB[Adj Close],0),IF(N55=Data_BB[Lag Index U],Data_BB[Adj Close],0))","v":298.01825000000002},{"$f":"MIN(IF(N55=Data_BB[Index],Data_BB[Adj Close]),IF(N55=Data_BB[Lag Index U],Data_BB[Adj Close]))","v":273.854309},{"$f":"MAX(IF(N55=Data_BB[Index],Data_BB[Upper Bollinger Band],0),IF(N55=Data_BB[Lag Index U],Data_BB[Upper Bollinger Band],0))","v":318.55387086431938},{"$f":"MIN(IF(N55=Data_BB[Index],Data_BB[Upper Bollinger Band]),IF(N55=Data_BB[Lag Index U],Data_BB[Upper Bollinger Band]))","v":314.98569333484045},{"$f":"MAX(IF(N55=Data_BB[Index],Data_BB[Lower Bollinger Band],0),IF(N55=Data_BB[Lag Index U],Data_BB[Lower Bollinger Band],0))","v":274.44526663831942},{"$f":"MIN(IF(N55=Data_BB[Index],Data_BB[Lower Bollinger Band]),IF(N55=Data_BB[Lag Index U],Data_BB[Lower Bollinger Band]))","v":265.9563833125535}]
[null,null,null,"2022-02-04",303.09988399999997,{"$f":"IF(Data_BB[[#This Row],[Adj Close]]<E57,TRUE,\"\")","v":""},{"$f":"IF(F55=Data_BB[[#This Row],[Up]],0,1)","v":1},{"$f":"SUM($G$33:G56)","v":15},14,{"$f":"AVERAGE(OFFSET(E55,1,,-MIN(Bollinger_Band_Range_BB,COUNTA(E$32:E55)))+Standard_Deviation_BB*IFERROR(STDEV(OFFSET(E55,1,,-MIN(Bollinger_Band_Range_BB,COUNTA(E$32:E55)))),0))","v":325.84829916567224},{"$f":"IFERROR(AVERAGE(OFFSET(E55,1,,-MIN(Bollinger_Band_Range_BB,COUNTA(E$32:E55)))-Standard_Deviation_BB*IFERROR(STDEV(OFFSET(E55,1,,-MIN(Bollinger_Band_Range_BB,COUNTA(E$32:E55)))),0)),0)","v":279.50246683432772},null,null,24,{"$f":"INDEX(Data_BB[Date],MATCH(N56,Data_BB[Index],0))","v":"2022-03-08"},{"$f":"MAX(IF(N56=Data_BB[Index],Data_BB[Adj Close],0),IF(N56=Data_BB[Lag Index U],Data_BB[Adj Close],0))","v":286.41281099999998},{"$f":"MIN(IF(N56=Data_BB[Index],Data_BB[Adj Close]),IF(N56=Data_BB[Lag Index U],Data_BB[Adj Close]))","v":273.854309},{"$f":"MAX(IF(N56=Data_BB[Index],Data_BB[Upper Bollinger Band],0),IF(N56=Data_BB[Lag Index U],Data_BB[Upper Bollinger Band],0))","v":317.53627718744639},{"$f":"MIN(IF(N56=Data_BB[Index],Data_BB[Upper Bollinger Band]),IF(N56=Data_BB[Lag Index U],Data_BB[Upper Bollinger Band]))","v":315.99629038547494},{"$f":"MAX(IF(N56=Data_BB[Index],Data_BB[Lower Bollinger Band],0),IF(N56=Data_BB[Lag Index U],Data_BB[Lower Bollinger Band],0))","v":265.96438151452492},{"$f":"MIN(IF(N56=Data_BB[Index],Data_BB[Lower Bollinger Band]),IF(N56=Data_BB[Lag Index U],Data_BB[Lower Bollinger Band]))","v":265.9563833125535}]
[null,null,null,"2022-02-07",298.15621900000002,{"$f":"IF(Data_BB[[#This Row],[Adj Close]]<E58,TRUE,\"\")","v":true},{"$f":"IF(F56=Data_BB[[#This Row],[Up]],0,1)","v":1},{"$f":"SUM($G$33:G57)","v":16},15,{"$f":"AVERAGE(OFFSET(E56,1,,-MIN(Bollinger_Band_Range_BB,COUNTA(E$32:E56)))+Standard_Deviation_BB*IFERROR(STDEV(OFFSET(E56,1,,-MIN(Bollinger_Band_Range_BB,COUNTA(E$32:E56)))),0))","v":324.58483417421758},{"$f":"IFERROR(AVERAGE(OFFSET(E56,1,,-MIN(Bollinger_Band_Range_BB,COUNTA(E$32:E56)))-Standard_Deviation_BB*IFERROR(STDEV(OFFSET(E56,1,,-MIN(Bollinger_Band_Range_BB,COUNTA(E$32:E56)))),0)),0)","v":279.46908122578236},null,null,25,{"$f":"INDEX(Data_BB[Date],MATCH(N57,Data_BB[Index],0))","v":"2022-03-09"},{"$f":"MAX(IF(N57=Data_BB[Index],Data_BB[Adj Close],0),IF(N57=Data_BB[Lag Index U],Data_BB[Adj Close],0))","v":286.41281099999998},{"$f":"MIN(IF(N57=Data_BB[Index],Data_BB[Adj Close]),IF(N57=Data_BB[Lag Index U],Data_BB[Adj Close]))","v":274.44006300000001},{"$f":"MAX(IF(N57=Data_BB[Index],Data_BB[Upper Bollinger Band],0),IF(N57=Data_BB[Lag Index U],Data_BB[Upper Bollinger Band],0))","v":315.99629038547494},{"$f":"MIN(IF(N57=Data_BB[Index],Data_BB[Upper Bollinger Band]),IF(N57=Data_BB[Lag Index U],Data_BB[Upper Bollinger Band]))","v":311.09544365129199},{"$f":"MAX(IF(N57=Data_BB[Index],Data_BB[Lower Bollinger Band],0),IF(N57=Data_BB[Lag Index U],Data_BB[Lower Bollinger Band],0))","v":267.48883917863134},{"$f":"MIN(IF(N57=Data_BB[Index],Data_BB[Lower Bollinger Band]),IF(N57=Data_BB[Lag Index U],Data_BB[Lower Bollinger Band]))","v":263.58040766664686}]
[null,null,null,"2022-02-08",301.73269699999997,{"$f":"IF(Data_BB[[#This Row],[Adj Close]]<E59,TRUE,\"\")","v":true},{"$f":"IF(F57=Data_BB[[#This Row],[Up]],0,1)","v":0},{"$f":"SUM($G$33:G58)","v":16},16,{"$f":"AVERAGE(OFFSET(E57,1,,-MIN(Bollinger_Band_Range_BB,COUNTA(E$32:E57)))+Standard_Deviation_BB*IFERROR(STDEV(OFFSET(E57,1,,-MIN(Bollinger_Band_Range_BB,COUNTA(E$32:E57)))),0))","v":323.12169365327708},{"$f":"IFERROR(AVERAGE(OFFSET(E57,1,,-MIN(Bollinger_Band_Range_BB,COUNTA(E$32:E57)))-Standard_Deviation_BB*IFERROR(STDEV(OFFSET(E57,1,,-MIN(Bollinger_Band_Range_BB,COUNTA(E$32:E57)))),0)),0)","v":279.97023444672294},null,null,26,{"$f":"INDEX(Data_BB[Date],MATCH(N58,Data_BB[Index],0))","v":"2022-03-14"},{"$f":"MAX(IF(N58=Data_BB[Index],Data_BB[Adj Close],0),IF(N58=Data_BB[Lag Index U],Data_BB[Adj Close],0))","v":298.25650000000002},{"$f":"MIN(IF(N58=Data_BB[Index],Data_BB[Adj Close]),IF(N58=Data_BB[Lag Index U],Data_BB[Adj Close]))","v":274.44006300000001},{"$f":"MAX(IF(N58=Data_BB[Index],Data_BB[Upper Bollinger Band],0),IF(N58=Data_BB[Lag Index U],Data_BB[Upper Bollinger Band],0))","v":311.96153263335304},{"$f":"MIN(IF(N58=Data_BB[Index],Data_BB[Upper Bollinger Band]),IF(N58=Data_BB[Lag Index U],Data_BB[Upper Bollinger Band]))","v":309.41001883771645},{"$f":"MAX(IF(N58=Data_BB[Index],Data_BB[Lower Bollinger Band],0),IF(N58=Data_BB[Lag Index U],Data_BB[Lower Bollinger Band],0))","v":264.44607846228354},{"$f":"MIN(IF(N58=Data_BB[Index],Data_BB[Lower Bollinger Band]),IF(N58=Data_BB[Lag Index U],Data_BB[Lower Bollinger Band]))","v":263.37287480386385}]
[null,null,null,"2022-02-09",308.32095299999997,{"$f":"IF(Data_BB[[#This Row],[Adj Close]]<E60,TRUE,\"\")","v":""},{"$f":"IF(F58=Data_BB[[#This Row],[Up]],0,1)","v":1},{"$f":"SUM($G$33:G59)","v":17},16,{"$f":"AVERAGE(OFFSET(E58,1,,-MIN(Bollinger_Band_Range_BB,COUNTA(E$32:E58)))+Standard_Deviation_BB*IFERROR(STDEV(OFFSET(E58,1,,-MIN(Bollinger_Band_Range_BB,COUNTA(E$32:E58)))),0))","v":322.20628503686538},{"$f":"IFERROR(AVERAGE(OFFSET(E58,1,,-MIN(Bollinger_Band_Range_BB,COUNTA(E$32:E58)))-Standard_Deviation_BB*IFERROR(STDEV(OFFSET(E58,1,,-MIN(Bollinger_Band_Range_BB,COUNTA(E$32:E58)))),0)),0)","v":280.51213836313457},null,null,27,{"$f":"INDEX(Data_BB[Date],MATCH(N59,Data_BB[Index],0))","v":"2022-03-18"},{"$f":"MAX(IF(N59=Data_BB[Index],Data_BB[Adj Close],0),IF(N59=Data_BB[Lag Index U],Data_BB[Adj Close],0))","v":298.25650000000002},{"$f":"MIN(IF(N59=Data_BB[Index],Data_BB[Adj Close]),IF(N59=Data_BB[Lag Index U],Data_BB[Adj Close]))","v":296.99569700000001},{"$f":"MAX(IF(N59=Data_BB[Index],Data_BB[Upper Bollinger Band],0),IF(N59=Data_BB[Lag Index U],Data_BB[Upper Bollinger Band],0))","v":312.50458413865442},{"$f":"MIN(IF(N59=Data_BB[Index],Data_BB[Upper Bollinger Band]),IF(N59=Data_BB[Lag Index U],Data_BB[Upper Bollinger Band]))","v":311.13011358647714},{"$f":"MAX(IF(N59=Data_BB[Index],Data_BB[Lower Bollinger Band],0),IF(N59=Data_BB[Lag Index U],Data_BB[Lower Bollinger Band],0))","v":263.68896591352285},{"$f":"MIN(IF(N59=Data_BB[Index],Data_BB[Lower Bollinger Band]),IF(N59=Data_BB[Lag Index U],Data_BB[Lower Bollinger Band]))","v":263.42937266134561}]
[null,null,null,"2022-02-10",299.57299799999998,{"$f":"IF(Data_BB[[#This Row],[Adj Close]]<E61,TRUE,\"\")","v":""},{"$f":"IF(F59=Data_BB[[#This Row],[Up]],0,1)","v":0},{"$f":"SUM($G$33:G60)","v":17},17,{"$f":"AVERAGE(OFFSET(E59,1,,-MIN(Bollinger_Band_Range_BB,COUNTA(E$32:E59)))+Standard_Deviation_BB*IFERROR(STDEV(OFFSET(E59,1,,-MIN(Bollinger_Band_Range_BB,COUNTA(E$32:E59)))),0))","v":318.95632070593257},{"$f":"IFERROR(AVERAGE(OFFSET(E59,1,,-MIN(Bollinger_Band_Range_BB,COUNTA(E$32:E59)))-Standard_Deviation_BB*IFERROR(STDEV(OFFSET(E59,1,,-MIN(Bollinger_Band_Range_BB,COUNTA(E$32:E59)))),0)),0)","v":282.18785949406742},null,null,28,{"$f":"INDEX(Data_BB[Date],MATCH(N60,Data_BB[Index],0))","v":"2022-03-21"},{"$f":"MAX(IF(N60=Data_BB[Index],Data_BB[Adj Close],0),IF(N60=Data_BB[Lag Index U],Data_BB[Adj Close],0))","v":301.860229},{"$f":"MIN(IF(N60=Data_BB[Index],Data_BB[Adj Close]),IF(N60=Data_BB[Lag Index U],Data_BB[Adj Close]))","v":296.99569700000001},{"$f":"MAX(IF(N60=Data_BB[Index],Data_BB[Upper Bollinger Band],0),IF(N60=Data_BB[Lag Index U],Data_BB[Upper Bollinger Band],0))","v":314.94531830163021},{"$f":"MIN(IF(N60=Data_BB[Index],Data_BB[Upper Bollinger Band]),IF(N60=Data_BB[Lag Index U],Data_BB[Upper Bollinger Band]))","v":312.50458413865442},{"$f":"MAX(IF(N60=Data_BB[Index],Data_BB[Lower Bollinger Band],0),IF(N60=Data_BB[Lag Index U],Data_BB[Lower Bollinger Band],0))","v":263.42937266134561},{"$f":"MIN(IF(N60=Data_BB[Index],Data_BB[Lower Bollinger Band]),IF(N60=Data_BB[Lag Index U],Data_BB[Lower Bollinger Band]))","v":262.6108155983697}]
[null,null,null,"2022-02-11",292.301086,{"$f":"IF(Data_BB[[#This Row],[Adj Close]]<E62,TRUE,\"\")","v":""},{"$f":"IF(F60=Data_BB[[#This Row],[Up]],0,1)","v":0},{"$f":"SUM($G$33:G61)","v":17},17,{"$f":"AVERAGE(OFFSET(E60,1,,-MIN(Bollinger_Band_Range_BB,COUNTA(E$32:E60)))+Standard_Deviation_BB*IFERROR(STDEV(OFFSET(E60,1,,-MIN(Bollinger_Band_Range_BB,COUNTA(E$32:E60)))),0))","v":319.25222414452566},{"$f":"IFERROR(AVERAGE(OFFSET(E60,1,,-MIN(Bollinger_Band_Range_BB,COUNTA(E$32:E60)))-Standard_Deviation_BB*IFERROR(STDEV(OFFSET(E60,1,,-MIN(Bollinger_Band_Range_BB,COUNTA(E$32:E60)))),0)),0)","v":280.92501565547434},null,null,29,{"$f":"INDEX(Data_BB[Date],MATCH(N61,Data_BB[Index],0))","v":"2022-03-22"},{"$f":"MAX(IF(N61=Data_BB[Index],Data_BB[Adj Close],0),IF(N61=Data_BB[Lag Index U],Data_BB[Adj Close],0))","v":301.860229},{"$f":"MIN(IF(N61=Data_BB[Index],Data_BB[Adj Close]),IF(N61=Data_BB[Lag Index U],Data_BB[Adj Close]))","v":297.32327299999997},{"$f":"MAX(IF(N61=Data_BB[Index],Data_BB[Upper Bollinger Band],0),IF(N61=Data_BB[Lag Index U],Data_BB[Upper Bollinger Band],0))","v":315.38578391834221},{"$f":"MIN(IF(N61=Data_BB[Index],Data_BB[Upper Bollinger Band]),IF(N61=Data_BB[Lag Index U],Data_BB[Upper Bollinger Band]))","v":314.94531830163021},{"$f":"MAX(IF(N61=Data_BB[Index],Data_BB[Lower Bollinger Band],0),IF(N61=Data_BB[Lag Index U],Data_BB[Lower Bollinger Band],0))","v":264.07844628165782},{"$f":"MIN(IF(N61=Data_BB[Index],Data_BB[Lower Bollinger Band]),IF(N61=Data_BB[Lag Index U],Data_BB[Lower Bollinger Band]))","v":262.6108155983697}]
[null,null,null,"2022-02-14",292.26147500000002,{"$f":"IF(Data_BB[[#This Row],[Adj Close]]<E63,TRUE,\"\")","v":true},{"$f":"IF(F61=Data_BB[[#This Row],[Up]],0,1)","v":1},{"$f":"SUM($G$33:G62)","v":18},17,{"$f":"AVERAGE(OFFSET(E61,1,,-MIN(Bollinger_Band_Range_BB,COUNTA(E$32:E61)))+Standard_Deviation_BB*IFERROR(STDEV(OFFSET(E61,1,,-MIN(Bollinger_Band_Range_BB,COUNTA(E$32:E61)))),0))","v":318.46992654029009},{"$f":"IFERROR(AVERAGE(OFFSET(E61,1,,-MIN(Bollinger_Band_Range_BB,COUNTA(E$32:E61)))-Standard_Deviation_BB*IFERROR(STDEV(OFFSET(E61,1,,-MIN(Bollinger_Band_Range_BB,COUNTA(E$32:E61)))),0)),0)","v":280.20142035970991},null,null,30,{"$f":"INDEX(Data_BB[Date],MATCH(N62,Data_BB[Index],0))","v":"2022-03-23"},{"$f":"MAX(IF(N62=Data_BB[Index],Data_BB[Adj Close],0),IF(N62=Data_BB[Lag Index U],Data_BB[Adj Close],0))","v":301.89996300000001},{"$f":"MIN(IF(N62=Data_BB[Index],Data_BB[Adj Close]),IF(N62=Data_BB[Lag Index U],Data_BB[Adj Close]))","v":297.32327299999997},{"$f":"MAX(IF(N62=Data_BB[Index],Data_BB[Upper Bollinger Band],0),IF(N62=Data_BB[Lag Index U],Data_BB[Upper Bollinger Band],0))","v":317.08558573680421},{"$f":"MIN(IF(N62=Data_BB[Index],Data_BB[Upper Bollinger Band]),IF(N62=Data_BB[Lag Index U],Data_BB[Upper Bollinger Band]))","v":315.38578391834221},{"$f":"MAX(IF(N62=Data_BB[Index],Data_BB[Lower Bollinger Band],0),IF(N62=Data_BB[Lag Index U],Data_BB[Lower Bollinger Band],0))","v":264.07844628165782},{"$f":"MIN(IF(N62=Data_BB[Index],Data_BB[Lower Bollinger Band]),IF(N62=Data_BB[Lag Index U],Data_BB[Lower Bollinger Band]))","v":263.32276976319577}]
[null,null,null,"2022-02-15",297.68069500000001,{"$f":"IF(Data_BB[[#This Row],[Adj Close]]<E64,TRUE,\"\")","v":""},{"$f":"IF(F62=Data_BB[[#This Row],[Up]],0,1)","v":1},{"$f":"SUM($G$33:G63)","v":19},18,{"$f":"AVERAGE(OFFSET(E62,1,,-MIN(Bollinger_Band_Range_BB,COUNTA(E$32:E62)))+Standard_Deviation_BB*IFERROR(STDEV(OFFSET(E62,1,,-MIN(Bollinger_Band_Range_BB,COUNTA(E$32:E62)))),0))","v":318.38978005370416},{"$f":"IFERROR(AVERAGE(OFFSET(E62,1,,-MIN(Bollinger_Band_Range_BB,COUNTA(E$32:E62)))-Standard_Deviation_BB*IFERROR(STDEV(OFFSET(E62,1,,-MIN(Bollinger_Band_Range_BB,COUNTA(E$32:E62)))),0)),0)","v":280.06559094629586},null,null,31,{"$f":"INDEX(Data_BB[Date],MATCH(N63,Data_BB[Index],0))","v":"2022-03-24"},{"$f":"MAX(IF(N63=Data_BB[Index],Data_BB[Adj Close],0),IF(N63=Data_BB[Lag Index U],Data_BB[Adj Close],0))","v":301.89996300000001},{"$f":"MIN(IF(N63=Data_BB[Index],Data_BB[Adj Close]),IF(N63=Data_BB[Lag Index U],Data_BB[Adj Close]))","v":301.48297100000002},{"$f":"MAX(IF(N63=Data_BB[Index],Data_BB[Upper Bollinger Band],0),IF(N63=Data_BB[Lag Index U],Data_BB[Upper Bollinger Band],0))","v":318.27449536105166},{"$f":"MIN(IF(N63=Data_BB[Index],Data_BB[Upper Bollinger Band]),IF(N63=Data_BB[Lag Index U],Data_BB[Upper Bollinger Band]))","v":317.08558573680421},{"$f":"MAX(IF(N63=Data_BB[Index],Data_BB[Lower Bollinger Band],0),IF(N63=Data_BB[Lag Index U],Data_BB[Lower Bollinger Band],0))","v":263.32276976319577},{"$f":"MIN(IF(N63=Data_BB[Index],Data_BB[Lower Bollinger Band]),IF(N63=Data_BB[Lag Index U],Data_BB[Lower Bollinger Band]))","v":262.76624843894831}]
[null,null,null,"2022-02-16",297.333191,{"$f":"IF(Data_BB[[#This Row],[Adj Close]]<E65,TRUE,\"\")","v":""},{"$f":"IF(F63=Data_BB[[#This Row],[Up]],0,1)","v":0},{"$f":"SUM($G$33:G64)","v":19},19,{"$f":"AVERAGE(OFFSET(E63,1,,-MIN(Bollinger_Band_Range_BB,COUNTA(E$32:E63)))+Standard_Deviation_BB*IFERROR(STDEV(OFFSET(E63,1,,-MIN(Bollinger_Band_Range_BB,COUNTA(E$32:E63)))),0))","v":318.24838071951802},{"$f":"IFERROR(AVERAGE(OFFSET(E63,1,,-MIN(Bollinger_Band_Range_BB,COUNTA(E$32:E63)))-Standard_Deviation_BB*IFERROR(STDEV(OFFSET(E63,1,,-MIN(Bollinger_Band_Range_BB,COUNTA(E$32:E63)))),0)),0)","v":279.888899480482},null,null,32,{"$f":"INDEX(Data_BB[Date],MATCH(N64,Data_BB[Index],0))","v":"2022-03-25"},{"$f":"MAX(IF(N64=Data_BB[Index],Data_BB[Adj Close],0),IF(N64=Data_BB[Lag Index U],Data_BB[Adj Close],0))","v":313.12811299999998},{"$f":"MIN(IF(N64=Data_BB[Index],Data_BB[Adj Close]),IF(N64=Data_BB[Lag Index U],Data_BB[Adj Close]))","v":301.48297100000002},{"$f":"MAX(IF(N64=Data_BB[Index],Data_BB[Upper Bollinger Band],0),IF(N64=Data_BB[Lag Index U],Data_BB[Upper Bollinger Band],0))","v":325.59478979806215},{"$f":"MIN(IF(N64=Data_BB[Index],Data_BB[Upper Bollinger Band]),IF(N64=Data_BB[Lag Index U],Data_BB[Upper Bollinger Band]))","v":318.27449536105166},{"$f":"MAX(IF(N64=Data_BB[Index],Data_BB[Lower Bollinger Band],0),IF(N64=Data_BB[Lag Index U],Data_BB[Lower Bollinger Band],0))","v":262.76624843894831},{"$f":"MIN(IF(N64=Data_BB[Index],Data_BB[Lower Bollinger Band]),IF(N64=Data_BB[Lag Index U],Data_BB[Lower Bollinger Band]))","v":258.65953430193781}]
[null,null,null,"2022-02-17",288.62667800000003,{"$f":"IF(Data_BB[[#This Row],[Adj Close]]<E66,TRUE,\"\")","v":""},{"$f":"IF(F64=Data_BB[[#This Row],[Up]],0,1)","v":0},{"$f":"SUM($G$33:G65)","v":19},19,{"$f":"AVERAGE(OFFSET(E64,1,,-MIN(Bollinger_Band_Range_BB,COUNTA(E$32:E64)))+Standard_Deviation_BB*IFERROR(STDEV(OFFSET(E64,1,,-MIN(Bollinger_Band_Range_BB,COUNTA(E$32:E64)))),0))","v":318.98115419323534},{"$f":"IFERROR(AVERAGE(OFFSET(E64,1,,-MIN(Bollinger_Band_Range_BB,COUNTA(E$32:E64)))-Standard_Deviation_BB*IFERROR(STDEV(OFFSET(E64,1,,-MIN(Bollinger_Band_Range_BB,COUNTA(E$32:E64)))),0)),0)","v":278.13877670676465},null,null,33,{"$f":"INDEX(Data_BB[Date],MATCH(N65,Data_BB[Index],0))","v":"2022-03-29"},{"$f":"MAX(IF(N65=Data_BB[Index],Data_BB[Adj Close],0),IF(N65=Data_BB[Lag Index U],Data_BB[Adj Close],0))","v":313.12811299999998},{"$f":"MIN(IF(N65=Data_BB[Index],Data_BB[Adj Close]),IF(N65=Data_BB[Lag Index U],Data_BB[Adj Close]))","v":306.07946800000002},{"$f":"MAX(IF(N65=Data_BB[Index],Data_BB[Upper Bollinger Band],0),IF(N65=Data_BB[Lag Index U],Data_BB[Upper Bollinger Band],0))","v":330.27352583362494},{"$f":"MIN(IF(N65=Data_BB[Index],Data_BB[Upper Bollinger Band]),IF(N65=Data_BB[Lag Index U],Data_BB[Upper Bollinger Band]))","v":325.59478979806215},{"$f":"MAX(IF(N65=Data_BB[Index],Data_BB[Lower Bollinger Band],0),IF(N65=Data_BB[Lag Index U],Data_BB[Lower Bollinger Band],0))","v":258.65953430193781},{"$f":"MIN(IF(N65=Data_BB[Index],Data_BB[Lower Bollinger Band]),IF(N65=Data_BB[Lag Index U],Data_BB[Lower Bollinger Band]))","v":256.56793816637509}]
[null,null,null,"2022-02-18",285.846924,{"$f":"IF(Data_BB[[#This Row],[Adj Close]]<E67,TRUE,\"\")","v":""},{"$f":"IF(F65=Data_BB[[#This Row],[Up]],0,1)","v":0},{"$f":"SUM($G$33:G66)","v":19},19,{"$f":"AVERAGE(OFFSET(E65,1,,-MIN(Bollinger_Band_Range_BB,COUNTA(E$32:E65)))+Standard_Deviation_BB*IFERROR(STDEV(OFFSET(E65,1,,-MIN(Bollinger_Band_Range_BB,COUNTA(E$32:E65)))),0))","v":320.0760517296294},{"$f":"IFERROR(AVERAGE(OFFSET(E65,1,,-MIN(Bollinger_Band_Range_BB,COUNTA(E$32:E65)))-Standard_Deviation_BB*IFERROR(STDEV(OFFSET(E65,1,,-MIN(Bollinger_Band_Range_BB,COUNTA(E$32:E65)))),0)),0)","v":276.30038247037061},null,null,34,{"$f":"INDEX(Data_BB[Date],MATCH(N66,Data_BB[Index],0))","v":"2022-03-31"},{"$f":"MAX(IF(N66=Data_BB[Index],Data_BB[Adj Close],0),IF(N66=Data_BB[Lag Index U],Data_BB[Adj Close],0))","v":312.69131499999997},{"$f":"MIN(IF(N66=Data_BB[Index],Data_BB[Adj Close]),IF(N66=Data_BB[Lag Index U],Data_BB[Adj Close]))","v":306.07946800000002},{"$f":"MAX(IF(N66=Data_BB[Index],Data_BB[Upper Bollinger Band],0),IF(N66=Data_BB[Lag Index U],Data_BB[Upper Bollinger Band],0))","v":333.69089678333575},{"$f":"MIN(IF(N66=Data_BB[Index],Data_BB[Upper Bollinger Band]),IF(N66=Data_BB[Lag Index U],Data_BB[Upper Bollinger Band]))","v":330.27352583362494},{"$f":"MAX(IF(N66=Data_BB[Index],Data_BB[Lower Bollinger Band],0),IF(N66=Data_BB[Lag Index U],Data_BB[Lower Bollinger Band],0))","v":258.67233251666426},{"$f":"MIN(IF(N66=Data_BB[Index],Data_BB[Lower Bollinger Band]),IF(N66=Data_BB[Lag Index U],Data_BB[Lower Bollinger Band]))","v":256.56793816637509}]
[null,null,null,"2022-02-22",285.63845800000001,{"$f":"IF(Data_BB[[#This Row],[Adj Close]]<E68,TRUE,\"\")","v":""},{"$f":"IF(F66=Data_BB[[#This Row],[Up]],0,1)","v":0},{"$f":"SUM($G$33:G67)","v":19},19,{"$f":"AVERAGE(OFFSET(E66,1,,-MIN(Bollinger_Band_Range_BB,COUNTA(E$32:E66)))+Standard_Deviation_BB*IFERROR(STDEV(OFFSET(E66,1,,-MIN(Bollinger_Band_Range_BB,COUNTA(E$32:E66)))),0))","v":321.07615179692795},{"$f":"IFERROR(AVERAGE(OFFSET(E66,1,,-MIN(Bollinger_Band_Range_BB,COUNTA(E$32:E66)))-Standard_Deviation_BB*IFERROR(STDEV(OFFSET(E66,1,,-MIN(Bollinger_Band_Range_BB,COUNTA(E$32:E66)))),0)),0)","v":274.50225380307199},null,null,35,{"$f":"INDEX(Data_BB[Date],MATCH(N67,Data_BB[Index],0))","v":"2022-04-04"},{"$f":"MAX(IF(N67=Data_BB[Index],Data_BB[Adj Close],0),IF(N67=Data_BB[Lag Index U],Data_BB[Adj Close],0))","v":312.69131499999997},{"$f":"MIN(IF(N67=Data_BB[Index],Data_BB[Adj Close]),IF(N67=Data_BB[Lag Index U],Data_BB[Adj Close]))","v":297.333191},{"$f":"MAX(IF(N67=Data_BB[Index],Data_BB[Upper Bollinger Band],0),IF(N67=Data_BB[Lag Index U],Data_BB[Upper Bollinger Band],0))","v":333.69089678333575},{"$f":"MIN(IF(N67=Data_BB[Index],Data_BB[Upper Bollinger Band]),IF(N67=Data_BB[Lag Index U],Data_BB[Upper Bollinger Band]))","v":332.38093369094901},{"$f":"MAX(IF(N67=Data_BB[Index],Data_BB[Lower Bollinger Band],0),IF(N67=Data_BB[Lag Index U],Data_BB[Lower Bollinger Band],0))","v":264.55199170905104},{"$f":"MIN(IF(N67=Data_BB[Index],Data_BB[Lower Bollinger Band]),IF(N67=Data_BB[Lag Index U],Data_BB[Lower Bollinger Band]))","v":258.67233251666426}]
[null,null,null,"2022-02-23",278.24230999999997,{"$f":"IF(Data_BB[[#This Row],[Adj Close]]<E69,TRUE,\"\")","v":true},{"$f":"IF(F67=Data_BB[[#This Row],[Up]],0,1)","v":1},{"$f":"SUM($G$33:G68)","v":20},19,{"$f":"AVERAGE(OFFSET(E67,1,,-MIN(Bollinger_Band_Range_BB,COUNTA(E$32:E67)))+Standard_Deviation_BB*IFERROR(STDEV(OFFSET(E67,1,,-MIN(Bollinger_Band_Range_BB,COUNTA(E$32:E67)))),0))","v":322.98332767114516},{"$f":"IFERROR(AVERAGE(OFFSET(E67,1,,-MIN(Bollinger_Band_Range_BB,COUNTA(E$32:E67)))-Standard_Deviation_BB*IFERROR(STDEV(OFFSET(E67,1,,-MIN(Bollinger_Band_Range_BB,COUNTA(E$32:E67)))),0)),0)","v":271.83811692885479},null,null,36,{"$f":"INDEX(Data_BB[Date],MATCH(N68,Data_BB[Index],0))","v":"2022-04-06"},{"$f":"MAX(IF(N68=Data_BB[Index],Data_BB[Adj Close],0),IF(N68=Data_BB[Lag Index U],Data_BB[Adj Close],0))","v":299.18966699999999},{"$f":"MIN(IF(N68=Data_BB[Index],Data_BB[Adj Close]),IF(N68=Data_BB[Lag Index U],Data_BB[Adj Close]))","v":297.333191},{"$f":"MAX(IF(N68=Data_BB[Index],Data_BB[Upper Bollinger Band],0),IF(N68=Data_BB[Lag Index U],Data_BB[Upper Bollinger Band],0))","v":332.38093369094901},{"$f":"MIN(IF(N68=Data_BB[Index],Data_BB[Upper Bollinger Band]),IF(N68=Data_BB[Lag Index U],Data_BB[Upper Bollinger Band]))","v":331.48113166456017},{"$f":"MAX(IF(N68=Data_BB[Index],Data_BB[Lower Bollinger Band],0),IF(N68=Data_BB[Lag Index U],Data_BB[Lower Bollinger Band],0))","v":267.0183739354398},{"$f":"MIN(IF(N68=Data_BB[Index],Data_BB[Lower Bollinger Band]),IF(N68=Data_BB[Lag Index U],Data_BB[Lower Bollinger Band]))","v":264.55199170905104}]
[null,null,null,"2022-02-24",292.45871,{"$f":"IF(Data_BB[[#This Row],[Adj Close]]<E70,TRUE,\"\")","v":true},{"$f":"IF(F68=Data_BB[[#This Row],[Up]],0,1)","v":0},{"$f":"SUM($G$33:G69)","v":20},20,{"$f":"AVERAGE(OFFSET(E68,1,,-MIN(Bollinger_Band_Range_BB,COUNTA(E$32:E68)))+Standard_Deviation_BB*IFERROR(STDEV(OFFSET(E68,1,,-MIN(Bollinger_Band_Range_BB,COUNTA(E$32:E68)))),0))","v":323.02373836049571},{"$f":"IFERROR(AVERAGE(OFFSET(E68,1,,-MIN(Bollinger_Band_Range_BB,COUNTA(E$32:E68)))-Standard_Deviation_BB*IFERROR(STDEV(OFFSET(E68,1,,-MIN(Bollinger_Band_Range_BB,COUNTA(E$32:E68)))),0)),0)","v":271.64801753950439},null,null,37,{"$f":"INDEX(Data_BB[Date],MATCH(N69,Data_BB[Index],0))","v":"2022-04-07"},{"$f":"MAX(IF(N69=Data_BB[Index],Data_BB[Adj Close],0),IF(N69=Data_BB[Lag Index U],Data_BB[Adj Close],0))","v":299.18966699999999},{"$f":"MIN(IF(N69=Data_BB[Index],Data_BB[Adj Close]),IF(N69=Data_BB[Lag Index U],Data_BB[Adj Close]))","v":280.019409},{"$f":"MAX(IF(N69=Data_BB[Index],Data_BB[Upper Bollinger Band],0),IF(N69=Data_BB[Lag Index U],Data_BB[Upper Bollinger Band],0))","v":331.48113166456017},{"$f":"MIN(IF(N69=Data_BB[Index],Data_BB[Upper Bollinger Band]),IF(N69=Data_BB[Lag Index U],Data_BB[Upper Bollinger Band]))","v":326.02564355277252},{"$f":"MAX(IF(N69=Data_BB[Index],Data_BB[Lower Bollinger Band],0),IF(N69=Data_BB[Lag Index U],Data_BB[Lower Bollinger Band],0))","v":275.02725564722755},{"$f":"MIN(IF(N69=Data_BB[Index],Data_BB[Lower Bollinger Band]),IF(N69=Data_BB[Lag Index U],Data_BB[Lower Bollinger Band]))","v":267.0183739354398}]
[null,null,null,"2022-02-25",295.159088,{"$f":"IF(Data_BB[[#This Row],[Adj Close]]<E71,TRUE,\"\")","v":true},{"$f":"IF(F69=Data_BB[[#This Row],[Up]],0,1)","v":0},{"$f":"SUM($G$33:G70)","v":20},20,{"$f":"AVERAGE(OFFSET(E69,1,,-MIN(Bollinger_Band_Range_BB,COUNTA(E$32:E69)))+Standard_Deviation_BB*IFERROR(STDEV(OFFSET(E69,1,,-MIN(Bollinger_Band_Range_BB,COUNTA(E$32:E69)))),0))","v":322.97014118361841},{"$f":"IFERROR(AVERAGE(OFFSET(E69,1,,-MIN(Bollinger_Band_Range_BB,COUNTA(E$32:E69)))-Standard_Deviation_BB*IFERROR(STDEV(OFFSET(E69,1,,-MIN(Bollinger_Band_Range_BB,COUNTA(E$32:E69)))),0)),0)","v":271.51186861638155},null,null,38,{"$f":"INDEX(Data_BB[Date],MATCH(N70,Data_BB[Index],0))","v":"2022-04-12"},{"$f":"MAX(IF(N70=Data_BB[Index],Data_BB[Adj Close],0),IF(N70=Data_BB[Lag Index U],Data_BB[Adj Close],0))","v":285.539154},{"$f":"MIN(IF(N70=Data_BB[Index],Data_BB[Adj Close]),IF(N70=Data_BB[Lag Index U],Data_BB[Adj Close]))","v":280.019409},{"$f":"MAX(IF(N70=Data_BB[Index],Data_BB[Upper Bollinger Band],0),IF(N70=Data_BB[Lag Index U],Data_BB[Upper Bollinger Band],0))","v":328.34606308280655},{"$f":"MIN(IF(N70=Data_BB[Index],Data_BB[Upper Bollinger Band]),IF(N70=Data_BB[Lag Index U],Data_BB[Upper Bollinger Band]))","v":327.39721855142989},{"$f":"MAX(IF(N70=Data_BB[Index],Data_BB[Lower Bollinger Band],0),IF(N70=Data_BB[Lag Index U],Data_BB[Lower Bollinger Band],0))","v":273.15036444857014},{"$f":"MIN(IF(N70=Data_BB[Index],Data_BB[Lower Bollinger Band]),IF(N70=Data_BB[Lag Index U],Data_BB[Lower Bollinger Band]))","v":271.52941601719357}]
[null,null,null,"2022-02-28",296.62835699999999,{"$f":"IF(Data_BB[[#This Row],[Adj Close]]<E72,TRUE,\"\")","v":""},{"$f":"IF(F70=Data_BB[[#This Row],[Up]],0,1)","v":1},{"$f":"SUM($G$33:G71)","v":21},20,{"$f":"AVERAGE(OFFSET(E70,1,,-MIN(Bollinger_Band_Range_BB,COUNTA(E$32:E70)))+Standard_Deviation_BB*IFERROR(STDEV(OFFSET(E70,1,,-MIN(Bollinger_Band_Range_BB,COUNTA(E$32:E70)))),0))","v":321.87887506414114},{"$f":"IFERROR(AVERAGE(OFFSET(E70,1,,-MIN(Bollinger_Band_Range_BB,COUNTA(E$32:E70)))-Standard_Deviation_BB*IFERROR(STDEV(OFFSET(E70,1,,-MIN(Bollinger_Band_Range_BB,COUNTA(E$32:E70)))),0)),0)","v":271.72613283585889},null,null,39,{"$f":"INDEX(Data_BB[Date],MATCH(N71,Data_BB[Index],0))","v":"2022-04-13"},{"$f":"MAX(IF(N71=Data_BB[Index],Data_BB[Adj Close],0),IF(N71=Data_BB[Lag Index U],Data_BB[Adj Close],0))","v":285.539154},{"$f":"MIN(IF(N71=Data_BB[Index],Data_BB[Adj Close]),IF(N71=Data_BB[Lag Index U],Data_BB[Adj Close]))","v":277.805542},{"$f":"MAX(IF(N71=Data_BB[Index],Data_BB[Upper Bollinger Band],0),IF(N71=Data_BB[Lag Index U],Data_BB[Upper Bollinger Band],0))","v":330.97445551812717},{"$f":"MIN(IF(N71=Data_BB[Index],Data_BB[Upper Bollinger Band]),IF(N71=Data_BB[Lag Index U],Data_BB[Upper Bollinger Band]))","v":328.34606308280655},{"$f":"MAX(IF(N71=Data_BB[Index],Data_BB[Lower Bollinger Band],0),IF(N71=Data_BB[Lag Index U],Data_BB[Lower Bollinger Band],0))","v":271.52941601719357},{"$f":"MIN(IF(N71=Data_BB[Index],Data_BB[Lower Bollinger Band]),IF(N71=Data_BB[Lag Index U],Data_BB[Lower Bollinger Band]))","v":267.37316108187298}]
[null,null,null,"2022-03-01",292.81616200000002,{"$f":"IF(Data_BB[[#This Row],[Adj Close]]<E73,TRUE,\"\")","v":true},{"$f":"IF(F71=Data_BB[[#This Row],[Up]],0,1)","v":1},{"$f":"SUM($G$33:G72)","v":22},21,{"$f":"AVERAGE(OFFSET(E71,1,,-MIN(Bollinger_Band_Range_BB,COUNTA(E$32:E71)))+Standard_Deviation_BB*IFERROR(STDEV(OFFSET(E71,1,,-MIN(Bollinger_Band_Range_BB,COUNTA(E$32:E71)))),0))","v":319.92254074503461},{"$f":"IFERROR(AVERAGE(OFFSET(E71,1,,-MIN(Bollinger_Band_Range_BB,COUNTA(E$32:E71)))-Standard_Deviation_BB*IFERROR(STDEV(OFFSET(E71,1,,-MIN(Bollinger_Band_Range_BB,COUNTA(E$32:E71)))),0)),0)","v":272.15477245496538},null,null,40,{"$f":"INDEX(Data_BB[Date],MATCH(N72,Data_BB[Index],0))","v":"2022-04-14"},{"$f":"MAX(IF(N72=Data_BB[Index],Data_BB[Adj Close],0),IF(N72=Data_BB[Lag Index U],Data_BB[Adj Close],0))","v":284.28826900000001},{"$f":"MIN(IF(N72=Data_BB[Index],Data_BB[Adj Close]),IF(N72=Data_BB[Lag Index U],Data_BB[Adj Close]))","v":277.805542},{"$f":"MAX(IF(N72=Data_BB[Index],Data_BB[Upper Bollinger Band],0),IF(N72=Data_BB[Lag Index U],Data_BB[Upper Bollinger Band],0))","v":333.65000030108411},{"$f":"MIN(IF(N72=Data_BB[Index],Data_BB[Upper Bollinger Band]),IF(N72=Data_BB[Lag Index U],Data_BB[Upper Bollinger Band]))","v":330.97445551812717},{"$f":"MAX(IF(N72=Data_BB[Index],Data_BB[Lower Bollinger Band],0),IF(N72=Data_BB[Lag Index U],Data_BB[Lower Bollinger Band],0))","v":267.37316108187298},{"$f":"MIN(IF(N72=Data_BB[Index],Data_BB[Lower Bollinger Band]),IF(N72=Data_BB[Lag Index U],Data_BB[Lower Bollinger Band]))","v":259.58785079891584}]
[null,null,null,"2022-03-02",298.01825000000002,{"$f":"IF(Data_BB[[#This Row],[Adj Close]]<E74,TRUE,\"\")","v":""},{"$f":"IF(F72=Data_BB[[#This Row],[Up]],0,1)","v":1},{"$f":"SUM($G$33:G73)","v":23},22,{"$f":"AVERAGE(OFFSET(E72,1,,-MIN(Bollinger_Band_Range_BB,COUNTA(E$32:E72)))+Standard_Deviation_BB*IFERROR(STDEV(OFFSET(E72,1,,-MIN(Bollinger_Band_Range_BB,COUNTA(E$32:E72)))),0))","v":318.55387086431938},{"$f":"IFERROR(AVERAGE(OFFSET(E72,1,,-MIN(Bollinger_Band_Range_BB,COUNTA(E$32:E72)))-Standard_Deviation_BB*IFERROR(STDEV(OFFSET(E72,1,,-MIN(Bollinger_Band_Range_BB,COUNTA(E$32:E72)))),0)),0)","v":272.73589353568065},null,null,41,{"$f":"INDEX(Data_BB[Date],MATCH(N73,Data_BB[Index],0))","v":"2022-04-20"},{"$f":"MAX(IF(N73=Data_BB[Index],Data_BB[Adj Close],0),IF(N73=Data_BB[Lag Index U],Data_BB[Adj Close],0))","v":284.28826900000001},{"$f":"MIN(IF(N73=Data_BB[Index],Data_BB[Adj Close]),IF(N73=Data_BB[Lag Index U],Data_BB[Adj Close]))","v":272.04748499999999},{"$f":"MAX(IF(N73=Data_BB[Index],Data_BB[Upper Bollinger Band],0),IF(N73=Data_BB[Lag Index U],Data_BB[Upper Bollinger Band],0))","v":335.90199345199341},{"$f":"MIN(IF(N73=Data_BB[Index],Data_BB[Upper Bollinger Band]),IF(N73=Data_BB[Lag Index U],Data_BB[Upper Bollinger Band]))","v":333.65000030108411},{"$f":"MAX(IF(N73=Data_BB[Index],Data_BB[Lower Bollinger Band],0),IF(N73=Data_BB[Lag Index U],Data_BB[Lower Bollinger Band],0))","v":259.58785079891584},{"$f":"MIN(IF(N73=Data_BB[Index],Data_BB[Lower Bollinger Band]),IF(N73=Data_BB[Lag Index U],Data_BB[Lower Bollinger Band]))","v":252.49612374800668}]
[null,null,null,"2022-03-03",293.77914399999997,{"$f":"IF(Data_BB[[#This Row],[Adj Close]]<E75,TRUE,\"\")","v":""},{"$f":"IF(F73=Data_BB[[#This Row],[Up]],0,1)","v":0},{"$f":"SUM($G$33:G74)","v":23},23,{"$f":"AVERAGE(OFFSET(E73,1,,-MIN(Bollinger_Band_Range_BB,COUNTA(E$32:E73)))+Standard_Deviation_BB*IFERROR(STDEV(OFFSET(E73,1,,-MIN(Bollinger_Band_Range_BB,COUNTA(E$32:E73)))),0))","v":315.16740426168053},{"$f":"IFERROR(AVERAGE(OFFSET(E73,1,,-MIN(Bollinger_Band_Range_BB,COUNTA(E$32:E73)))-Standard_Deviation_BB*IFERROR(STDEV(OFFSET(E73,1,,-MIN(Bollinger_Band_Range_BB,COUNTA(E$32:E73)))),0)),0)","v":274.44526663831942},null,null,42,{"$f":"INDEX(Data_BB[Date],MATCH(N74,Data_BB[Index],0))","v":"2022-04-22"},{"$f":"MAX(IF(N74=Data_BB[Index],Data_BB[Adj Close],0),IF(N74=Data_BB[Lag Index U],Data_BB[Adj Close],0))","v":278.68908699999997},{"$f":"MIN(IF(N74=Data_BB[Index],Data_BB[Adj Close]),IF(N74=Data_BB[Lag Index U],Data_BB[Adj Close]))","v":272.04748499999999},{"$f":"MAX(IF(N74=Data_BB[Index],Data_BB[Upper Bollinger Band],0),IF(N74=Data_BB[Lag Index U],Data_BB[Upper Bollinger Band],0))","v":335.90199345199341},{"$f":"MIN(IF(N74=Data_BB[Index],Data_BB[Upper Bollinger Band]),IF(N74=Data_BB[Lag Index U],Data_BB[Upper Bollinger Band]))","v":335.66977378194832},{"$f":"MAX(IF(N74=Data_BB[Index],Data_BB[Lower Bollinger Band],0),IF(N74=Data_BB[Lag Index U],Data_BB[Lower Bollinger Band],0))","v":252.49612374800668},{"$f":"MIN(IF(N74=Data_BB[Index],Data_BB[Lower Bollinger Band]),IF(N74=Data_BB[Lag Index U],Data_BB[Lower Bollinger Band]))","v":250.44895501805166}]
[null,null,null,"2022-03-04",287.76293900000002,{"$f":"IF(Data_BB[[#This Row],[Adj Close]]<E76,TRUE,\"\")","v":""},{"$f":"IF(F74=Data_BB[[#This Row],[Up]],0,1)","v":0},{"$f":"SUM($G$33:G75)","v":23},23,{"$f":"AVERAGE(OFFSET(E74,1,,-MIN(Bollinger_Band_Range_BB,COUNTA(E$32:E74)))+Standard_Deviation_BB*IFERROR(STDEV(OFFSET(E74,1,,-MIN(Bollinger_Band_Range_BB,COUNTA(E$32:E74)))),0))","v":314.98569333484045},{"$f":"IFERROR(AVERAGE(OFFSET(E74,1,,-MIN(Bollinger_Band_Range_BB,COUNTA(E$32:E74)))-Standard_Deviation_BB*IFERROR(STDEV(OFFSET(E74,1,,-MIN(Bollinger_Band_Range_BB,COUNTA(E$32:E74)))),0)),0)","v":273.55792846515959},null,null,43,{"$f":"INDEX(Data_BB[Date],MATCH(N75,Data_BB[Index],0))","v":"2022-04-25"},{"$f":"MAX(IF(N75=Data_BB[Index],Data_BB[Adj Close],0),IF(N75=Data_BB[Lag Index U],Data_BB[Adj Close],0))","v":278.68908699999997},{"$f":"MIN(IF(N75=Data_BB[Index],Data_BB[Adj Close]),IF(N75=Data_BB[Lag Index U],Data_BB[Adj Close]))","v":268.26507600000002},{"$f":"MAX(IF(N75=Data_BB[Index],Data_BB[Upper Bollinger Band],0),IF(N75=Data_BB[Lag Index U],Data_BB[Upper Bollinger Band],0))","v":335.66977378194832},{"$f":"MIN(IF(N75=Data_BB[Index],Data_BB[Upper Bollinger Band]),IF(N75=Data_BB[Lag Index U],Data_BB[Upper Bollinger Band]))","v":335.28079832996701},{"$f":"MAX(IF(N75=Data_BB[Index],Data_BB[Lower Bollinger Band],0),IF(N75=Data_BB[Lag Index U],Data_BB[Lower Bollinger Band],0))","v":250.44895501805166},{"$f":"MIN(IF(N75=Data_BB[Index],Data_BB[Lower Bollinger Band]),IF(N75=Data_BB[Lag Index U],Data_BB[Lower Bollinger Band]))","v":246.81921717003291}]
[null,null,null,"2022-03-07",276.89218099999999,{"$f":"IF(Data_BB[[#This Row],[Adj Close]]<E77,TRUE,\"\")","v":""},{"$f":"IF(F75=Data_BB[[#This Row],[Up]],0,1)","v":0},{"$f":"SUM($G$33:G76)","v":23},23,{"$f":"AVERAGE(OFFSET(E75,1,,-MIN(Bollinger_Band_Range_BB,COUNTA(E$32:E75)))+Standard_Deviation_BB*IFERROR(STDEV(OFFSET(E75,1,,-MIN(Bollinger_Band_Range_BB,COUNTA(E$32:E75)))),0))","v":315.74207759218314},{"$f":"IFERROR(AVERAGE(OFFSET(E75,1,,-MIN(Bollinger_Band_Range_BB,COUNTA(E$32:E75)))-Standard_Deviation_BB*IFERROR(STDEV(OFFSET(E75,1,,-MIN(Bollinger_Band_Range_BB,COUNTA(E$32:E75)))),0)),0)","v":270.18077390781696},null,null,44,{"$f":"INDEX(Data_BB[Date],MATCH(N76,Data_BB[Index],0))","v":"2022-04-26"},{"$f":"MAX(IF(N76=Data_BB[Index],Data_BB[Adj Close],0),IF(N76=Data_BB[Lag Index U],Data_BB[Adj Close],0))","v":287.53463699999998},{"$f":"MIN(IF(N76=Data_BB[Index],Data_BB[Adj Close]),IF(N76=Data_BB[Lag Index U],Data_BB[Adj Close]))","v":268.26507600000002},{"$f":"MAX(IF(N76=Data_BB[Index],Data_BB[Upper Bollinger Band],0),IF(N76=Data_BB[Lag Index U],Data_BB[Upper Bollinger Band],0))","v":335.28079832996701},{"$f":"MIN(IF(N76=Data_BB[Index],Data_BB[Upper Bollinger Band]),IF(N76=Data_BB[Lag Index U],Data_BB[Upper Bollinger Band]))","v":327.02333390501457},{"$f":"MAX(IF(N76=Data_BB[Index],Data_BB[Lower Bollinger Band],0),IF(N76=Data_BB[Lag Index U],Data_BB[Lower Bollinger Band],0))","v":249.47550359498547},{"$f":"MIN(IF(N76=Data_BB[Index],Data_BB[Lower Bollinger Band]),IF(N76=Data_BB[Lag Index U],Data_BB[Lower Bollinger Band]))","v":246.81921717003291}]
[null,null,null,"2022-03-08",273.854309,{"$f":"IF(Data_BB[[#This Row],[Adj Close]]<E78,TRUE,\"\")","v":true},{"$f":"IF(F76=Data_BB[[#This Row],[Up]],0,1)","v":1},{"$f":"SUM($G$33:G77)","v":24},23,{"$f":"AVERAGE(OFFSET(E76,1,,-MIN(Bollinger_Band_Range_BB,COUNTA(E$32:E76)))+Standard_Deviation_BB*IFERROR(STDEV(OFFSET(E76,1,,-MIN(Bollinger_Band_Range_BB,COUNTA(E$32:E76)))),0))","v":317.53627718744639},{"$f":"IFERROR(AVERAGE(OFFSET(E76,1,,-MIN(Bollinger_Band_Range_BB,COUNTA(E$32:E76)))-Standard_Deviation_BB*IFERROR(STDEV(OFFSET(E76,1,,-MIN(Bollinger_Band_Range_BB,COUNTA(E$32:E76)))),0)),0)","v":265.9563833125535},null,null,45,{"$f":"INDEX(Data_BB[Date],MATCH(N77,Data_BB[Index],0))","v":"2022-04-28"},{"$f":"MAX(IF(N77=Data_BB[Index],Data_BB[Adj Close],0),IF(N77=Data_BB[Lag Index U],Data_BB[Adj Close],0))","v":287.53463699999998},{"$f":"MIN(IF(N77=Data_BB[Index],Data_BB[Adj Close]),IF(N77=Data_BB[Lag Index U],Data_BB[Adj Close]))","v":275.51220699999999},{"$f":"MAX(IF(N77=Data_BB[Index],Data_BB[Upper Bollinger Band],0),IF(N77=Data_BB[Lag Index U],Data_BB[Upper Bollinger Band],0))","v":327.02333390501457},{"$f":"MIN(IF(N77=Data_BB[Index],Data_BB[Upper Bollinger Band]),IF(N77=Data_BB[Lag Index U],Data_BB[Upper Bollinger Band]))","v":324.23833995841693},{"$f":"MAX(IF(N77=Data_BB[Index],Data_BB[Lower Bollinger Band],0),IF(N77=Data_BB[Lag Index U],Data_BB[Lower Bollinger Band],0))","v":249.47550359498547},{"$f":"MIN(IF(N77=Data_BB[Index],Data_BB[Lower Bollinger Band]),IF(N77=Data_BB[Lag Index U],Data_BB[Lower Bollinger Band]))","v":249.20377144158306}]
[null,null,null,"2022-03-09",286.41281099999998,{"$f":"IF(Data_BB[[#This Row],[Adj Close]]<E79,TRUE,\"\")","v":""},{"$f":"IF(F77=Data_BB[[#This Row],[Up]],0,1)","v":1},{"$f":"SUM($G$33:G78)","v":25},24,{"$f":"AVERAGE(OFFSET(E77,1,,-MIN(Bollinger_Band_Range_BB,COUNTA(E$32:E77)))+Standard_Deviation_BB*IFERROR(STDEV(OFFSET(E77,1,,-MIN(Bollinger_Band_Range_BB,COUNTA(E$32:E77)))),0))","v":315.99629038547494},{"$f":"IFERROR(AVERAGE(OFFSET(E77,1,,-MIN(Bollinger_Band_Range_BB,COUNTA(E$32:E77)))-Standard_Deviation_BB*IFERROR(STDEV(OFFSET(E77,1,,-MIN(Bollinger_Band_Range_BB,COUNTA(E$32:E77)))),0)),0)","v":265.96438151452492},null,null,46,{"$f":"INDEX(Data_BB[Date],MATCH(N78,Data_BB[Index],0))","v":"2022-04-29"},{"$f":"MAX(IF(N78=Data_BB[Index],Data_BB[Adj Close],0),IF(N78=Data_BB[Lag Index U],Data_BB[Adj Close],0))","v":282.41195699999997},{"$f":"MIN(IF(N78=Data_BB[Index],Data_BB[Adj Close]),IF(N78=Data_BB[Lag Index U],Data_BB[Adj Close]))","v":275.51220699999999},{"$f":"MAX(IF(N78=Data_BB[Index],Data_BB[Upper Bollinger Band],0),IF(N78=Data_BB[Lag Index U],Data_BB[Upper Bollinger Band],0))","v":324.23833995841693},{"$f":"MIN(IF(N78=Data_BB[Index],Data_BB[Upper Bollinger Band]),IF(N78=Data_BB[Lag Index U],Data_BB[Upper Bollinger Band]))","v":320.17427576376463},{"$f":"MAX(IF(N78=Data_BB[Index],Data_BB[Lower Bollinger Band],0),IF(N78=Data_BB[Lag Index U],Data_BB[Lower Bollinger Band],0))","v":250.79088553623532},{"$f":"MIN(IF(N78=Data_BB[Index],Data_BB[Lower Bollinger Band]),IF(N78=Data_BB[Lag Index U],Data_BB[Lower Bollinger Band]))","v":249.20377144158306}]
[null,null,null,"2022-03-10",283.523865,{"$f":"IF(Data_BB[[#This Row],[Adj Close]]<E80,TRUE,\"\")","v":""},{"$f":"IF(F78=Data_BB[[#This Row],[Up]],0,1)","v":0},{"$f":"SUM($G$33:G79)","v":25},25,{"$f":"AVERAGE(OFFSET(E78,1,,-MIN(Bollinger_Band_Range_BB,COUNTA(E$32:E78)))+Standard_Deviation_BB*IFERROR(STDEV(OFFSET(E78,1,,-MIN(Bollinger_Band_Range_BB,COUNTA(E$32:E78)))),0))","v":311.99212392136872},{"$f":"IFERROR(AVERAGE(OFFSET(E78,1,,-MIN(Bollinger_Band_Range_BB,COUNTA(E$32:E78)))-Standard_Deviation_BB*IFERROR(STDEV(OFFSET(E78,1,,-MIN(Bollinger_Band_Range_BB,COUNTA(E$32:E78)))),0)),0)","v":267.48883917863134},null,null,47,{"$f":"INDEX(Data_BB[Date],MATCH(N79,Data_BB[Index],0))","v":"2022-05-02"},{"$f":"MAX(IF(N79=Data_BB[Index],Data_BB[Adj Close],0),IF(N79=Data_BB[Lag Index U],Data_BB[Adj Close],0))","v":282.41195699999997},{"$f":"MIN(IF(N79=Data_BB[Index],Data_BB[Adj Close]),IF(N79=Data_BB[Lag Index U],Data_BB[Adj Close]))","v":279.74142499999999},{"$f":"MAX(IF(N79=Data_BB[Index],Data_BB[Upper Bollinger Band],0),IF(N79=Data_BB[Lag Index U],Data_BB[Upper Bollinger Band],0))","v":320.17427576376463},{"$f":"MIN(IF(N79=Data_BB[Index],Data_BB[Upper Bollinger Band]),IF(N79=Data_BB[Lag Index U],Data_BB[Upper Bollinger Band]))","v":312.86502388578197},{"$f":"MAX(IF(N79=Data_BB[Index],Data_BB[Lower Bollinger Band],0),IF(N79=Data_BB[Lag Index U],Data_BB[Lower Bollinger Band],0))","v":254.80514841421805},{"$f":"MIN(IF(N79=Data_BB[Index],Data_BB[Lower Bollinger Band]),IF(N79=Data_BB[Lag Index U],Data_BB[Lower Bollinger Band]))","v":250.79088553623532}]
[null,null,null,"2022-03-11",278.04379299999999,{"$f":"IF(Data_BB[[#This Row],[Adj Close]]<E81,TRUE,\"\")","v":""},{"$f":"IF(F79=Data_BB[[#This Row],[Up]],0,1)","v":0},{"$f":"SUM($G$33:G80)","v":25},25,{"$f":"AVERAGE(OFFSET(E79,1,,-MIN(Bollinger_Band_Range_BB,COUNTA(E$32:E79)))+Standard_Deviation_BB*IFERROR(STDEV(OFFSET(E79,1,,-MIN(Bollinger_Band_Range_BB,COUNTA(E$32:E79)))),0))","v":311.09544365129199},{"$f":"IFERROR(AVERAGE(OFFSET(E79,1,,-MIN(Bollinger_Band_Range_BB,COUNTA(E$32:E79)))-Standard_Deviation_BB*IFERROR(STDEV(OFFSET(E79,1,,-MIN(Bollinger_Band_Range_BB,COUNTA(E$32:E79)))),0)),0)","v":266.23259894870802},null,null,48,{"$f":"INDEX(Data_BB[Date],MATCH(N80,Data_BB[Index],0))","v":"2022-05-03"},{"$f":"MAX(IF(N80=Data_BB[Index],Data_BB[Adj Close],0),IF(N80=Data_BB[Lag Index U],Data_BB[Adj Close],0))","v":287.88211100000001},{"$f":"MIN(IF(N80=Data_BB[Index],Data_BB[Adj Close]),IF(N80=Data_BB[Lag Index U],Data_BB[Adj Close]))","v":279.74142499999999},{"$f":"MAX(IF(N80=Data_BB[Index],Data_BB[Upper Bollinger Band],0),IF(N80=Data_BB[Lag Index U],Data_BB[Upper Bollinger Band],0))","v":312.86502388578197},{"$f":"MIN(IF(N80=Data_BB[Index],Data_BB[Upper Bollinger Band]),IF(N80=Data_BB[Lag Index U],Data_BB[Upper Bollinger Band]))","v":306.22974033442608},{"$f":"MAX(IF(N80=Data_BB[Index],Data_BB[Lower Bollinger Band],0),IF(N80=Data_BB[Lag Index U],Data_BB[Lower Bollinger Band],0))","v":259.36555406557397},{"$f":"MIN(IF(N80=Data_BB[Index],Data_BB[Lower Bollinger Band]),IF(N80=Data_BB[Lag Index U],Data_BB[Lower Bollinger Band]))","v":254.80514841421805}]
[null,null,null,"2022-03-14",274.44006300000001,{"$f":"IF(Data_BB[[#This Row],[Adj Close]]<E82,TRUE,\"\")","v":true},{"$f":"IF(F80=Data_BB[[#This Row],[Up]],0,1)","v":1},{"$f":"SUM($G$33:G81)","v":26},25,{"$f":"AVERAGE(OFFSET(E80,1,,-MIN(Bollinger_Band_Range_BB,COUNTA(E$32:E80)))+Standard_Deviation_BB*IFERROR(STDEV(OFFSET(E80,1,,-MIN(Bollinger_Band_Range_BB,COUNTA(E$32:E80)))),0))","v":311.96153263335304},{"$f":"IFERROR(AVERAGE(OFFSET(E80,1,,-MIN(Bollinger_Band_Range_BB,COUNTA(E$32:E80)))-Standard_Deviation_BB*IFERROR(STDEV(OFFSET(E80,1,,-MIN(Bollinger_Band_Range_BB,COUNTA(E$32:E80)))),0)),0)","v":263.58040766664686},null,null,49,{"$f":"INDEX(Data_BB[Date],MATCH(N81,Data_BB[Index],0))","v":"2022-05-04"},{"$f":"MAX(IF(N81=Data_BB[Index],Data_BB[Adj Close],0),IF(N81=Data_BB[Lag Index U],Data_BB[Adj Close],0))","v":287.88211100000001},{"$f":"MIN(IF(N81=Data_BB[Index],Data_BB[Adj Close]),IF(N81=Data_BB[Lag Index U],Data_BB[Adj Close]))","v":262.665863},{"$f":"MAX(IF(N81=Data_BB[Index],Data_BB[Upper Bollinger Band],0),IF(N81=Data_BB[Lag Index U],Data_BB[Upper Bollinger Band],0))","v":306.22974033442608},{"$f":"MIN(IF(N81=Data_BB[Index],Data_BB[Upper Bollinger Band]),IF(N81=Data_BB[Lag Index U],Data_BB[Upper Bollinger Band]))","v":297.88818893952373},{"$f":"MAX(IF(N81=Data_BB[Index],Data_BB[Lower Bollinger Band],0),IF(N81=Data_BB[Lag Index U],Data_BB[Lower Bollinger Band],0))","v":261.9272085077406},{"$f":"MIN(IF(N81=Data_BB[Index],Data_BB[Lower Bollinger Band]),IF(N81=Data_BB[Lag Index U],Data_BB[Lower Bollinger Band]))","v":259.36555406557397}]
[null,null,null,"2022-03-15",285.07257099999998,{"$f":"IF(Data_BB[[#This Row],[Adj Close]]<E83,TRUE,\"\")","v":true},{"$f":"IF(F81=Data_BB[[#This Row],[Up]],0,1)","v":0},{"$f":"SUM($G$33:G82)","v":26},26,{"$f":"AVERAGE(OFFSET(E81,1,,-MIN(Bollinger_Band_Range_BB,COUNTA(E$32:E81)))+Standard_Deviation_BB*IFERROR(STDEV(OFFSET(E81,1,,-MIN(Bollinger_Band_Range_BB,COUNTA(E$32:E81)))),0))","v":311.45017509613621},{"$f":"IFERROR(AVERAGE(OFFSET(E81,1,,-MIN(Bollinger_Band_Range_BB,COUNTA(E$32:E81)))-Standard_Deviation_BB*IFERROR(STDEV(OFFSET(E81,1,,-MIN(Bollinger_Band_Range_BB,COUNTA(E$32:E81)))),0)),0)","v":263.37287480386385},null,null,50,{"$f":"INDEX(Data_BB[Date],MATCH(N82,Data_BB[Index],0))","v":"2022-05-09"},{"$f":"MAX(IF(N82=Data_BB[Index],Data_BB[Adj Close],0),IF(N82=Data_BB[Lag Index U],Data_BB[Adj Close],0))","v":267.55026199999998},{"$f":"MIN(IF(N82=Data_BB[Index],Data_BB[Adj Close]),IF(N82=Data_BB[Lag Index U],Data_BB[Adj Close]))","v":262.665863},{"$f":"MAX(IF(N82=Data_BB[Index],Data_BB[Upper Bollinger Band],0),IF(N82=Data_BB[Lag Index U],Data_BB[Upper Bollinger Band],0))","v":298.23668765076502},{"$f":"MIN(IF(N82=Data_BB[Index],Data_BB[Upper Bollinger Band]),IF(N82=Data_BB[Lag Index U],Data_BB[Upper Bollinger Band]))","v":297.88818893952373},{"$f":"MAX(IF(N82=Data_BB[Index],Data_BB[Lower Bollinger Band],0),IF(N82=Data_BB[Lag Index U],Data_BB[Lower Bollinger Band],0))","v":259.64784636047631},{"$f":"MIN(IF(N82=Data_BB[Index],Data_BB[Lower Bollinger Band]),IF(N82=Data_BB[Lag Index U],Data_BB[Lower Bollinger Band]))","v":257.73474494923505}]
[null,null,null,"2022-03-16",292.26019300000002,{"$f":"IF(Data_BB[[#This Row],[Adj Close]]<E84,TRUE,\"\")","v":true},{"$f":"IF(F82=Data_BB[[#This Row],[Up]],0,1)","v":0},{"$f":"SUM($G$33:G83)","v":26},26,{"$f":"AVERAGE(OFFSET(E82,1,,-MIN(Bollinger_Band_Range_BB,COUNTA(E$32:E82)))+Standard_Deviation_BB*IFERROR(STDEV(OFFSET(E82,1,,-MIN(Bollinger_Band_Range_BB,COUNTA(E$32:E82)))),0))","v":310.34274457164423},{"$f":"IFERROR(AVERAGE(OFFSET(E82,1,,-MIN(Bollinger_Band_Range_BB,COUNTA(E$32:E82)))-Standard_Deviation_BB*IFERROR(STDEV(OFFSET(E82,1,,-MIN(Bollinger_Band_Range_BB,COUNTA(E$32:E82)))),0)),0)","v":263.93825512835571},null,null,51,{"$f":"INDEX(Data_BB[Date],MATCH(N83,Data_BB[Index],0))","v":"2022-05-10"},{"$f":"MAX(IF(N83=Data_BB[Index],Data_BB[Adj Close],0),IF(N83=Data_BB[Lag Index U],Data_BB[Adj Close],0))","v":267.55026199999998},{"$f":"MIN(IF(N83=Data_BB[Index],Data_BB[Adj Close]),IF(N83=Data_BB[Lag Index U],Data_BB[Adj Close]))","v":253.50264000000001},{"$f":"MAX(IF(N83=Data_BB[Index],Data_BB[Upper Bollinger Band],0),IF(N83=Data_BB[Lag Index U],Data_BB[Upper Bollinger Band],0))","v":303.14350803502612},{"$f":"MIN(IF(N83=Data_BB[Index],Data_BB[Upper Bollinger Band]),IF(N83=Data_BB[Lag Index U],Data_BB[Upper Bollinger Band]))","v":298.23668765076502},{"$f":"MAX(IF(N83=Data_BB[Index],Data_BB[Lower Bollinger Band],0),IF(N83=Data_BB[Lag Index U],Data_BB[Lower Bollinger Band],0))","v":257.73474494923505},{"$f":"MIN(IF(N83=Data_BB[Index],Data_BB[Lower Bollinger Band]),IF(N83=Data_BB[Lag Index U],Data_BB[Lower Bollinger Band]))","v":247.4888331649739}]
[null,null,null,"2022-03-17",293.08416699999998,{"$f":"IF(Data_BB[[#This Row],[Adj Close]]<E85,TRUE,\"\")","v":true},{"$f":"IF(F83=Data_BB[[#This Row],[Up]],0,1)","v":0},{"$f":"SUM($G$33:G84)","v":26},26,{"$f":"AVERAGE(OFFSET(E83,1,,-MIN(Bollinger_Band_Range_BB,COUNTA(E$32:E83)))+Standard_Deviation_BB*IFERROR(STDEV(OFFSET(E83,1,,-MIN(Bollinger_Band_Range_BB,COUNTA(E$32:E83)))),0))","v":309.41001883771645},{"$f":"IFERROR(AVERAGE(OFFSET(E83,1,,-MIN(Bollinger_Band_Range_BB,COUNTA(E$32:E83)))-Standard_Deviation_BB*IFERROR(STDEV(OFFSET(E83,1,,-MIN(Bollinger_Band_Range_BB,COUNTA(E$32:E83)))),0)),0)","v":264.44607846228354},null,null,52,{"$f":"INDEX(Data_BB[Date],MATCH(N84,Data_BB[Index],0))","v":"2022-05-12"},{"$f":"MAX(IF(N84=Data_BB[Index],Data_BB[Adj Close],0),IF(N84=Data_BB[Lag Index U],Data_BB[Adj Close],0))","v":264.889679},{"$f":"MIN(IF(N84=Data_BB[Index],Data_BB[Adj Close]),IF(N84=Data_BB[Lag Index U],Data_BB[Adj Close]))","v":253.50264000000001},{"$f":"MAX(IF(N84=Data_BB[Index],Data_BB[Upper Bollinger Band],0),IF(N84=Data_BB[Lag Index U],Data_BB[Upper Bollinger Band],0))","v":304.63400797182499},{"$f":"MIN(IF(N84=Data_BB[Index],Data_BB[Upper Bollinger Band]),IF(N84=Data_BB[Lag Index U],Data_BB[Upper Bollinger Band]))","v":303.14350803502612},{"$f":"MAX(IF(N84=Data_BB[Index],Data_BB[Lower Bollinger Band],0),IF(N84=Data_BB[Lag Index U],Data_BB[Lower Bollinger Band],0))","v":247.4888331649739},{"$f":"MIN(IF(N84=Data_BB[Index],Data_BB[Lower Bollinger Band]),IF(N84=Data_BB[Lag Index U],Data_BB[Lower Bollinger Band]))","v":241.63717557507135}]
[null,null,null,"2022-03-18",298.25650000000002,{"$f":"IF(Data_BB[[#This Row],[Adj Close]]<E86,TRUE,\"\")","v":""},{"$f":"IF(F84=Data_BB[[#This Row],[Up]],0,1)","v":1},{"$f":"SUM($G$33:G85)","v":27},26,{"$f":"AVERAGE(OFFSET(E84,1,,-MIN(Bollinger_Band_Range_BB,COUNTA(E$32:E84)))+Standard_Deviation_BB*IFERROR(STDEV(OFFSET(E84,1,,-MIN(Bollinger_Band_Range_BB,COUNTA(E$32:E84)))),0))","v":311.13011358647714},{"$f":"IFERROR(AVERAGE(OFFSET(E84,1,,-MIN(Bollinger_Band_Range_BB,COUNTA(E$32:E84)))-Standard_Deviation_BB*IFERROR(STDEV(OFFSET(E84,1,,-MIN(Bollinger_Band_Range_BB,COUNTA(E$32:E84)))),0)),0)","v":263.68896591352285},null,null,53,{"$f":"INDEX(Data_BB[Date],MATCH(N85,Data_BB[Index],0))","v":"2022-05-17"},{"$f":"MAX(IF(N85=Data_BB[Index],Data_BB[Adj Close],0),IF(N85=Data_BB[Lag Index U],Data_BB[Adj Close],0))","v":264.889679},{"$f":"MIN(IF(N85=Data_BB[Index],Data_BB[Adj Close]),IF(N85=Data_BB[Lag Index U],Data_BB[Adj Close]))","v":251.31680299999999},{"$f":"MAX(IF(N85=Data_BB[Index],Data_BB[Upper Bollinger Band],0),IF(N85=Data_BB[Lag Index U],Data_BB[Upper Bollinger Band],0))","v":304.90899256292209},{"$f":"MIN(IF(N85=Data_BB[Index],Data_BB[Upper Bollinger Band]),IF(N85=Data_BB[Lag Index U],Data_BB[Upper Bollinger Band]))","v":303.34003092339566},{"$f":"MAX(IF(N85=Data_BB[Index],Data_BB[Lower Bollinger Band],0),IF(N85=Data_BB[Lag Index U],Data_BB[Lower Bollinger Band],0))","v":241.63717557507135},{"$f":"MIN(IF(N85=Data_BB[Index],Data_BB[Lower Bollinger Band]),IF(N85=Data_BB[Lag Index U],Data_BB[Lower Bollinger Band]))","v":232.23561203707786}]
[null,null,null,"2022-03-21",296.99569700000001,{"$f":"IF(Data_BB[[#This Row],[Adj Close]]<E87,TRUE,\"\")","v":true},{"$f":"IF(F85=Data_BB[[#This Row],[Up]],0,1)","v":1},{"$f":"SUM($G$33:G86)","v":28},27,{"$f":"AVERAGE(OFFSET(E85,1,,-MIN(Bollinger_Band_Range_BB,COUNTA(E$32:E85)))+Standard_Deviation_BB*IFERROR(STDEV(OFFSET(E85,1,,-MIN(Bollinger_Band_Range_BB,COUNTA(E$32:E85)))),0))","v":312.50458413865442},{"$f":"IFERROR(AVERAGE(OFFSET(E85,1,,-MIN(Bollinger_Band_Range_BB,COUNTA(E$32:E85)))-Standard_Deviation_BB*IFERROR(STDEV(OFFSET(E85,1,,-MIN(Bollinger_Band_Range_BB,COUNTA(E$32:E85)))),0)),0)","v":263.42937266134561},null,null,54,{"$f":"INDEX(Data_BB[Date],MATCH(N86,Data_BB[Index],0))","v":"2022-05-20"},{"$f":"MAX(IF(N86=Data_BB[Index],Data_BB[Adj Close],0),IF(N86=Data_BB[Lag Index U],Data_BB[Adj Close],0))","v":259.36697400000003},{"$f":"MIN(IF(N86=Data_BB[Index],Data_BB[Adj Close]),IF(N86=Data_BB[Lag Index U],Data_BB[Adj Close]))","v":251.31680299999999},{"$f":"MAX(IF(N86=Data_BB[Index],Data_BB[Upper Bollinger Band],0),IF(N86=Data_BB[Lag Index U],Data_BB[Upper Bollinger Band],0))","v":304.90899256292209},{"$f":"MIN(IF(N86=Data_BB[Index],Data_BB[Upper Bollinger Band]),IF(N86=Data_BB[Lag Index U],Data_BB[Upper Bollinger Band]))","v":303.70564986874575},{"$f":"MAX(IF(N86=Data_BB[Index],Data_BB[Lower Bollinger Band],0),IF(N86=Data_BB[Lag Index U],Data_BB[Lower Bollinger Band],0))","v":232.23561203707786},{"$f":"MIN(IF(N86=Data_BB[Index],Data_BB[Lower Bollinger Band]),IF(N86=Data_BB[Lag Index U],Data_BB[Lower Bollinger Band]))","v":231.50674343125434}]
[null,null,null,"2022-03-22",301.860229,{"$f":"IF(Data_BB[[#This Row],[Adj Close]]<E88,TRUE,\"\")","v":""},{"$f":"IF(F86=Data_BB[[#This Row],[Up]],0,1)","v":1},{"$f":"SUM($G$33:G87)","v":29},28,{"$f":"AVERAGE(OFFSET(E86,1,,-MIN(Bollinger_Band_Range_BB,COUNTA(E$32:E86)))+Standard_Deviation_BB*IFERROR(STDEV(OFFSET(E86,1,,-MIN(Bollinger_Band_Range_BB,COUNTA(E$32:E86)))),0))","v":314.94531830163021},{"$f":"IFERROR(AVERAGE(OFFSET(E86,1,,-MIN(Bollinger_Band_Range_BB,COUNTA(E$32:E86)))-Standard_Deviation_BB*IFERROR(STDEV(OFFSET(E86,1,,-MIN(Bollinger_Band_Range_BB,COUNTA(E$32:E86)))),0)),0)","v":262.6108155983697},null,null,55,{"$f":"INDEX(Data_BB[Date],MATCH(N87,Data_BB[Index],0))","v":"2022-05-23"},{"$f":"MAX(IF(N87=Data_BB[Index],Data_BB[Adj Close],0),IF(N87=Data_BB[Lag Index U],Data_BB[Adj Close],0))","v":259.36697400000003},{"$f":"MIN(IF(N87=Data_BB[Index],Data_BB[Adj Close]),IF(N87=Data_BB[Lag Index U],Data_BB[Adj Close]))","v":258.34204099999999},{"$f":"MAX(IF(N87=Data_BB[Index],Data_BB[Upper Bollinger Band],0),IF(N87=Data_BB[Lag Index U],Data_BB[Upper Bollinger Band],0))","v":303.73362378151239},{"$f":"MIN(IF(N87=Data_BB[Index],Data_BB[Upper Bollinger Band]),IF(N87=Data_BB[Lag Index U],Data_BB[Upper Bollinger Band]))","v":303.70564986874575},{"$f":"MAX(IF(N87=Data_BB[Index],Data_BB[Lower Bollinger Band],0),IF(N87=Data_BB[Lag Index U],Data_BB[Lower Bollinger Band],0))","v":231.50674343125434},{"$f":"MIN(IF(N87=Data_BB[Index],Data_BB[Lower Bollinger Band]),IF(N87=Data_BB[Lag Index U],Data_BB[Lower Bollinger Band]))","v":230.48646601848759}]
[null,null,null,"2022-03-23",297.32327299999997,{"$f":"IF(Data_BB[[#This Row],[Adj Close]]<E89,TRUE,\"\")","v":true},{"$f":"IF(F87=Data_BB[[#This Row],[Up]],0,1)","v":1},{"$f":"SUM($G$33:G88)","v":30},29,{"$f":"AVERAGE(OFFSET(E87,1,,-MIN(Bollinger_Band_Range_BB,COUNTA(E$32:E87)))+Standard_Deviation_BB*IFERROR(STDEV(OFFSET(E87,1,,-MIN(Bollinger_Band_Range_BB,COUNTA(E$32:E87)))),0))","v":315.38578391834221},{"$f":"IFERROR(AVERAGE(OFFSET(E87,1,,-MIN(Bollinger_Band_Range_BB,COUNTA(E$32:E87)))-Standard_Deviation_BB*IFERROR(STDEV(OFFSET(E87,1,,-MIN(Bollinger_Band_Range_BB,COUNTA(E$32:E87)))),0)),0)","v":264.07844628165782},null,null,56,{"$f":"INDEX(Data_BB[Date],MATCH(N88,Data_BB[Index],0))","v":"2022-05-24"},{"$f":"MAX(IF(N88=Data_BB[Index],Data_BB[Adj Close],0),IF(N88=Data_BB[Lag Index U],Data_BB[Adj Close],0))","v":271.89498900000001},{"$f":"MIN(IF(N88=Data_BB[Index],Data_BB[Adj Close]),IF(N88=Data_BB[Lag Index U],Data_BB[Adj Close]))","v":258.34204099999999},{"$f":"MAX(IF(N88=Data_BB[Index],Data_BB[Upper Bollinger Band],0),IF(N88=Data_BB[Lag Index U],Data_BB[Upper Bollinger Band],0))","v":303.73362378151239},{"$f":"MIN(IF(N88=Data_BB[Index],Data_BB[Upper Bollinger Band]),IF(N88=Data_BB[Lag Index U],Data_BB[Upper Bollinger Band]))","v":296.33814170141119},{"$f":"MAX(IF(N88=Data_BB[Index],Data_BB[Lower Bollinger Band],0),IF(N88=Data_BB[Lag Index U],Data_BB[Lower Bollinger Band],0))","v":233.23155129858887},{"$f":"MIN(IF(N88=Data_BB[Index],Data_BB[Lower Bollinger Band]),IF(N88=Data_BB[Lag Index U],Data_BB[Lower Bollinger Band]))","v":230.48646601848759}]
[null,null,null,"2022-03-24",301.89996300000001,{"$f":"IF(Data_BB[[#This Row],[Adj Close]]<E90,TRUE,\"\")","v":""},{"$f":"IF(F88=Data_BB[[#This Row],[Up]],0,1)","v":1},{"$f":"SUM($G$33:G89)","v":31},30,{"$f":"AVERAGE(OFFSET(E88,1,,-MIN(Bollinger_Band_Range_BB,COUNTA(E$32:E88)))+Standard_Deviation_BB*IFERROR(STDEV(OFFSET(E88,1,,-MIN(Bollinger_Band_Range_BB,COUNTA(E$32:E88)))),0))","v":317.08558573680421},{"$f":"IFERROR(AVERAGE(OFFSET(E88,1,,-MIN(Bollinger_Band_Range_BB,COUNTA(E$32:E88)))-Standard_Deviation_BB*IFERROR(STDEV(OFFSET(E88,1,,-MIN(Bollinger_Band_Range_BB,COUNTA(E$32:E88)))),0)),0)","v":263.32276976319577},null,null,57,{"$f":"INDEX(Data_BB[Date],MATCH(N89,Data_BB[Index],0))","v":"2022-05-27"},{"$f":"MAX(IF(N89=Data_BB[Index],Data_BB[Adj Close],0),IF(N89=Data_BB[Lag Index U],Data_BB[Adj Close],0))","v":271.89498900000001},{"$f":"MIN(IF(N89=Data_BB[Index],Data_BB[Adj Close]),IF(N89=Data_BB[Lag Index U],Data_BB[Adj Close]))","v":270.531769},{"$f":"MAX(IF(N89=Data_BB[Index],Data_BB[Upper Bollinger Band],0),IF(N89=Data_BB[Lag Index U],Data_BB[Upper Bollinger Band],0))","v":296.33814170141119},{"$f":"MIN(IF(N89=Data_BB[Index],Data_BB[Upper Bollinger Band]),IF(N89=Data_BB[Lag Index U],Data_BB[Upper Bollinger Band]))","v":293.52905958763438},{"$f":"MAX(IF(N89=Data_BB[Index],Data_BB[Lower Bollinger Band],0),IF(N89=Data_BB[Lag Index U],Data_BB[Lower Bollinger Band],0))","v":234.85261461236556},{"$f":"MIN(IF(N89=Data_BB[Index],Data_BB[Lower Bollinger Band]),IF(N89=Data_BB[Lag Index U],Data_BB[Lower Bollinger Band]))","v":233.23155129858887}]
[null,null,null,"2022-03-25",301.48297100000002,{"$f":"IF(Data_BB[[#This Row],[Adj Close]]<E91,TRUE,\"\")","v":true},{"$f":"IF(F89=Data_BB[[#This Row],[Up]],0,1)","v":1},{"$f":"SUM($G$33:G90)","v":32},31,{"$f":"AVERAGE(OFFSET(E89,1,,-MIN(Bollinger_Band_Range_BB,COUNTA(E$32:E89)))+Standard_Deviation_BB*IFERROR(STDEV(OFFSET(E89,1,,-MIN(Bollinger_Band_Range_BB,COUNTA(E$32:E89)))),0))","v":318.27449536105166},{"$f":"IFERROR(AVERAGE(OFFSET(E89,1,,-MIN(Bollinger_Band_Range_BB,COUNTA(E$32:E89)))-Standard_Deviation_BB*IFERROR(STDEV(OFFSET(E89,1,,-MIN(Bollinger_Band_Range_BB,COUNTA(E$32:E89)))),0)),0)","v":262.76624843894831},null,null,58,{"$f":"INDEX(Data_BB[Date],MATCH(N90,Data_BB[Index],0))","v":"2022-05-31"},{"$f":"MAX(IF(N90=Data_BB[Index],Data_BB[Adj Close],0),IF(N90=Data_BB[Lag Index U],Data_BB[Adj Close],0))","v":273.22839399999998},{"$f":"MIN(IF(N90=Data_BB[Index],Data_BB[Adj Close]),IF(N90=Data_BB[Lag Index U],Data_BB[Adj Close]))","v":270.531769},{"$f":"MAX(IF(N90=Data_BB[Index],Data_BB[Upper Bollinger Band],0),IF(N90=Data_BB[Lag Index U],Data_BB[Upper Bollinger Band],0))","v":293.52905958763438},{"$f":"MIN(IF(N90=Data_BB[Index],Data_BB[Upper Bollinger Band]),IF(N90=Data_BB[Lag Index U],Data_BB[Upper Bollinger Band]))","v":286.01645416112899},{"$f":"MAX(IF(N90=Data_BB[Index],Data_BB[Lower Bollinger Band],0),IF(N90=Data_BB[Lag Index U],Data_BB[Lower Bollinger Band],0))","v":240.03360993887094},{"$f":"MIN(IF(N90=Data_BB[Index],Data_BB[Lower Bollinger Band]),IF(N90=Data_BB[Lag Index U],Data_BB[Lower Bollinger Band]))","v":234.85261461236556}]
[null,null,null,"2022-03-28",308.45220899999998,{"$f":"IF(Data_BB[[#This Row],[Adj Close]]<E92,TRUE,\"\")","v":true},{"$f":"IF(F90=Data_BB[[#This Row],[Up]],0,1)","v":0},{"$f":"SUM($G$33:G91)","v":32},32,{"$f":"AVERAGE(OFFSET(E90,1,,-MIN(Bollinger_Band_Range_BB,COUNTA(E$32:E90)))+Standard_Deviation_BB*IFERROR(STDEV(OFFSET(E90,1,,-MIN(Bollinger_Band_Range_BB,COUNTA(E$32:E90)))),0))","v":321.13858228720875},{"$f":"IFERROR(AVERAGE(OFFSET(E90,1,,-MIN(Bollinger_Band_Range_BB,COUNTA(E$32:E90)))-Standard_Deviation_BB*IFERROR(STDEV(OFFSET(E90,1,,-MIN(Bollinger_Band_Range_BB,COUNTA(E$32:E90)))),0)),0)","v":261.08454671279117},null,null,59,{"$f":"INDEX(Data_BB[Date],MATCH(N91,Data_BB[Index],0))","v":"2022-06-02"},{"$f":"MAX(IF(N91=Data_BB[Index],Data_BB[Adj Close],0),IF(N91=Data_BB[Lag Index U],Data_BB[Adj Close],0))","v":273.22839399999998},{"$f":"MIN(IF(N91=Data_BB[Index],Data_BB[Adj Close]),IF(N91=Data_BB[Lag Index U],Data_BB[Adj Close]))","v":267.42709400000001},{"$f":"MAX(IF(N91=Data_BB[Index],Data_BB[Upper Bollinger Band],0),IF(N91=Data_BB[Lag Index U],Data_BB[Upper Bollinger Band],0))","v":286.01645416112899},{"$f":"MIN(IF(N91=Data_BB[Index],Data_BB[Upper Bollinger Band]),IF(N91=Data_BB[Lag Index U],Data_BB[Upper Bollinger Band]))","v":283.23505909460414},{"$f":"MAX(IF(N91=Data_BB[Index],Data_BB[Lower Bollinger Band],0),IF(N91=Data_BB[Lag Index U],Data_BB[Lower Bollinger Band],0))","v":241.61820940539582},{"$f":"MIN(IF(N91=Data_BB[Index],Data_BB[Lower Bollinger Band]),IF(N91=Data_BB[Lag Index U],Data_BB[Lower Bollinger Band]))","v":240.03360993887094}]
[null,null,null,"2022-03-29",313.12811299999998,{"$f":"IF(Data_BB[[#This Row],[Adj Close]]<E93,TRUE,\"\")","v":""},{"$f":"IF(F91=Data_BB[[#This Row],[Up]],0,1)","v":1},{"$f":"SUM($G$33:G92)","v":33},32,{"$f":"AVERAGE(OFFSET(E91,1,,-MIN(Bollinger_Band_Range_BB,COUNTA(E$32:E91)))+Standard_Deviation_BB*IFERROR(STDEV(OFFSET(E91,1,,-MIN(Bollinger_Band_Range_BB,COUNTA(E$32:E91)))),0))","v":325.59478979806215},{"$f":"IFERROR(AVERAGE(OFFSET(E91,1,,-MIN(Bollinger_Band_Range_BB,COUNTA(E$32:E91)))-Standard_Deviation_BB*IFERROR(STDEV(OFFSET(E91,1,,-MIN(Bollinger_Band_Range_BB,COUNTA(E$32:E91)))),0)),0)","v":258.65953430193781},null,null,60,{"$f":"INDEX(Data_BB[Date],MATCH(N92,Data_BB[Index],0))","v":"2022-06-06"},{"$f":"MAX(IF(N92=Data_BB[Index],Data_BB[Adj Close],0),IF(N92=Data_BB[Lag Index U],Data_BB[Adj Close],0))","v":271.158661},{"$f":"MIN(IF(N92=Data_BB[Index],Data_BB[Adj Close]),IF(N92=Data_BB[Lag Index U],Data_BB[Adj Close]))","v":267.42709400000001},{"$f":"MAX(IF(N92=Data_BB[Index],Data_BB[Upper Bollinger Band],0),IF(N92=Data_BB[Lag Index U],Data_BB[Upper Bollinger Band],0))","v":284.47007988242137},{"$f":"MIN(IF(N92=Data_BB[Index],Data_BB[Upper Bollinger Band]),IF(N92=Data_BB[Lag Index U],Data_BB[Upper Bollinger Band]))","v":283.23505909460414},{"$f":"MAX(IF(N92=Data_BB[Index],Data_BB[Lower Bollinger Band],0),IF(N92=Data_BB[Lag Index U],Data_BB[Lower Bollinger Band],0))","v":241.61820940539582},{"$f":"MIN(IF(N92=Data_BB[Index],Data_BB[Lower Bollinger Band]),IF(N92=Data_BB[Lag Index U],Data_BB[Lower Bollinger Band]))","v":241.23246841757873}]
[null,null,null,"2022-03-30",311.58932499999997,{"$f":"IF(Data_BB[[#This Row],[Adj Close]]<E94,TRUE,\"\")","v":""},{"$f":"IF(F92=Data_BB[[#This Row],[Up]],0,1)","v":0},{"$f":"SUM($G$33:G93)","v":33},33,{"$f":"AVERAGE(OFFSET(E92,1,,-MIN(Bollinger_Band_Range_BB,COUNTA(E$32:E92)))+Standard_Deviation_BB*IFERROR(STDEV(OFFSET(E92,1,,-MIN(Bollinger_Band_Range_BB,COUNTA(E$32:E92)))),0))","v":328.56464514138327},{"$f":"IFERROR(AVERAGE(OFFSET(E92,1,,-MIN(Bollinger_Band_Range_BB,COUNTA(E$32:E92)))-Standard_Deviation_BB*IFERROR(STDEV(OFFSET(E92,1,,-MIN(Bollinger_Band_Range_BB,COUNTA(E$32:E92)))),0)),0)","v":257.04678645861674},null,null,61,{"$f":"INDEX(Data_BB[Date],MATCH(N93,Data_BB[Index],0))","v":"2022-06-07"},{"$f":"MAX(IF(N93=Data_BB[Index],Data_BB[Adj Close],0),IF(N93=Data_BB[Lag Index U],Data_BB[Adj Close],0))","v":271.158661},{"$f":"MIN(IF(N93=Data_BB[Index],Data_BB[Adj Close]),IF(N93=Data_BB[Lag Index U],Data_BB[Adj Close]))","v":241.06750500000001},{"$f":"MAX(IF(N93=Data_BB[Index],Data_BB[Upper Bollinger Band],0),IF(N93=Data_BB[Lag Index U],Data_BB[Upper Bollinger Band],0))","v":288.60028798118765},{"$f":"MIN(IF(N93=Data_BB[Index],Data_BB[Upper Bollinger Band]),IF(N93=Data_BB[Lag Index U],Data_BB[Upper Bollinger Band]))","v":284.47007988242137},{"$f":"MAX(IF(N93=Data_BB[Index],Data_BB[Lower Bollinger Band],0),IF(N93=Data_BB[Lag Index U],Data_BB[Lower Bollinger Band],0))","v":241.57666592658356},{"$f":"MIN(IF(N93=Data_BB[Index],Data_BB[Lower Bollinger Band]),IF(N93=Data_BB[Lag Index U],Data_BB[Lower Bollinger Band]))","v":235.74515421881239}]
[null,null,null,"2022-03-31",306.07946800000002,{"$f":"IF(Data_BB[[#This Row],[Adj Close]]<E95,TRUE,\"\")","v":true},{"$f":"IF(F93=Data_BB[[#This Row],[Up]],0,1)","v":1},{"$f":"SUM($G$33:G94)","v":34},33,{"$f":"AVERAGE(OFFSET(E93,1,,-MIN(Bollinger_Band_Range_BB,COUNTA(E$32:E93)))+Standard_Deviation_BB*IFERROR(STDEV(OFFSET(E93,1,,-MIN(Bollinger_Band_Range_BB,COUNTA(E$32:E93)))),0))","v":330.27352583362494},{"$f":"IFERROR(AVERAGE(OFFSET(E93,1,,-MIN(Bollinger_Band_Range_BB,COUNTA(E$32:E93)))-Standard_Deviation_BB*IFERROR(STDEV(OFFSET(E93,1,,-MIN(Bollinger_Band_Range_BB,COUNTA(E$32:E93)))),0)),0)","v":256.56793816637509},null,null,62,{"$f":"INDEX(Data_BB[Date],MATCH(N94,Data_BB[Index],0))","v":"2022-06-13"},{"$f":"MAX(IF(N94=Data_BB[Index],Data_BB[Adj Close],0),IF(N94=Data_BB[Lag Index U],Data_BB[Adj Close],0))","v":250.520737},{"$f":"MIN(IF(N94=Data_BB[Index],Data_BB[Adj Close]),IF(N94=Data_BB[Lag Index U],Data_BB[Adj Close]))","v":241.06750500000001},{"$f":"MAX(IF(N94=Data_BB[Index],Data_BB[Upper Bollinger Band],0),IF(N94=Data_BB[Lag Index U],Data_BB[Upper Bollinger Band],0))","v":290.68423851857159},{"$f":"MIN(IF(N94=Data_BB[Index],Data_BB[Upper Bollinger Band]),IF(N94=Data_BB[Lag Index U],Data_BB[Upper Bollinger Band]))","v":288.60028798118765},{"$f":"MAX(IF(N94=Data_BB[Index],Data_BB[Lower Bollinger Band],0),IF(N94=Data_BB[Lag Index U],Data_BB[Lower Bollinger Band],0))","v":235.74515421881239},{"$f":"MIN(IF(N94=Data_BB[Index],Data_BB[Lower Bollinger Band]),IF(N94=Data_BB[Lag Index U],Data_BB[Lower Bollinger Band]))","v":230.59214708142827}]
[null,null,null,"2022-04-01",307.18145800000002,{"$f":"IF(Data_BB[[#This Row],[Adj Close]]<E96,TRUE,\"\")","v":true},{"$f":"IF(F94=Data_BB[[#This Row],[Up]],0,1)","v":0},{"$f":"SUM($G$33:G95)","v":34},34,{"$f":"AVERAGE(OFFSET(E94,1,,-MIN(Bollinger_Band_Range_BB,COUNTA(E$32:E94)))+Standard_Deviation_BB*IFERROR(STDEV(OFFSET(E94,1,,-MIN(Bollinger_Band_Range_BB,COUNTA(E$32:E94)))),0))","v":332.12400968610552},{"$f":"IFERROR(AVERAGE(OFFSET(E94,1,,-MIN(Bollinger_Band_Range_BB,COUNTA(E$32:E94)))-Standard_Deviation_BB*IFERROR(STDEV(OFFSET(E94,1,,-MIN(Bollinger_Band_Range_BB,COUNTA(E$32:E94)))),0)),0)","v":256.65930621389441},null,null,63,{"$f":"INDEX(Data_BB[Date],MATCH(N95,Data_BB[Index],0))","v":"2022-06-15"},{"$f":"MAX(IF(N95=Data_BB[Index],Data_BB[Adj Close],0),IF(N95=Data_BB[Lag Index U],Data_BB[Adj Close],0))","v":250.520737},{"$f":"MIN(IF(N95=Data_BB[Index],Data_BB[Adj Close]),IF(N95=Data_BB[Lag Index U],Data_BB[Adj Close]))","v":243.76416},{"$f":"MAX(IF(N95=Data_BB[Index],Data_BB[Upper Bollinger Band],0),IF(N95=Data_BB[Lag Index U],Data_BB[Upper Bollinger Band],0))","v":291.91516595546148},{"$f":"MIN(IF(N95=Data_BB[Index],Data_BB[Upper Bollinger Band]),IF(N95=Data_BB[Lag Index U],Data_BB[Upper Bollinger Band]))","v":290.68423851857159},{"$f":"MAX(IF(N95=Data_BB[Index],Data_BB[Lower Bollinger Band],0),IF(N95=Data_BB[Lag Index U],Data_BB[Lower Bollinger Band],0))","v":230.59214708142827},{"$f":"MIN(IF(N95=Data_BB[Index],Data_BB[Lower Bollinger Band]),IF(N95=Data_BB[Lag Index U],Data_BB[Lower Bollinger Band]))","v":228.45470264453851}]
[null,null,null,"2022-04-04",312.69131499999997,{"$f":"IF(Data_BB[[#This Row],[Adj Close]]<E97,TRUE,\"\")","v":""},{"$f":"IF(F95=Data_BB[[#This Row],[Up]],0,1)","v":1},{"$f":"SUM($G$33:G96)","v":35},34,{"$f":"AVERAGE(OFFSET(E95,1,,-MIN(Bollinger_Band_Range_BB,COUNTA(E$32:E95)))+Standard_Deviation_BB*IFERROR(STDEV(OFFSET(E95,1,,-MIN(Bollinger_Band_Range_BB,COUNTA(E$32:E95)))),0))","v":333.69089678333575},{"$f":"IFERROR(AVERAGE(OFFSET(E95,1,,-MIN(Bollinger_Band_Range_BB,COUNTA(E$32:E95)))-Standard_Deviation_BB*IFERROR(STDEV(OFFSET(E95,1,,-MIN(Bollinger_Band_Range_BB,COUNTA(E$32:E95)))),0)),0)","v":258.67233251666426},null,null,64,{"$f":"INDEX(Data_BB[Date],MATCH(N96,Data_BB[Index],0))","v":"2022-06-16"},{"$f":"MAX(IF(N96=Data_BB[Index],Data_BB[Adj Close],0),IF(N96=Data_BB[Lag Index U],Data_BB[Adj Close],0))","v":252.49099699999999},{"$f":"MIN(IF(N96=Data_BB[Index],Data_BB[Adj Close]),IF(N96=Data_BB[Lag Index U],Data_BB[Adj Close]))","v":243.76416},{"$f":"MAX(IF(N96=Data_BB[Index],Data_BB[Upper Bollinger Band],0),IF(N96=Data_BB[Lag Index U],Data_BB[Upper Bollinger Band],0))","v":292.51772182143583},{"$f":"MIN(IF(N96=Data_BB[Index],Data_BB[Upper Bollinger Band]),IF(N96=Data_BB[Lag Index U],Data_BB[Upper Bollinger Band]))","v":291.91516595546148},{"$f":"MAX(IF(N96=Data_BB[Index],Data_BB[Lower Bollinger Band],0),IF(N96=Data_BB[Lag Index U],Data_BB[Lower Bollinger Band],0))","v":228.45470264453851},{"$f":"MIN(IF(N96=Data_BB[Index],Data_BB[Lower Bollinger Band]),IF(N96=Data_BB[Lag Index U],Data_BB[Lower Bollinger Band]))","v":227.30584857856417}]
[null,null,null,"2022-04-05",308.63089000000002,{"$f":"IF(Data_BB[[#This Row],[Adj Close]]<E98,TRUE,\"\")","v":""},{"$f":"IF(F96=Data_BB[[#This Row],[Up]],0,1)","v":0},{"$f":"SUM($G$33:G97)","v":35},{"$f":"N(H96)","v":35},{"$f":"AVERAGE(OFFSET(E96,1,,-MIN(Bollinger_Band_Range_BB,COUNTA(E$32:E96)))+Standard_Deviation_BB*IFERROR(STDEV(OFFSET(E96,1,,-MIN(Bollinger_Band_Range_BB,COUNTA(E$32:E96)))),0))","v":332.78561771712788},{"$f":"IFERROR(AVERAGE(OFFSET(E96,1,,-MIN(Bollinger_Band_Range_BB,COUNTA(E$32:E96)))-Standard_Deviation_BB*IFERROR(STDEV(OFFSET(E96,1,,-MIN(Bollinger_Band_Range_BB,COUNTA(E$32:E96)))),0)),0)","v":263.05526968287211},null,null,65,{"$f":"INDEX(Data_BB[Date],MATCH(N97,Data_BB[Index],0))","v":"2022-06-21"},{"$f":"MAX(IF(N97=Data_BB[Index],Data_BB[Adj Close],0),IF(N97=Data_BB[Lag Index U],Data_BB[Adj Close],0))","v":252.49099699999999},{"$f":"MIN(IF(N97=Data_BB[Index],Data_BB[Adj Close]),IF(N97=Data_BB[Lag Index U],Data_BB[Adj Close]))","v":251.88400300000001},{"$f":"MAX(IF(N97=Data_BB[Index],Data_BB[Upper Bollinger Band],0),IF(N97=Data_BB[Lag Index U],Data_BB[Upper Bollinger Band],0))","v":292.51568179181669},{"$f":"MIN(IF(N97=Data_BB[Index],Data_BB[Upper Bollinger Band]),IF(N97=Data_BB[Lag Index U],Data_BB[Upper Bollinger Band]))","v":292.4390415692742},{"$f":"MAX(IF(N97=Data_BB[Index],Data_BB[Lower Bollinger Band],0),IF(N97=Data_BB[Lag Index U],Data_BB[Lower Bollinger Band],0))","v":227.50194823072579},{"$f":"MIN(IF(N97=Data_BB[Index],Data_BB[Lower Bollinger Band]),IF(N97=Data_BB[Lag Index U],Data_BB[Lower Bollinger Band]))","v":226.67701090818338}]
[null,null,null,"2022-04-06",297.333191,{"$f":"IF(Data_BB[[#This Row],[Adj Close]]<E99,TRUE,\"\")","v":true},{"$f":"IF(F97=Data_BB[[#This Row],[Up]],0,1)","v":1},{"$f":"SUM($G$33:G98)","v":36},35,{"$f":"AVERAGE(OFFSET(E97,1,,-MIN(Bollinger_Band_Range_BB,COUNTA(E$32:E97)))+Standard_Deviation_BB*IFERROR(STDEV(OFFSET(E97,1,,-MIN(Bollinger_Band_Range_BB,COUNTA(E$32:E97)))),0))","v":332.38093369094901},{"$f":"IFERROR(AVERAGE(OFFSET(E97,1,,-MIN(Bollinger_Band_Range_BB,COUNTA(E$32:E97)))-Standard_Deviation_BB*IFERROR(STDEV(OFFSET(E97,1,,-MIN(Bollinger_Band_Range_BB,COUNTA(E$32:E97)))),0)),0)","v":264.55199170905104},null,null,{"$f":"N(N97)+1","v":66},{"$f":"INDEX(Data_BB[Date],MATCH(N98,Data_BB[Index],0))","v":"2022-06-22"},{"$f":"MAX(IF(N98=Data_BB[Index],Data_BB[Adj Close],0),IF(N98=Data_BB[Lag Index U],Data_BB[Adj Close],0))","v":266.382294},{"$f":"MIN(IF(N98=Data_BB[Index],Data_BB[Adj Close]),IF(N98=Data_BB[Lag Index U],Data_BB[Adj Close]))","v":251.88400300000001},{"$f":"MAX(IF(N98=Data_BB[Index],Data_BB[Upper Bollinger Band],0),IF(N98=Data_BB[Lag Index U],Data_BB[Upper Bollinger Band],0))","v":293.05698741275512},{"$f":"MIN(IF(N98=Data_BB[Index],Data_BB[Upper Bollinger Band]),IF(N98=Data_BB[Lag Index U],Data_BB[Upper Bollinger Band]))","v":292.49542262956669},{"$f":"MAX(IF(N98=Data_BB[Index],Data_BB[Lower Bollinger Band],0),IF(N98=Data_BB[Lag Index U],Data_BB[Lower Bollinger Band],0))","v":226.67701090818338},{"$f":"MIN(IF(N98=Data_BB[Index],Data_BB[Lower Bollinger Band]),IF(N98=Data_BB[Lag Index U],Data_BB[Lower Bollinger Band]))","v":226.57553078724487}]
[null,null,null,"2022-04-07",299.18966699999999,{"$f":"IF(Data_BB[[#This Row],[Adj Close]]<E100,TRUE,\"\")","v":""},{"$f":"IF(F98=Data_BB[[#This Row],[Up]],0,1)","v":1},{"$f":"SUM($G$33:G99)","v":37},36,{"$f":"AVERAGE(OFFSET(E98,1,,-MIN(Bollinger_Band_Range_BB,COUNTA(E$32:E98)))+Standard_Deviation_BB*IFERROR(STDEV(OFFSET(E98,1,,-MIN(Bollinger_Band_Range_BB,COUNTA(E$32:E98)))),0))","v":331.48113166456017},{"$f":"IFERROR(AVERAGE(OFFSET(E98,1,,-MIN(Bollinger_Band_Range_BB,COUNTA(E$32:E98)))-Standard_Deviation_BB*IFERROR(STDEV(OFFSET(E98,1,,-MIN(Bollinger_Band_Range_BB,COUNTA(E$32:E98)))),0)),0)","v":267.0183739354398},null,null,67,{"$f":"INDEX(Data_BB[Date],MATCH(N99,Data_BB[Index],0))","v":"2022-06-24"},{"$f":"MAX(IF(N99=Data_BB[Index],Data_BB[Adj Close],0),IF(N99=Data_BB[Lag Index U],Data_BB[Adj Close],0))","v":266.382294},{"$f":"MIN(IF(N99=Data_BB[Index],Data_BB[Adj Close]),IF(N99=Data_BB[Lag Index U],Data_BB[Adj Close]))","v":255.21751399999999},{"$f":"MAX(IF(N99=Data_BB[Index],Data_BB[Upper Bollinger Band],0),IF(N99=Data_BB[Lag Index U],Data_BB[Upper Bollinger Band],0))","v":293.05698741275512},{"$f":"MIN(IF(N99=Data_BB[Index],Data_BB[Upper Bollinger Band]),IF(N99=Data_BB[Lag Index U],Data_BB[Upper Bollinger Band]))","v":291.09394653669176},{"$f":"MAX(IF(N99=Data_BB[Index],Data_BB[Lower Bollinger Band],0),IF(N99=Data_BB[Lag Index U],Data_BB[Lower Bollinger Band],0))","v":226.77032376330823},{"$f":"MIN(IF(N99=Data_BB[Index],Data_BB[Lower Bollinger Band]),IF(N99=Data_BB[Lag Index U],Data_BB[Lower Bollinger Band]))","v":226.57553078724487}]
[null,null,null,"2022-04-08",294.82150300000001,{"$f":"IF(Data_BB[[#This Row],[Adj Close]]<E101,TRUE,\"\")","v":""},{"$f":"IF(F99=Data_BB[[#This Row],[Up]],0,1)","v":0},{"$f":"SUM($G$33:G100)","v":37},37,{"$f":"AVERAGE(OFFSET(E99,1,,-MIN(Bollinger_Band_Range_BB,COUNTA(E$32:E99)))+Standard_Deviation_BB*IFERROR(STDEV(OFFSET(E99,1,,-MIN(Bollinger_Band_Range_BB,COUNTA(E$32:E99)))),0))","v":328.87181382722827},{"$f":"IFERROR(AVERAGE(OFFSET(E99,1,,-MIN(Bollinger_Band_Range_BB,COUNTA(E$32:E99)))-Standard_Deviation_BB*IFERROR(STDEV(OFFSET(E99,1,,-MIN(Bollinger_Band_Range_BB,COUNTA(E$32:E99)))),0)),0)","v":271.30546277277165},null,null,68,{"$f":"INDEX(Data_BB[Date],MATCH(N100,Data_BB[Index],0))","v":"2022-06-28"},{"$f":"MAX(IF(N100=Data_BB[Index],Data_BB[Adj Close],0),IF(N100=Data_BB[Lag Index U],Data_BB[Adj Close],0))","v":258.97891199999998},{"$f":"MIN(IF(N100=Data_BB[Index],Data_BB[Adj Close]),IF(N100=Data_BB[Lag Index U],Data_BB[Adj Close]))","v":255.21751399999999},{"$f":"MAX(IF(N100=Data_BB[Index],Data_BB[Upper Bollinger Band],0),IF(N100=Data_BB[Lag Index U],Data_BB[Upper Bollinger Band],0))","v":291.09394653669176},{"$f":"MIN(IF(N100=Data_BB[Index],Data_BB[Upper Bollinger Band]),IF(N100=Data_BB[Lag Index U],Data_BB[Upper Bollinger Band]))","v":289.45894742021022},{"$f":"MAX(IF(N100=Data_BB[Index],Data_BB[Lower Bollinger Band],0),IF(N100=Data_BB[Lag Index U],Data_BB[Lower Bollinger Band],0))","v":227.2500371797899},{"$f":"MIN(IF(N100=Data_BB[Index],Data_BB[Lower Bollinger Band]),IF(N100=Data_BB[Lag Index U],Data_BB[Lower Bollinger Band]))","v":226.77032376330823}]
[null,null,null,"2022-04-11",283.19628899999998,{"$f":"IF(Data_BB[[#This Row],[Adj Close]]<E102,TRUE,\"\")","v":""},{"$f":"IF(F100=Data_BB[[#This Row],[Up]],0,1)","v":0},{"$f":"SUM($G$33:G101)","v":37},37,{"$f":"AVERAGE(OFFSET(E100,1,,-MIN(Bollinger_Band_Range_BB,COUNTA(E$32:E100)))+Standard_Deviation_BB*IFERROR(STDEV(OFFSET(E100,1,,-MIN(Bollinger_Band_Range_BB,COUNTA(E$32:E100)))),0))","v":326.02564355277252},{"$f":"IFERROR(AVERAGE(OFFSET(E100,1,,-MIN(Bollinger_Band_Range_BB,COUNTA(E$32:E100)))-Standard_Deviation_BB*IFERROR(STDEV(OFFSET(E100,1,,-MIN(Bollinger_Band_Range_BB,COUNTA(E$32:E100)))),0)),0)","v":275.02725564722755},null,null,69,{"$f":"INDEX(Data_BB[Date],MATCH(N101,Data_BB[Index],0))","v":"2022-06-29"},{"$f":"MAX(IF(N101=Data_BB[Index],Data_BB[Adj Close],0),IF(N101=Data_BB[Lag Index U],Data_BB[Adj Close],0))","v":258.97891199999998},{"$f":"MIN(IF(N101=Data_BB[Index],Data_BB[Adj Close]),IF(N101=Data_BB[Lag Index U],Data_BB[Adj Close]))","v":255.56578099999999},{"$f":"MAX(IF(N101=Data_BB[Index],Data_BB[Upper Bollinger Band],0),IF(N101=Data_BB[Lag Index U],Data_BB[Upper Bollinger Band],0))","v":289.45894742021022},{"$f":"MIN(IF(N101=Data_BB[Index],Data_BB[Upper Bollinger Band]),IF(N101=Data_BB[Lag Index U],Data_BB[Upper Bollinger Band]))","v":287.39115704146013},{"$f":"MAX(IF(N101=Data_BB[Index],Data_BB[Lower Bollinger Band],0),IF(N101=Data_BB[Lag Index U],Data_BB[Lower Bollinger Band],0))","v":227.76650155853986},{"$f":"MIN(IF(N101=Data_BB[Index],Data_BB[Lower Bollinger Band]),IF(N101=Data_BB[Lag Index U],Data_BB[Lower Bollinger Band]))","v":227.2500371797899}]
[null,null,null,"2022-04-12",280.019409,{"$f":"IF(Data_BB[[#This Row],[Adj Close]]<E103,TRUE,\"\")","v":true},{"$f":"IF(F101=Data_BB[[#This Row],[Up]],0,1)","v":1},{"$f":"SUM($G$33:G102)","v":38},37,{"$f":"AVERAGE(OFFSET(E101,1,,-MIN(Bollinger_Band_Range_BB,COUNTA(E$32:E101)))+Standard_Deviation_BB*IFERROR(STDEV(OFFSET(E101,1,,-MIN(Bollinger_Band_Range_BB,COUNTA(E$32:E101)))),0))","v":327.39721855142989},{"$f":"IFERROR(AVERAGE(OFFSET(E101,1,,-MIN(Bollinger_Band_Range_BB,COUNTA(E$32:E101)))-Standard_Deviation_BB*IFERROR(STDEV(OFFSET(E101,1,,-MIN(Bollinger_Band_Range_BB,COUNTA(E$32:E101)))),0)),0)","v":273.15036444857014},null,null,70,{"$f":"INDEX(Data_BB[Date],MATCH(N102,Data_BB[Index],0))","v":"2022-06-30"},{"$f":"MAX(IF(N102=Data_BB[Index],Data_BB[Adj Close],0),IF(N102=Data_BB[Lag Index U],Data_BB[Adj Close],0))","v":267.07882699999999},{"$f":"MIN(IF(N102=Data_BB[Index],Data_BB[Adj Close]),IF(N102=Data_BB[Lag Index U],Data_BB[Adj Close]))","v":255.56578099999999},{"$f":"MAX(IF(N102=Data_BB[Index],Data_BB[Upper Bollinger Band],0),IF(N102=Data_BB[Lag Index U],Data_BB[Upper Bollinger Band],0))","v":287.39115704146013},{"$f":"MIN(IF(N102=Data_BB[Index],Data_BB[Upper Bollinger Band]),IF(N102=Data_BB[Lag Index U],Data_BB[Upper Bollinger Band]))","v":281.39207662567134},{"$f":"MAX(IF(N102=Data_BB[Index],Data_BB[Lower Bollinger Band],0),IF(N102=Data_BB[Lag Index U],Data_BB[Lower Bollinger Band],0))","v":230.8987605743288},{"$f":"MIN(IF(N102=Data_BB[Index],Data_BB[Lower Bollinger Band]),IF(N102=Data_BB[Lag Index U],Data_BB[Lower Bollinger Band]))","v":227.76650155853986}]
[null,null,null,"2022-04-13",285.539154,{"$f":"IF(Data_BB[[#This Row],[Adj Close]]<E104,TRUE,\"\")","v":""},{"$f":"IF(F102=Data_BB[[#This Row],[Up]],0,1)","v":1},{"$f":"SUM($G$33:G103)","v":39},38,{"$f":"AVERAGE(OFFSET(E102,1,,-MIN(Bollinger_Band_Range_BB,COUNTA(E$32:E102)))+Standard_Deviation_BB*IFERROR(STDEV(OFFSET(E102,1,,-MIN(Bollinger_Band_Range_BB,COUNTA(E$32:E102)))),0))","v":328.34606308280655},{"$f":"IFERROR(AVERAGE(OFFSET(E102,1,,-MIN(Bollinger_Band_Range_BB,COUNTA(E$32:E102)))-Standard_Deviation_BB*IFERROR(STDEV(OFFSET(E102,1,,-MIN(Bollinger_Band_Range_BB,COUNTA(E$32:E102)))),0)),0)","v":271.52941601719357},null,null,71,{"$f":"INDEX(Data_BB[Date],MATCH(N103,Data_BB[Index],0))","v":"2022-07-07"},{"$f":"MAX(IF(N103=Data_BB[Index],Data_BB[Adj Close],0),IF(N103=Data_BB[Lag Index U],Data_BB[Adj Close],0))","v":267.07882699999999},{"$f":"MIN(IF(N103=Data_BB[Index],Data_BB[Adj Close]),IF(N103=Data_BB[Lag Index U],Data_BB[Adj Close]))","v":251.47601299999999},{"$f":"MAX(IF(N103=Data_BB[Index],Data_BB[Upper Bollinger Band],0),IF(N103=Data_BB[Lag Index U],Data_BB[Upper Bollinger Band],0))","v":281.39207662567134},{"$f":"MIN(IF(N103=Data_BB[Index],Data_BB[Upper Bollinger Band]),IF(N103=Data_BB[Lag Index U],Data_BB[Upper Bollinger Band]))","v":278.99891594425497},{"$f":"MAX(IF(N103=Data_BB[Index],Data_BB[Lower Bollinger Band],0),IF(N103=Data_BB[Lag Index U],Data_BB[Lower Bollinger Band],0))","v":234.09892195574508},{"$f":"MIN(IF(N103=Data_BB[Index],Data_BB[Lower Bollinger Band]),IF(N103=Data_BB[Lag Index U],Data_BB[Lower Bollinger Band]))","v":230.8987605743288}]
[null,null,null,"2022-04-14",277.805542,{"$f":"IF(Data_BB[[#This Row],[Adj Close]]<E105,TRUE,\"\")","v":true},{"$f":"IF(F103=Data_BB[[#This Row],[Up]],0,1)","v":1},{"$f":"SUM($G$33:G104)","v":40},39,{"$f":"AVERAGE(OFFSET(E103,1,,-MIN(Bollinger_Band_Range_BB,COUNTA(E$32:E103)))+Standard_Deviation_BB*IFERROR(STDEV(OFFSET(E103,1,,-MIN(Bollinger_Band_Range_BB,COUNTA(E$32:E103)))),0))","v":330.97445551812717},{"$f":"IFERROR(AVERAGE(OFFSET(E103,1,,-MIN(Bollinger_Band_Range_BB,COUNTA(E$32:E103)))-Standard_Deviation_BB*IFERROR(STDEV(OFFSET(E103,1,,-MIN(Bollinger_Band_Range_BB,COUNTA(E$32:E103)))),0)),0)","v":267.37316108187298},null,null,72,{"$f":"INDEX(Data_BB[Date],MATCH(N104,Data_BB[Index],0))","v":"2022-07-13"},{"$f":"MAX(IF(N104=Data_BB[Index],Data_BB[Adj Close],0),IF(N104=Data_BB[Lag Index U],Data_BB[Adj Close],0))","v":255.45631399999999},{"$f":"MIN(IF(N104=Data_BB[Index],Data_BB[Adj Close]),IF(N104=Data_BB[Lag Index U],Data_BB[Adj Close]))","v":251.47601299999999},{"$f":"MAX(IF(N104=Data_BB[Index],Data_BB[Upper Bollinger Band],0),IF(N104=Data_BB[Lag Index U],Data_BB[Upper Bollinger Band],0))","v":278.99891594425497},{"$f":"MIN(IF(N104=Data_BB[Index],Data_BB[Upper Bollinger Band]),IF(N104=Data_BB[Lag Index U],Data_BB[Upper Bollinger Band]))","v":277.41301381554138},{"$f":"MAX(IF(N104=Data_BB[Index],Data_BB[Lower Bollinger Band],0),IF(N104=Data_BB[Lag Index U],Data_BB[Lower Bollinger Band],0))","v":237.13266178445861},{"$f":"MIN(IF(N104=Data_BB[Index],Data_BB[Lower Bollinger Band]),IF(N104=Data_BB[Lag Index U],Data_BB[Lower Bollinger Band]))","v":234.09892195574508}]
[null,null,null,"2022-04-18",278.49054000000001,{"$f":"IF(Data_BB[[#This Row],[Adj Close]]<E106,TRUE,\"\")","v":true},{"$f":"IF(F104=Data_BB[[#This Row],[Up]],0,1)","v":0},{"$f":"SUM($G$33:G105)","v":40},40,{"$f":"AVERAGE(OFFSET(E104,1,,-MIN(Bollinger_Band_Range_BB,COUNTA(E$32:E104)))+Standard_Deviation_BB*IFERROR(STDEV(OFFSET(E104,1,,-MIN(Bollinger_Band_Range_BB,COUNTA(E$32:E104)))),0))","v":332.88810793915138},{"$f":"IFERROR(AVERAGE(OFFSET(E104,1,,-MIN(Bollinger_Band_Range_BB,COUNTA(E$32:E104)))-Standard_Deviation_BB*IFERROR(STDEV(OFFSET(E104,1,,-MIN(Bollinger_Band_Range_BB,COUNTA(E$32:E104)))),0)),0)","v":263.48291266084868},null,null,73,{"$f":"INDEX(Data_BB[Date],MATCH(N105,Data_BB[Index],0))","v":"2022-07-15"},{"$f":"MAX(IF(N105=Data_BB[Index],Data_BB[Adj Close],0),IF(N105=Data_BB[Lag Index U],Data_BB[Adj Close],0))","v":255.45631399999999},{"$f":"MIN(IF(N105=Data_BB[Index],Data_BB[Adj Close]),IF(N105=Data_BB[Lag Index U],Data_BB[Adj Close]))","v":252.99847399999999},{"$f":"MAX(IF(N105=Data_BB[Index],Data_BB[Upper Bollinger Band],0),IF(N105=Data_BB[Lag Index U],Data_BB[Upper Bollinger Band],0))","v":277.41301381554138},{"$f":"MIN(IF(N105=Data_BB[Index],Data_BB[Upper Bollinger Band]),IF(N105=Data_BB[Lag Index U],Data_BB[Upper Bollinger Band]))","v":275.78507725525998},{"$f":"MAX(IF(N105=Data_BB[Index],Data_BB[Lower Bollinger Band],0),IF(N105=Data_BB[Lag Index U],Data_BB[Lower Bollinger Band],0))","v":239.68402974474012},{"$f":"MIN(IF(N105=Data_BB[Index],Data_BB[Lower Bollinger Band]),IF(N105=Data_BB[Lag Index U],Data_BB[Lower Bollinger Band]))","v":237.13266178445861}]
[null,null,null,"2022-04-19",283.23596199999997,{"$f":"IF(Data_BB[[#This Row],[Adj Close]]<E107,TRUE,\"\")","v":true},{"$f":"IF(F105=Data_BB[[#This Row],[Up]],0,1)","v":0},{"$f":"SUM($G$33:G106)","v":40},40,{"$f":"AVERAGE(OFFSET(E105,1,,-MIN(Bollinger_Band_Range_BB,COUNTA(E$32:E105)))+Standard_Deviation_BB*IFERROR(STDEV(OFFSET(E105,1,,-MIN(Bollinger_Band_Range_BB,COUNTA(E$32:E105)))),0))","v":333.6220135555692},{"$f":"IFERROR(AVERAGE(OFFSET(E105,1,,-MIN(Bollinger_Band_Range_BB,COUNTA(E$32:E105)))-Standard_Deviation_BB*IFERROR(STDEV(OFFSET(E105,1,,-MIN(Bollinger_Band_Range_BB,COUNTA(E$32:E105)))),0)),0)","v":261.37303354443088},null,null,74,{"$f":"INDEX(Data_BB[Date],MATCH(N106,Data_BB[Index],0))","v":"2022-07-18"},{"$f":"MAX(IF(N106=Data_BB[Index],Data_BB[Adj Close],0),IF(N106=Data_BB[Lag Index U],Data_BB[Adj Close],0))","v":263.53634599999998},{"$f":"MIN(IF(N106=Data_BB[Index],Data_BB[Adj Close]),IF(N106=Data_BB[Lag Index U],Data_BB[Adj Close]))","v":252.99847399999999},{"$f":"MAX(IF(N106=Data_BB[Index],Data_BB[Upper Bollinger Band],0),IF(N106=Data_BB[Lag Index U],Data_BB[Upper Bollinger Band],0))","v":275.78507725525998},{"$f":"MIN(IF(N106=Data_BB[Index],Data_BB[Upper Bollinger Band]),IF(N106=Data_BB[Lag Index U],Data_BB[Upper Bollinger Band]))","v":274.48592863735337},{"$f":"MAX(IF(N106=Data_BB[Index],Data_BB[Lower Bollinger Band],0),IF(N106=Data_BB[Lag Index U],Data_BB[Lower Bollinger Band],0))","v":244.07081020512533},{"$f":"MIN(IF(N106=Data_BB[Index],Data_BB[Lower Bollinger Band]),IF(N106=Data_BB[Lag Index U],Data_BB[Lower Bollinger Band]))","v":239.68402974474012}]
[null,null,null,"2022-04-20",284.28826900000001,{"$f":"IF(Data_BB[[#This Row],[Adj Close]]<E108,TRUE,\"\")","v":""},{"$f":"IF(F106=Data_BB[[#This Row],[Up]],0,1)","v":1},{"$f":"SUM($G$33:G107)","v":41},40,{"$f":"AVERAGE(OFFSET(E106,1,,-MIN(Bollinger_Band_Range_BB,COUNTA(E$32:E106)))+Standard_Deviation_BB*IFERROR(STDEV(OFFSET(E106,1,,-MIN(Bollinger_Band_Range_BB,COUNTA(E$32:E106)))),0))","v":333.65000030108411},{"$f":"IFERROR(AVERAGE(OFFSET(E106,1,,-MIN(Bollinger_Band_Range_BB,COUNTA(E$32:E106)))-Standard_Deviation_BB*IFERROR(STDEV(OFFSET(E106,1,,-MIN(Bollinger_Band_Range_BB,COUNTA(E$32:E106)))),0)),0)","v":259.58785079891584},null,null,75,{"$f":"INDEX(Data_BB[Date],MATCH(N107,Data_BB[Index],0))","v":"2022-07-21"},{"$f":"MAX(IF(N107=Data_BB[Index],Data_BB[Adj Close],0),IF(N107=Data_BB[Lag Index U],Data_BB[Adj Close],0))","v":263.53634599999998},{"$f":"MIN(IF(N107=Data_BB[Index],Data_BB[Adj Close]),IF(N107=Data_BB[Lag Index U],Data_BB[Adj Close]))","v":250.660034},{"$f":"MAX(IF(N107=Data_BB[Index],Data_BB[Upper Bollinger Band],0),IF(N107=Data_BB[Lag Index U],Data_BB[Upper Bollinger Band],0))","v":274.62095891534307},{"$f":"MIN(IF(N107=Data_BB[Index],Data_BB[Upper Bollinger Band]),IF(N107=Data_BB[Lag Index U],Data_BB[Upper Bollinger Band]))","v":273.37952384254663},{"$f":"MAX(IF(N107=Data_BB[Index],Data_BB[Lower Bollinger Band],0),IF(N107=Data_BB[Lag Index U],Data_BB[Lower Bollinger Band],0))","v":244.53718904836532},{"$f":"MIN(IF(N107=Data_BB[Index],Data_BB[Lower Bollinger Band]),IF(N107=Data_BB[Lag Index U],Data_BB[Lower Bollinger Band]))","v":243.25978565745336}]
[null,null,null,"2022-04-21",278.778412,{"$f":"IF(Data_BB[[#This Row],[Adj Close]]<E109,TRUE,\"\")","v":""},{"$f":"IF(F107=Data_BB[[#This Row],[Up]],0,1)","v":0},{"$f":"SUM($G$33:G108)","v":41},41,{"$f":"AVERAGE(OFFSET(E107,1,,-MIN(Bollinger_Band_Range_BB,COUNTA(E$32:E107)))+Standard_Deviation_BB*IFERROR(STDEV(OFFSET(E107,1,,-MIN(Bollinger_Band_Range_BB,COUNTA(E$32:E107)))),0))","v":334.5978039717283},{"$f":"IFERROR(AVERAGE(OFFSET(E107,1,,-MIN(Bollinger_Band_Range_BB,COUNTA(E$32:E107)))-Standard_Deviation_BB*IFERROR(STDEV(OFFSET(E107,1,,-MIN(Bollinger_Band_Range_BB,COUNTA(E$32:E107)))),0)),0)","v":256.78556102827167},null,null,76,{"$f":"INDEX(Data_BB[Date],MATCH(N108,Data_BB[Index],0))","v":"2022-07-26"},{"$f":"MAX(IF(N108=Data_BB[Index],Data_BB[Adj Close],0),IF(N108=Data_BB[Lag Index U],Data_BB[Adj Close],0))","v":279.358093},{"$f":"MIN(IF(N108=Data_BB[Index],Data_BB[Adj Close]),IF(N108=Data_BB[Lag Index U],Data_BB[Adj Close]))","v":250.660034},{"$f":"MAX(IF(N108=Data_BB[Index],Data_BB[Upper Bollinger Band],0),IF(N108=Data_BB[Lag Index U],Data_BB[Upper Bollinger Band],0))","v":284.06771798318618},{"$f":"MIN(IF(N108=Data_BB[Index],Data_BB[Upper Bollinger Band]),IF(N108=Data_BB[Lag Index U],Data_BB[Upper Bollinger Band]))","v":273.37952384254663},{"$f":"MAX(IF(N108=Data_BB[Index],Data_BB[Lower Bollinger Band],0),IF(N108=Data_BB[Lag Index U],Data_BB[Lower Bollinger Band],0))","v":243.25978565745336},{"$f":"MIN(IF(N108=Data_BB[Index],Data_BB[Lower Bollinger Band]),IF(N108=Data_BB[Lag Index U],Data_BB[Lower Bollinger Band]))","v":237.77783541681379}]
[null,null,null,"2022-04-22",272.04748499999999,{"$f":"IF(Data_BB[[#This Row],[Adj Close]]<E110,TRUE,\"\")","v":true},{"$f":"IF(F108=Data_BB[[#This Row],[Up]],0,1)","v":1},{"$f":"SUM($G$33:G109)","v":42},41,{"$f":"AVERAGE(OFFSET(E108,1,,-MIN(Bollinger_Band_Range_BB,COUNTA(E$32:E108)))+Standard_Deviation_BB*IFERROR(STDEV(OFFSET(E108,1,,-MIN(Bollinger_Band_Range_BB,COUNTA(E$32:E108)))),0))","v":335.90199345199341},{"$f":"IFERROR(AVERAGE(OFFSET(E108,1,,-MIN(Bollinger_Band_Range_BB,COUNTA(E$32:E108)))-Standard_Deviation_BB*IFERROR(STDEV(OFFSET(E108,1,,-MIN(Bollinger_Band_Range_BB,COUNTA(E$32:E108)))),0)),0)","v":252.49612374800668},null,null,77,{"$f":"INDEX(Data_BB[Date],MATCH(N109,Data_BB[Index],0))","v":"2022-07-29"},{"$f":"MAX(IF(N109=Data_BB[Index],Data_BB[Adj Close],0),IF(N109=Data_BB[Lag Index U],Data_BB[Adj Close],0))","v":279.358093},{"$f":"MIN(IF(N109=Data_BB[Index],Data_BB[Adj Close]),IF(N109=Data_BB[Lag Index U],Data_BB[Adj Close]))","v":273.46722399999999},{"$f":"MAX(IF(N109=Data_BB[Index],Data_BB[Upper Bollinger Band],0),IF(N109=Data_BB[Lag Index U],Data_BB[Upper Bollinger Band],0))","v":288.93341640227015},{"$f":"MIN(IF(N109=Data_BB[Index],Data_BB[Upper Bollinger Band]),IF(N109=Data_BB[Lag Index U],Data_BB[Upper Bollinger Band]))","v":284.06771798318618},{"$f":"MAX(IF(N109=Data_BB[Index],Data_BB[Lower Bollinger Band],0),IF(N109=Data_BB[Lag Index U],Data_BB[Lower Bollinger Band],0))","v":237.77783541681379},{"$f":"MIN(IF(N109=Data_BB[Index],Data_BB[Lower Bollinger Band]),IF(N109=Data_BB[Lag Index U],Data_BB[Lower Bollinger Band]))","v":235.93717669772985}]
[null,null,null,"2022-04-25",278.68908699999997,{"$f":"IF(Data_BB[[#This Row],[Adj Close]]<E111,TRUE,\"\")","v":""},{"$f":"IF(F109=Data_BB[[#This Row],[Up]],0,1)","v":1},{"$f":"SUM($G$33:G110)","v":43},42,{"$f":"AVERAGE(OFFSET(E109,1,,-MIN(Bollinger_Band_Range_BB,COUNTA(E$32:E109)))+Standard_Deviation_BB*IFERROR(STDEV(OFFSET(E109,1,,-MIN(Bollinger_Band_Range_BB,COUNTA(E$32:E109)))),0))","v":335.66977378194832},{"$f":"IFERROR(AVERAGE(OFFSET(E109,1,,-MIN(Bollinger_Band_Range_BB,COUNTA(E$32:E109)))-Standard_Deviation_BB*IFERROR(STDEV(OFFSET(E109,1,,-MIN(Bollinger_Band_Range_BB,COUNTA(E$32:E109)))),0)),0)","v":250.44895501805166},null,null,78,{"$f":"INDEX(Data_BB[Date],MATCH(N110,Data_BB[Index],0))","v":"2022-08-02"},{"$f":"MAX(IF(N110=Data_BB[Index],Data_BB[Adj Close],0),IF(N110=Data_BB[Lag Index U],Data_BB[Adj Close],0))","v":282.25375400000001},{"$f":"MIN(IF(N110=Data_BB[Index],Data_BB[Adj Close]),IF(N110=Data_BB[Lag Index U],Data_BB[Adj Close]))","v":273.46722399999999},{"$f":"MAX(IF(N110=Data_BB[Index],Data_BB[Upper Bollinger Band],0),IF(N110=Data_BB[Lag Index U],Data_BB[Upper Bollinger Band],0))","v":295.88534950437537},{"$f":"MIN(IF(N110=Data_BB[Index],Data_BB[Upper Bollinger Band]),IF(N110=Data_BB[Lag Index U],Data_BB[Upper Bollinger Band]))","v":288.93341640227015},{"$f":"MAX(IF(N110=Data_BB[Index],Data_BB[Lower Bollinger Band],0),IF(N110=Data_BB[Lag Index U],Data_BB[Lower Bollinger Band],0))","v":235.93717669772985},{"$f":"MIN(IF(N110=Data_BB[Index],Data_BB[Lower Bollinger Band]),IF(N110=Data_BB[Lag Index U],Data_BB[Lower Bollinger Band]))","v":232.12073249562474}]
[null,null,null,"2022-04-26",268.26507600000002,{"$f":"IF(Data_BB[[#This Row],[Adj Close]]<E112,TRUE,\"\")","v":true},{"$f":"IF(F110=Data_BB[[#This Row],[Up]],0,1)","v":1},{"$f":"SUM($G$33:G111)","v":44},43,{"$f":"AVERAGE(OFFSET(E110,1,,-MIN(Bollinger_Band_Range_BB,COUNTA(E$32:E110)))+Standard_Deviation_BB*IFERROR(STDEV(OFFSET(E110,1,,-MIN(Bollinger_Band_Range_BB,COUNTA(E$32:E110)))),0))","v":335.28079832996701},{"$f":"IFERROR(AVERAGE(OFFSET(E110,1,,-MIN(Bollinger_Band_Range_BB,COUNTA(E$32:E110)))-Standard_Deviation_BB*IFERROR(STDEV(OFFSET(E110,1,,-MIN(Bollinger_Band_Range_BB,COUNTA(E$32:E110)))),0)),0)","v":246.81921717003291},null,null,79,{"$f":"INDEX(Data_BB[Date],MATCH(N111,Data_BB[Index],0))","v":"2022-08-04"},{"$f":"MAX(IF(N111=Data_BB[Index],Data_BB[Adj Close],0),IF(N111=Data_BB[Lag Index U],Data_BB[Adj Close],0))","v":282.25375400000001},{"$f":"MIN(IF(N111=Data_BB[Index],Data_BB[Adj Close]),IF(N111=Data_BB[Lag Index U],Data_BB[Adj Close]))","v":278.940155},{"$f":"MAX(IF(N111=Data_BB[Index],Data_BB[Upper Bollinger Band],0),IF(N111=Data_BB[Lag Index U],Data_BB[Upper Bollinger Band],0))","v":300.78979873279576},{"$f":"MIN(IF(N111=Data_BB[Index],Data_BB[Upper Bollinger Band]),IF(N111=Data_BB[Lag Index U],Data_BB[Upper Bollinger Band]))","v":295.88534950437537},{"$f":"MAX(IF(N111=Data_BB[Index],Data_BB[Lower Bollinger Band],0),IF(N111=Data_BB[Lag Index U],Data_BB[Lower Bollinger Band],0))","v":232.12073249562474},{"$f":"MIN(IF(N111=Data_BB[Index],Data_BB[Lower Bollinger Band]),IF(N111=Data_BB[Lag Index U],Data_BB[Lower Bollinger Band]))","v":230.30699376720423}]
[null,null,null,"2022-04-27",281.171021,{"$f":"IF(Data_BB[[#This Row],[Adj Close]]<E113,TRUE,\"\")","v":true},{"$f":"IF(F111=Data_BB[[#This Row],[Up]],0,1)","v":0},{"$f":"SUM($G$33:G112)","v":44},44,{"$f":"AVERAGE(OFFSET(E111,1,,-MIN(Bollinger_Band_Range_BB,COUNTA(E$32:E111)))+Standard_Deviation_BB*IFERROR(STDEV(OFFSET(E111,1,,-MIN(Bollinger_Band_Range_BB,COUNTA(E$32:E111)))),0))","v":331.2553849711386},{"$f":"IFERROR(AVERAGE(OFFSET(E111,1,,-MIN(Bollinger_Band_Range_BB,COUNTA(E$32:E111)))-Standard_Deviation_BB*IFERROR(STDEV(OFFSET(E111,1,,-MIN(Bollinger_Band_Range_BB,COUNTA(E$32:E111)))),0)),0)","v":247.64892132886149},null,null,80,{"$f":"INDEX(Data_BB[Date],MATCH(N112,Data_BB[Index],0))","v":"2022-08-08"},{"$f":"MAX(IF(N112=Data_BB[Index],Data_BB[Adj Close],0),IF(N112=Data_BB[Lag Index U],Data_BB[Adj Close],0))","v":287.73663299999998},{"$f":"MIN(IF(N112=Data_BB[Index],Data_BB[Adj Close]),IF(N112=Data_BB[Lag Index U],Data_BB[Adj Close]))","v":278.940155},{"$f":"MAX(IF(N112=Data_BB[Index],Data_BB[Upper Bollinger Band],0),IF(N112=Data_BB[Lag Index U],Data_BB[Upper Bollinger Band],0))","v":305.01043704963263},{"$f":"MIN(IF(N112=Data_BB[Index],Data_BB[Upper Bollinger Band]),IF(N112=Data_BB[Lag Index U],Data_BB[Upper Bollinger Band]))","v":300.78979873279576},{"$f":"MAX(IF(N112=Data_BB[Index],Data_BB[Lower Bollinger Band],0),IF(N112=Data_BB[Lag Index U],Data_BB[Lower Bollinger Band],0))","v":232.56132485036733},{"$f":"MIN(IF(N112=Data_BB[Index],Data_BB[Lower Bollinger Band]),IF(N112=Data_BB[Lag Index U],Data_BB[Lower Bollinger Band]))","v":230.30699376720423}]
[null,null,null,"2022-04-28",287.53463699999998,{"$f":"IF(Data_BB[[#This Row],[Adj Close]]<E114,TRUE,\"\")","v":""},{"$f":"IF(F112=Data_BB[[#This Row],[Up]],0,1)","v":1},{"$f":"SUM($G$33:G113)","v":45},44,{"$f":"AVERAGE(OFFSET(E112,1,,-MIN(Bollinger_Band_Range_BB,COUNTA(E$32:E112)))+Standard_Deviation_BB*IFERROR(STDEV(OFFSET(E112,1,,-MIN(Bollinger_Band_Range_BB,COUNTA(E$32:E112)))),0))","v":327.02333390501457},{"$f":"IFERROR(AVERAGE(OFFSET(E112,1,,-MIN(Bollinger_Band_Range_BB,COUNTA(E$32:E112)))-Standard_Deviation_BB*IFERROR(STDEV(OFFSET(E112,1,,-MIN(Bollinger_Band_Range_BB,COUNTA(E$32:E112)))),0)),0)","v":249.47550359498547},null,null,81,{"$f":"INDEX(Data_BB[Date],MATCH(N113,Data_BB[Index],0))","v":"2022-08-10"},{"$f":"MAX(IF(N113=Data_BB[Index],Data_BB[Adj Close],0),IF(N113=Data_BB[Lag Index U],Data_BB[Adj Close],0))","v":287.73663299999998},{"$f":"MIN(IF(N113=Data_BB[Index],Data_BB[Adj Close]),IF(N113=Data_BB[Lag Index U],Data_BB[Adj Close]))","v":285.607147},{"$f":"MAX(IF(N113=Data_BB[Index],Data_BB[Upper Bollinger Band],0),IF(N113=Data_BB[Lag Index U],Data_BB[Upper Bollinger Band],0))","v":306.48303511177096},{"$f":"MIN(IF(N113=Data_BB[Index],Data_BB[Upper Bollinger Band]),IF(N113=Data_BB[Lag Index U],Data_BB[Upper Bollinger Band]))","v":305.01043704963263},{"$f":"MAX(IF(N113=Data_BB[Index],Data_BB[Lower Bollinger Band],0),IF(N113=Data_BB[Lag Index U],Data_BB[Lower Bollinger Band],0))","v":234.36650848822896},{"$f":"MIN(IF(N113=Data_BB[Index],Data_BB[Lower Bollinger Band]),IF(N113=Data_BB[Lag Index U],Data_BB[Lower Bollinger Band]))","v":232.56132485036733}]
[null,null,null,"2022-04-29",275.51220699999999,{"$f":"IF(Data_BB[[#This Row],[Adj Close]]<E115,TRUE,\"\")","v":true},{"$f":"IF(F113=Data_BB[[#This Row],[Up]],0,1)","v":1},{"$f":"SUM($G$33:G114)","v":46},45,{"$f":"AVERAGE(OFFSET(E113,1,,-MIN(Bollinger_Band_Range_BB,COUNTA(E$32:E113)))+Standard_Deviation_BB*IFERROR(STDEV(OFFSET(E113,1,,-MIN(Bollinger_Band_Range_BB,COUNTA(E$32:E113)))),0))","v":324.23833995841693},{"$f":"IFERROR(AVERAGE(OFFSET(E113,1,,-MIN(Bollinger_Band_Range_BB,COUNTA(E$32:E113)))-Standard_Deviation_BB*IFERROR(STDEV(OFFSET(E113,1,,-MIN(Bollinger_Band_Range_BB,COUNTA(E$32:E113)))),0)),0)","v":249.20377144158306},null,null,82,{"$f":"INDEX(Data_BB[Date],MATCH(N114,Data_BB[Index],0))","v":"2022-08-11"},{"$f":"MAX(IF(N114=Data_BB[Index],Data_BB[Adj Close],0),IF(N114=Data_BB[Lag Index U],Data_BB[Adj Close],0))","v":292.02545199999997},{"$f":"MIN(IF(N114=Data_BB[Index],Data_BB[Adj Close]),IF(N114=Data_BB[Lag Index U],Data_BB[Adj Close]))","v":285.607147},{"$f":"MAX(IF(N114=Data_BB[Index],Data_BB[Upper Bollinger Band],0),IF(N114=Data_BB[Lag Index U],Data_BB[Upper Bollinger Band],0))","v":310.62051143971075},{"$f":"MIN(IF(N114=Data_BB[Index],Data_BB[Upper Bollinger Band]),IF(N114=Data_BB[Lag Index U],Data_BB[Upper Bollinger Band]))","v":306.48303511177096},{"$f":"MAX(IF(N114=Data_BB[Index],Data_BB[Lower Bollinger Band],0),IF(N114=Data_BB[Lag Index U],Data_BB[Lower Bollinger Band],0))","v":237.63340996028927},{"$f":"MIN(IF(N114=Data_BB[Index],Data_BB[Lower Bollinger Band]),IF(N114=Data_BB[Lag Index U],Data_BB[Lower Bollinger Band]))","v":234.36650848822896}]
[null,null,null,"2022-05-02",282.41195699999997,{"$f":"IF(Data_BB[[#This Row],[Adj Close]]<E116,TRUE,\"\")","v":""},{"$f":"IF(F114=Data_BB[[#This Row],[Up]],0,1)","v":1},{"$f":"SUM($G$33:G115)","v":47},46,{"$f":"AVERAGE(OFFSET(E114,1,,-MIN(Bollinger_Band_Range_BB,COUNTA(E$32:E114)))+Standard_Deviation_BB*IFERROR(STDEV(OFFSET(E114,1,,-MIN(Bollinger_Band_Range_BB,COUNTA(E$32:E114)))),0))","v":320.17427576376463},{"$f":"IFERROR(AVERAGE(OFFSET(E114,1,,-MIN(Bollinger_Band_Range_BB,COUNTA(E$32:E114)))-Standard_Deviation_BB*IFERROR(STDEV(OFFSET(E114,1,,-MIN(Bollinger_Band_Range_BB,COUNTA(E$32:E114)))),0)),0)","v":250.79088553623532},null,null,83,{"$f":"INDEX(Data_BB[Date],MATCH(N115,Data_BB[Index],0))","v":"2022-08-15"},{"$f":"MAX(IF(N115=Data_BB[Index],Data_BB[Adj Close],0),IF(N115=Data_BB[Lag Index U],Data_BB[Adj Close],0))","v":292.02545199999997},{"$f":"MIN(IF(N115=Data_BB[Index],Data_BB[Adj Close]),IF(N115=Data_BB[Lag Index U],Data_BB[Adj Close]))","v":275.01498400000003},{"$f":"MAX(IF(N115=Data_BB[Index],Data_BB[Upper Bollinger Band],0),IF(N115=Data_BB[Lag Index U],Data_BB[Upper Bollinger Band],0))","v":314.16127104408679},{"$f":"MIN(IF(N115=Data_BB[Index],Data_BB[Upper Bollinger Band]),IF(N115=Data_BB[Lag Index U],Data_BB[Upper Bollinger Band]))","v":300.92966897032846},{"$f":"MAX(IF(N115=Data_BB[Index],Data_BB[Lower Bollinger Band],0),IF(N115=Data_BB[Lag Index U],Data_BB[Lower Bollinger Band],0))","v":263.9881685296715},{"$f":"MIN(IF(N115=Data_BB[Index],Data_BB[Lower Bollinger Band]),IF(N115=Data_BB[Lag Index U],Data_BB[Lower Bollinger Band]))","v":237.63340996028927}]
[null,null,null,"2022-05-03",279.74142499999999,{"$f":"IF(Data_BB[[#This Row],[Adj Close]]<E117,TRUE,\"\")","v":true},{"$f":"IF(F115=Data_BB[[#This Row],[Up]],0,1)","v":1},{"$f":"SUM($G$33:G116)","v":48},47,{"$f":"AVERAGE(OFFSET(E115,1,,-MIN(Bollinger_Band_Range_BB,COUNTA(E$32:E115)))+Standard_Deviation_BB*IFERROR(STDEV(OFFSET(E115,1,,-MIN(Bollinger_Band_Range_BB,COUNTA(E$32:E115)))),0))","v":312.86502388578197},{"$f":"IFERROR(AVERAGE(OFFSET(E115,1,,-MIN(Bollinger_Band_Range_BB,COUNTA(E$32:E115)))-Standard_Deviation_BB*IFERROR(STDEV(OFFSET(E115,1,,-MIN(Bollinger_Band_Range_BB,COUNTA(E$32:E115)))),0)),0)","v":254.80514841421805},null,null,84,{"$f":"INDEX(Data_BB[Date],MATCH(N116,Data_BB[Index],0))","v":"2022-08-24"},{"$f":"MAX(IF(N116=Data_BB[Index],Data_BB[Adj Close],0),IF(N116=Data_BB[Lag Index U],Data_BB[Adj Close],0))","v":278.06637599999999},{"$f":"MIN(IF(N116=Data_BB[Index],Data_BB[Adj Close]),IF(N116=Data_BB[Lag Index U],Data_BB[Adj Close]))","v":275.01498400000003},{"$f":"MAX(IF(N116=Data_BB[Index],Data_BB[Upper Bollinger Band],0),IF(N116=Data_BB[Lag Index U],Data_BB[Upper Bollinger Band],0))","v":300.92966897032846},{"$f":"MIN(IF(N116=Data_BB[Index],Data_BB[Upper Bollinger Band]),IF(N116=Data_BB[Lag Index U],Data_BB[Upper Bollinger Band]))","v":300.61217920692428},{"$f":"MAX(IF(N116=Data_BB[Index],Data_BB[Lower Bollinger Band],0),IF(N116=Data_BB[Lag Index U],Data_BB[Lower Bollinger Band],0))","v":264.60735509307568},{"$f":"MIN(IF(N116=Data_BB[Index],Data_BB[Lower Bollinger Band]),IF(N116=Data_BB[Lag Index U],Data_BB[Lower Bollinger Band]))","v":263.9881685296715}]
[null,null,null,"2022-05-04",287.88211100000001,{"$f":"IF(Data_BB[[#This Row],[Adj Close]]<E118,TRUE,\"\")","v":""},{"$f":"IF(F116=Data_BB[[#This Row],[Up]],0,1)","v":1},{"$f":"SUM($G$33:G117)","v":49},48,{"$f":"AVERAGE(OFFSET(E116,1,,-MIN(Bollinger_Band_Range_BB,COUNTA(E$32:E116)))+Standard_Deviation_BB*IFERROR(STDEV(OFFSET(E116,1,,-MIN(Bollinger_Band_Range_BB,COUNTA(E$32:E116)))),0))","v":306.22974033442608},{"$f":"IFERROR(AVERAGE(OFFSET(E116,1,,-MIN(Bollinger_Band_Range_BB,COUNTA(E$32:E116)))-Standard_Deviation_BB*IFERROR(STDEV(OFFSET(E116,1,,-MIN(Bollinger_Band_Range_BB,COUNTA(E$32:E116)))),0)),0)","v":259.36555406557397},null,null,85,{"$f":"INDEX(Data_BB[Date],MATCH(N117,Data_BB[Index],0))","v":"2022-08-25"},{"$f":"MAX(IF(N117=Data_BB[Index],Data_BB[Adj Close],0),IF(N117=Data_BB[Lag Index U],Data_BB[Adj Close],0))","v":278.06637599999999},{"$f":"MIN(IF(N117=Data_BB[Index],Data_BB[Adj Close]),IF(N117=Data_BB[Lag Index U],Data_BB[Adj Close]))","v":252.53829999999999},{"$f":"MAX(IF(N117=Data_BB[Index],Data_BB[Upper Bollinger Band],0),IF(N117=Data_BB[Lag Index U],Data_BB[Upper Bollinger Band],0))","v":315.66047059597793},{"$f":"MIN(IF(N117=Data_BB[Index],Data_BB[Upper Bollinger Band]),IF(N117=Data_BB[Lag Index U],Data_BB[Upper Bollinger Band]))","v":300.61217920692428},{"$f":"MAX(IF(N117=Data_BB[Index],Data_BB[Lower Bollinger Band],0),IF(N117=Data_BB[Lag Index U],Data_BB[Lower Bollinger Band],0))","v":264.60735509307568},{"$f":"MIN(IF(N117=Data_BB[Index],Data_BB[Lower Bollinger Band]),IF(N117=Data_BB[Lag Index U],Data_BB[Lower Bollinger Band]))","v":236.46672830402204}]
[null,null,null,"2022-05-05",275.34347500000001,{"$f":"IF(Data_BB[[#This Row],[Adj Close]]<E119,TRUE,\"\")","v":""},{"$f":"IF(F117=Data_BB[[#This Row],[Up]],0,1)","v":0},{"$f":"SUM($G$33:G118)","v":49},49,{"$f":"AVERAGE(OFFSET(E117,1,,-MIN(Bollinger_Band_Range_BB,COUNTA(E$32:E117)))+Standard_Deviation_BB*IFERROR(STDEV(OFFSET(E117,1,,-MIN(Bollinger_Band_Range_BB,COUNTA(E$32:E117)))),0))","v":303.2353314809082},{"$f":"IFERROR(AVERAGE(OFFSET(E117,1,,-MIN(Bollinger_Band_Range_BB,COUNTA(E$32:E117)))-Standard_Deviation_BB*IFERROR(STDEV(OFFSET(E117,1,,-MIN(Bollinger_Band_Range_BB,COUNTA(E$32:E117)))),0)),0)","v":260.16099131909175},null,null,86,{"$f":"INDEX(Data_BB[Date],MATCH(N118,Data_BB[Index],0))","v":"2022-09-06"},{"$f":"MAX(IF(N118=Data_BB[Index],Data_BB[Adj Close],0),IF(N118=Data_BB[Lag Index U],Data_BB[Adj Close],0))","v":265.90063500000002},{"$f":"MIN(IF(N118=Data_BB[Index],Data_BB[Adj Close]),IF(N118=Data_BB[Lag Index U],Data_BB[Adj Close]))","v":252.53829999999999},{"$f":"MAX(IF(N118=Data_BB[Index],Data_BB[Upper Bollinger Band],0),IF(N118=Data_BB[Lag Index U],Data_BB[Upper Bollinger Band],0))","v":316.22971867663767},{"$f":"MIN(IF(N118=Data_BB[Index],Data_BB[Upper Bollinger Band]),IF(N118=Data_BB[Lag Index U],Data_BB[Upper Bollinger Band]))","v":310.55023829284568},{"$f":"MAX(IF(N118=Data_BB[Index],Data_BB[Lower Bollinger Band],0),IF(N118=Data_BB[Lag Index U],Data_BB[Lower Bollinger Band],0))","v":236.46672830402204},{"$f":"MIN(IF(N118=Data_BB[Index],Data_BB[Lower Bollinger Band]),IF(N118=Data_BB[Lag Index U],Data_BB[Lower Bollinger Band]))","v":230.93680096813665}]
[null,null,null,"2022-05-06",272.74243200000001,{"$f":"IF(Data_BB[[#This Row],[Adj Close]]<E120,TRUE,\"\")","v":""},{"$f":"IF(F118=Data_BB[[#This Row],[Up]],0,1)","v":0},{"$f":"SUM($G$33:G119)","v":49},49,{"$f":"AVERAGE(OFFSET(E118,1,,-MIN(Bollinger_Band_Range_BB,COUNTA(E$32:E118)))+Standard_Deviation_BB*IFERROR(STDEV(OFFSET(E118,1,,-MIN(Bollinger_Band_Range_BB,COUNTA(E$32:E118)))),0))","v":298.82439079225941},{"$f":"IFERROR(AVERAGE(OFFSET(E118,1,,-MIN(Bollinger_Band_Range_BB,COUNTA(E$32:E118)))-Standard_Deviation_BB*IFERROR(STDEV(OFFSET(E118,1,,-MIN(Bollinger_Band_Range_BB,COUNTA(E$32:E118)))),0)),0)","v":261.9272085077406},null,null,87,{"$f":"INDEX(Data_BB[Date],MATCH(N119,Data_BB[Index],0))","v":"2022-09-12"},{"$f":"MAX(IF(N119=Data_BB[Index],Data_BB[Adj Close],0),IF(N119=Data_BB[Lag Index U],Data_BB[Adj Close],0))","v":265.90063500000002},{"$f":"MIN(IF(N119=Data_BB[Index],Data_BB[Adj Close]),IF(N119=Data_BB[Lag Index U],Data_BB[Adj Close]))","v":251.28185999999999},{"$f":"MAX(IF(N119=Data_BB[Index],Data_BB[Upper Bollinger Band],0),IF(N119=Data_BB[Lag Index U],Data_BB[Upper Bollinger Band],0))","v":310.55023829284568},{"$f":"MIN(IF(N119=Data_BB[Index],Data_BB[Upper Bollinger Band]),IF(N119=Data_BB[Lag Index U],Data_BB[Upper Bollinger Band]))","v":307.71998083002921},{"$f":"MAX(IF(N119=Data_BB[Index],Data_BB[Lower Bollinger Band],0),IF(N119=Data_BB[Lag Index U],Data_BB[Lower Bollinger Band],0))","v":231.58179480715435},{"$f":"MIN(IF(N119=Data_BB[Index],Data_BB[Lower Bollinger Band]),IF(N119=Data_BB[Lag Index U],Data_BB[Lower Bollinger Band]))","v":230.33769306997073}]
[null,null,null,"2022-05-09",262.665863,{"$f":"IF(Data_BB[[#This Row],[Adj Close]]<E121,TRUE,\"\")","v":true},{"$f":"IF(F119=Data_BB[[#This Row],[Up]],0,1)","v":1},{"$f":"SUM($G$33:G120)","v":50},49,{"$f":"AVERAGE(OFFSET(E119,1,,-MIN(Bollinger_Band_Range_BB,COUNTA(E$32:E119)))+Standard_Deviation_BB*IFERROR(STDEV(OFFSET(E119,1,,-MIN(Bollinger_Band_Range_BB,COUNTA(E$32:E119)))),0))","v":297.88818893952373},{"$f":"IFERROR(AVERAGE(OFFSET(E119,1,,-MIN(Bollinger_Band_Range_BB,COUNTA(E$32:E119)))-Standard_Deviation_BB*IFERROR(STDEV(OFFSET(E119,1,,-MIN(Bollinger_Band_Range_BB,COUNTA(E$32:E119)))),0)),0)","v":259.64784636047631},null,null,88,{"$f":"INDEX(Data_BB[Date],MATCH(N120,Data_BB[Index],0))","v":"2022-09-13"},{"$f":"MAX(IF(N120=Data_BB[Index],Data_BB[Adj Close],0),IF(N120=Data_BB[Lag Index U],Data_BB[Adj Close],0))","v":251.5112},{"$f":"MIN(IF(N120=Data_BB[Index],Data_BB[Adj Close]),IF(N120=Data_BB[Lag Index U],Data_BB[Adj Close]))","v":251.28185999999999},{"$f":"MAX(IF(N120=Data_BB[Index],Data_BB[Upper Bollinger Band],0),IF(N120=Data_BB[Lag Index U],Data_BB[Upper Bollinger Band],0))","v":307.71998083002921},{"$f":"MIN(IF(N120=Data_BB[Index],Data_BB[Upper Bollinger Band]),IF(N120=Data_BB[Lag Index U],Data_BB[Upper Bollinger Band]))","v":304.06290464882096},{"$f":"MAX(IF(N120=Data_BB[Index],Data_BB[Lower Bollinger Band],0),IF(N120=Data_BB[Lag Index U],Data_BB[Lower Bollinger Band],0))","v":230.33769306997073},{"$f":"MIN(IF(N120=Data_BB[Index],Data_BB[Lower Bollinger Band]),IF(N120=Data_BB[Lag Index U],Data_BB[Lower Bollinger Band]))","v":230.01897275117904}]
[null,null,null,"2022-05-10",267.55026199999998,{"$f":"IF(Data_BB[[#This Row],[Adj Close]]<E122,TRUE,\"\")","v":""},{"$f":"IF(F120=Data_BB[[#This Row],[Up]],0,1)","v":1},{"$f":"SUM($G$33:G121)","v":51},50,{"$f":"AVERAGE(OFFSET(E120,1,,-MIN(Bollinger_Band_Range_BB,COUNTA(E$32:E120)))+Standard_Deviation_BB*IFERROR(STDEV(OFFSET(E120,1,,-MIN(Bollinger_Band_Range_BB,COUNTA(E$32:E120)))),0))","v":298.23668765076502},{"$f":"IFERROR(AVERAGE(OFFSET(E120,1,,-MIN(Bollinger_Band_Range_BB,COUNTA(E$32:E120)))-Standard_Deviation_BB*IFERROR(STDEV(OFFSET(E120,1,,-MIN(Bollinger_Band_Range_BB,COUNTA(E$32:E120)))),0)),0)","v":257.73474494923505},null,null,89,{"$f":"INDEX(Data_BB[Date],MATCH(N121,Data_BB[Index],0))","v":"2022-09-14"},{"$f":"MAX(IF(N121=Data_BB[Index],Data_BB[Adj Close],0),IF(N121=Data_BB[Lag Index U],Data_BB[Adj Close],0))","v":251.5112},{"$f":"MIN(IF(N121=Data_BB[Index],Data_BB[Adj Close]),IF(N121=Data_BB[Lag Index U],Data_BB[Adj Close]))","v":238.27848800000001},{"$f":"MAX(IF(N121=Data_BB[Index],Data_BB[Upper Bollinger Band],0),IF(N121=Data_BB[Lag Index U],Data_BB[Upper Bollinger Band],0))","v":304.06290464882096},{"$f":"MIN(IF(N121=Data_BB[Index],Data_BB[Upper Bollinger Band]),IF(N121=Data_BB[Lag Index U],Data_BB[Upper Bollinger Band]))","v":289.5302490083904},{"$f":"MAX(IF(N121=Data_BB[Index],Data_BB[Lower Bollinger Band],0),IF(N121=Data_BB[Lag Index U],Data_BB[Lower Bollinger Band],0))","v":230.01897275117904},{"$f":"MIN(IF(N121=Data_BB[Index],Data_BB[Lower Bollinger Band]),IF(N121=Data_BB[Lag Index U],Data_BB[Lower Bollinger Band]))","v":224.03045829160965}]
[null,null,null,"2022-05-11",258.665009,{"$f":"IF(Data_BB[[#This Row],[Adj Close]]<E123,TRUE,\"\")","v":""},{"$f":"IF(F121=Data_BB[[#This Row],[Up]],0,1)","v":0},{"$f":"SUM($G$33:G122)","v":51},51,{"$f":"AVERAGE(OFFSET(E121,1,,-MIN(Bollinger_Band_Range_BB,COUNTA(E$32:E121)))+Standard_Deviation_BB*IFERROR(STDEV(OFFSET(E121,1,,-MIN(Bollinger_Band_Range_BB,COUNTA(E$32:E121)))),0))","v":300.87971435829229},{"$f":"IFERROR(AVERAGE(OFFSET(E121,1,,-MIN(Bollinger_Band_Range_BB,COUNTA(E$32:E121)))-Standard_Deviation_BB*IFERROR(STDEV(OFFSET(E121,1,,-MIN(Bollinger_Band_Range_BB,COUNTA(E$32:E121)))),0)),0)","v":252.95627824170774},null,null,90,{"$f":"INDEX(Data_BB[Date],MATCH(N122,Data_BB[Index],0))","v":"2022-09-21"},{"$f":"MAX(IF(N122=Data_BB[Index],Data_BB[Adj Close],0),IF(N122=Data_BB[Lag Index U],Data_BB[Adj Close],0))","v":240.30278000000001},{"$f":"MIN(IF(N122=Data_BB[Index],Data_BB[Adj Close]),IF(N122=Data_BB[Lag Index U],Data_BB[Adj Close]))","v":238.27848800000001},{"$f":"MAX(IF(N122=Data_BB[Index],Data_BB[Upper Bollinger Band],0),IF(N122=Data_BB[Lag Index U],Data_BB[Upper Bollinger Band],0))","v":289.5302490083904},{"$f":"MIN(IF(N122=Data_BB[Index],Data_BB[Upper Bollinger Band]),IF(N122=Data_BB[Lag Index U],Data_BB[Upper Bollinger Band]))","v":286.90580182959656},{"$f":"MAX(IF(N122=Data_BB[Index],Data_BB[Lower Bollinger Band],0),IF(N122=Data_BB[Lag Index U],Data_BB[Lower Bollinger Band],0))","v":224.03045829160965},{"$f":"MIN(IF(N122=Data_BB[Index],Data_BB[Lower Bollinger Band]),IF(N122=Data_BB[Lag Index U],Data_BB[Lower Bollinger Band]))","v":223.18368507040341}]
[null,null,null,"2022-05-12",253.50264000000001,{"$f":"IF(Data_BB[[#This Row],[Adj Close]]<E124,TRUE,\"\")","v":true},{"$f":"IF(F122=Data_BB[[#This Row],[Up]],0,1)","v":1},{"$f":"SUM($G$33:G123)","v":52},51,{"$f":"AVERAGE(OFFSET(E122,1,,-MIN(Bollinger_Band_Range_BB,COUNTA(E$32:E122)))+Standard_Deviation_BB*IFERROR(STDEV(OFFSET(E122,1,,-MIN(Bollinger_Band_Range_BB,COUNTA(E$32:E122)))),0))","v":303.14350803502612},{"$f":"IFERROR(AVERAGE(OFFSET(E122,1,,-MIN(Bollinger_Band_Range_BB,COUNTA(E$32:E122)))-Standard_Deviation_BB*IFERROR(STDEV(OFFSET(E122,1,,-MIN(Bollinger_Band_Range_BB,COUNTA(E$32:E122)))),0)),0)","v":247.4888331649739},null,null,91,{"$f":"INDEX(Data_BB[Date],MATCH(N123,Data_BB[Index],0))","v":"2022-09-22"},{"$f":"MAX(IF(N123=Data_BB[Index],Data_BB[Adj Close],0),IF(N123=Data_BB[Lag Index U],Data_BB[Adj Close],0))","v":240.30278000000001},{"$f":"MIN(IF(N123=Data_BB[Index],Data_BB[Adj Close]),IF(N123=Data_BB[Lag Index U],Data_BB[Adj Close]))","v":235.74563599999999},{"$f":"MAX(IF(N123=Data_BB[Index],Data_BB[Upper Bollinger Band],0),IF(N123=Data_BB[Lag Index U],Data_BB[Upper Bollinger Band],0))","v":286.90580182959656},{"$f":"MIN(IF(N123=Data_BB[Index],Data_BB[Upper Bollinger Band]),IF(N123=Data_BB[Lag Index U],Data_BB[Upper Bollinger Band]))","v":279.9945527352171},{"$f":"MAX(IF(N123=Data_BB[Index],Data_BB[Lower Bollinger Band],0),IF(N123=Data_BB[Lag Index U],Data_BB[Lower Bollinger Band],0))","v":223.43049384223568},{"$f":"MIN(IF(N123=Data_BB[Index],Data_BB[Lower Bollinger Band]),IF(N123=Data_BB[Lag Index U],Data_BB[Lower Bollinger Band]))","v":220.08414316478292}]
[null,null,null,"2022-05-13",259.23092700000001,{"$f":"IF(Data_BB[[#This Row],[Adj Close]]<E125,TRUE,\"\")","v":true},{"$f":"IF(F123=Data_BB[[#This Row],[Up]],0,1)","v":0},{"$f":"SUM($G$33:G124)","v":52},52,{"$f":"AVERAGE(OFFSET(E123,1,,-MIN(Bollinger_Band_Range_BB,COUNTA(E$32:E123)))+Standard_Deviation_BB*IFERROR(STDEV(OFFSET(E123,1,,-MIN(Bollinger_Band_Range_BB,COUNTA(E$32:E123)))),0))","v":304.15004350130778},{"$f":"IFERROR(AVERAGE(OFFSET(E123,1,,-MIN(Bollinger_Band_Range_BB,COUNTA(E$32:E123)))-Standard_Deviation_BB*IFERROR(STDEV(OFFSET(E123,1,,-MIN(Bollinger_Band_Range_BB,COUNTA(E$32:E123)))),0)),0)","v":244.62483619869221},null,null,92,{"$f":"INDEX(Data_BB[Date],MATCH(N124,Data_BB[Index],0))","v":"2022-09-27"},{"$f":"MAX(IF(N124=Data_BB[Index],Data_BB[Adj Close],0),IF(N124=Data_BB[Lag Index U],Data_BB[Adj Close],0))","v":240.39254800000001},{"$f":"MIN(IF(N124=Data_BB[Index],Data_BB[Adj Close]),IF(N124=Data_BB[Lag Index U],Data_BB[Adj Close]))","v":235.74563599999999},{"$f":"MAX(IF(N124=Data_BB[Index],Data_BB[Upper Bollinger Band],0),IF(N124=Data_BB[Lag Index U],Data_BB[Upper Bollinger Band],0))","v":279.9945527352171},{"$f":"MIN(IF(N124=Data_BB[Index],Data_BB[Upper Bollinger Band]),IF(N124=Data_BB[Lag Index U],Data_BB[Upper Bollinger Band]))","v":278.26796005381391},{"$f":"MAX(IF(N124=Data_BB[Index],Data_BB[Lower Bollinger Band],0),IF(N124=Data_BB[Lag Index U],Data_BB[Lower Bollinger Band],0))","v":220.08414316478292},{"$f":"MIN(IF(N124=Data_BB[Index],Data_BB[Lower Bollinger Band]),IF(N124=Data_BB[Lag Index U],Data_BB[Lower Bollinger Band]))","v":219.62689184618608}]
[null,null,null,"2022-05-16",259.60815400000001,{"$f":"IF(Data_BB[[#This Row],[Adj Close]]<E126,TRUE,\"\")","v":true},{"$f":"IF(F124=Data_BB[[#This Row],[Up]],0,1)","v":0},{"$f":"SUM($G$33:G125)","v":52},52,{"$f":"AVERAGE(OFFSET(E124,1,,-MIN(Bollinger_Band_Range_BB,COUNTA(E$32:E124)))+Standard_Deviation_BB*IFERROR(STDEV(OFFSET(E124,1,,-MIN(Bollinger_Band_Range_BB,COUNTA(E$32:E124)))),0))","v":304.63400797182499},{"$f":"IFERROR(AVERAGE(OFFSET(E124,1,,-MIN(Bollinger_Band_Range_BB,COUNTA(E$32:E124)))-Standard_Deviation_BB*IFERROR(STDEV(OFFSET(E124,1,,-MIN(Bollinger_Band_Range_BB,COUNTA(E$32:E124)))),0)),0)","v":242.25263312817501},null,null,93,{"$f":"INDEX(Data_BB[Date],MATCH(N125,Data_BB[Index],0))","v":"2022-09-28"},{"$f":"MAX(IF(N125=Data_BB[Index],Data_BB[Adj Close],0),IF(N125=Data_BB[Lag Index U],Data_BB[Adj Close],0))","v":240.39254800000001},{"$f":"MIN(IF(N125=Data_BB[Index],Data_BB[Adj Close]),IF(N125=Data_BB[Lag Index U],Data_BB[Adj Close]))","v":232.24548300000001},{"$f":"MAX(IF(N125=Data_BB[Index],Data_BB[Upper Bollinger Band],0),IF(N125=Data_BB[Lag Index U],Data_BB[Upper Bollinger Band],0))","v":278.26796005381391},{"$f":"MIN(IF(N125=Data_BB[Index],Data_BB[Upper Bollinger Band]),IF(N125=Data_BB[Lag Index U],Data_BB[Upper Bollinger Band]))","v":276.02402305683495},{"$f":"MAX(IF(N125=Data_BB[Index],Data_BB[Lower Bollinger Band],0),IF(N125=Data_BB[Lag Index U],Data_BB[Lower Bollinger Band],0))","v":219.62689184618608},{"$f":"MIN(IF(N125=Data_BB[Index],Data_BB[Lower Bollinger Band]),IF(N125=Data_BB[Lag Index U],Data_BB[Lower Bollinger Band]))","v":216.73829244316508}]
[null,null,null,"2022-05-17",264.889679,{"$f":"IF(Data_BB[[#This Row],[Adj Close]]<E127,TRUE,\"\")","v":""},{"$f":"IF(F125=Data_BB[[#This Row],[Up]],0,1)","v":1},{"$f":"SUM($G$33:G126)","v":53},52,{"$f":"AVERAGE(OFFSET(E125,1,,-MIN(Bollinger_Band_Range_BB,COUNTA(E$32:E125)))+Standard_Deviation_BB*IFERROR(STDEV(OFFSET(E125,1,,-MIN(Bollinger_Band_Range_BB,COUNTA(E$32:E125)))),0))","v":303.41483722492865},{"$f":"IFERROR(AVERAGE(OFFSET(E125,1,,-MIN(Bollinger_Band_Range_BB,COUNTA(E$32:E125)))-Standard_Deviation_BB*IFERROR(STDEV(OFFSET(E125,1,,-MIN(Bollinger_Band_Range_BB,COUNTA(E$32:E125)))),0)),0)","v":241.63717557507135},null,null,94,{"$f":"INDEX(Data_BB[Date],MATCH(N126,Data_BB[Index],0))","v":"2022-09-30"},{"$f":"MAX(IF(N126=Data_BB[Index],Data_BB[Adj Close],0),IF(N126=Data_BB[Lag Index U],Data_BB[Adj Close],0))","v":248.49968000000001},{"$f":"MIN(IF(N126=Data_BB[Index],Data_BB[Adj Close]),IF(N126=Data_BB[Lag Index U],Data_BB[Adj Close]))","v":232.24548300000001},{"$f":"MAX(IF(N126=Data_BB[Index],Data_BB[Upper Bollinger Band],0),IF(N126=Data_BB[Lag Index U],Data_BB[Upper Bollinger Band],0))","v":276.02402305683495},{"$f":"MIN(IF(N126=Data_BB[Index],Data_BB[Upper Bollinger Band]),IF(N126=Data_BB[Lag Index U],Data_BB[Upper Bollinger Band]))","v":272.68530026179167},{"$f":"MAX(IF(N126=Data_BB[Index],Data_BB[Lower Bollinger Band],0),IF(N126=Data_BB[Lag Index U],Data_BB[Lower Bollinger Band],0))","v":217.22704573820843},{"$f":"MIN(IF(N126=Data_BB[Index],Data_BB[Lower Bollinger Band]),IF(N126=Data_BB[Lag Index U],Data_BB[Lower Bollinger Band]))","v":216.39306609056695}]
[null,null,null,"2022-05-18",252.82933,{"$f":"IF(Data_BB[[#This Row],[Adj Close]]<E128,TRUE,\"\")","v":""},{"$f":"IF(F126=Data_BB[[#This Row],[Up]],0,1)","v":0},{"$f":"SUM($G$33:G127)","v":53},53,{"$f":"AVERAGE(OFFSET(E126,1,,-MIN(Bollinger_Band_Range_BB,COUNTA(E$32:E126)))+Standard_Deviation_BB*IFERROR(STDEV(OFFSET(E126,1,,-MIN(Bollinger_Band_Range_BB,COUNTA(E$32:E126)))),0))","v":303.34003092339566},{"$f":"IFERROR(AVERAGE(OFFSET(E126,1,,-MIN(Bollinger_Band_Range_BB,COUNTA(E$32:E126)))-Standard_Deviation_BB*IFERROR(STDEV(OFFSET(E126,1,,-MIN(Bollinger_Band_Range_BB,COUNTA(E$32:E126)))),0)),0)","v":238.56608797660436},null,null,95,{"$f":"INDEX(Data_BB[Date],MATCH(N127,Data_BB[Index],0))","v":"2022-10-05"},{"$f":"MAX(IF(N127=Data_BB[Index],Data_BB[Adj Close],0),IF(N127=Data_BB[Lag Index U],Data_BB[Adj Close],0))","v":248.49968000000001},{"$f":"MIN(IF(N127=Data_BB[Index],Data_BB[Adj Close]),IF(N127=Data_BB[Lag Index U],Data_BB[Adj Close]))","v":224.77654999999999},{"$f":"MAX(IF(N127=Data_BB[Index],Data_BB[Upper Bollinger Band],0),IF(N127=Data_BB[Lag Index U],Data_BB[Upper Bollinger Band],0))","v":272.68530026179167},{"$f":"MIN(IF(N127=Data_BB[Index],Data_BB[Upper Bollinger Band]),IF(N127=Data_BB[Lag Index U],Data_BB[Upper Bollinger Band]))","v":259.8830851433267},{"$f":"MAX(IF(N127=Data_BB[Index],Data_BB[Lower Bollinger Band],0),IF(N127=Data_BB[Lag Index U],Data_BB[Lower Bollinger Band],0))","v":222.11656395667336},{"$f":"MIN(IF(N127=Data_BB[Index],Data_BB[Lower Bollinger Band]),IF(N127=Data_BB[Lag Index U],Data_BB[Lower Bollinger Band]))","v":217.22704573820843}]
[null,null,null,"2022-05-19",251.89395099999999,{"$f":"IF(Data_BB[[#This Row],[Adj Close]]<E129,TRUE,\"\")","v":""},{"$f":"IF(F127=Data_BB[[#This Row],[Up]],0,1)","v":0},{"$f":"SUM($G$33:G128)","v":53},53,{"$f":"AVERAGE(OFFSET(E127,1,,-MIN(Bollinger_Band_Range_BB,COUNTA(E$32:E127)))+Standard_Deviation_BB*IFERROR(STDEV(OFFSET(E127,1,,-MIN(Bollinger_Band_Range_BB,COUNTA(E$32:E127)))),0))","v":303.8850175920378},{"$f":"IFERROR(AVERAGE(OFFSET(E127,1,,-MIN(Bollinger_Band_Range_BB,COUNTA(E$32:E127)))-Standard_Deviation_BB*IFERROR(STDEV(OFFSET(E127,1,,-MIN(Bollinger_Band_Range_BB,COUNTA(E$32:E127)))),0)),0)","v":235.33265520796226},null,null,96,{"$f":"INDEX(Data_BB[Date],MATCH(N128,Data_BB[Index],0))","v":"2022-10-11"},{"$f":"MAX(IF(N128=Data_BB[Index],Data_BB[Adj Close],0),IF(N128=Data_BB[Lag Index U],Data_BB[Adj Close],0))","v":233.58174099999999},{"$f":"MIN(IF(N128=Data_BB[Index],Data_BB[Adj Close]),IF(N128=Data_BB[Lag Index U],Data_BB[Adj Close]))","v":224.77654999999999},{"$f":"MAX(IF(N128=Data_BB[Index],Data_BB[Upper Bollinger Band],0),IF(N128=Data_BB[Lag Index U],Data_BB[Upper Bollinger Band],0))","v":260.03461202151186},{"$f":"MIN(IF(N128=Data_BB[Index],Data_BB[Upper Bollinger Band]),IF(N128=Data_BB[Lag Index U],Data_BB[Upper Bollinger Band]))","v":258.31575032208821},{"$f":"MAX(IF(N128=Data_BB[Index],Data_BB[Lower Bollinger Band],0),IF(N128=Data_BB[Lag Index U],Data_BB[Lower Bollinger Band],0))","v":219.31450607848825},{"$f":"MIN(IF(N128=Data_BB[Index],Data_BB[Lower Bollinger Band]),IF(N128=Data_BB[Lag Index U],Data_BB[Lower Bollinger Band]))","v":217.28293737791174}]
[null,null,null,"2022-05-20",251.31680299999999,{"$f":"IF(Data_BB[[#This Row],[Adj Close]]<E130,TRUE,\"\")","v":true},{"$f":"IF(F128=Data_BB[[#This Row],[Up]],0,1)","v":1},{"$f":"SUM($G$33:G129)","v":54},53,{"$f":"AVERAGE(OFFSET(E128,1,,-MIN(Bollinger_Band_Range_BB,COUNTA(E$32:E128)))+Standard_Deviation_BB*IFERROR(STDEV(OFFSET(E128,1,,-MIN(Bollinger_Band_Range_BB,COUNTA(E$32:E128)))),0))","v":304.90899256292209},{"$f":"IFERROR(AVERAGE(OFFSET(E128,1,,-MIN(Bollinger_Band_Range_BB,COUNTA(E$32:E128)))-Standard_Deviation_BB*IFERROR(STDEV(OFFSET(E128,1,,-MIN(Bollinger_Band_Range_BB,COUNTA(E$32:E128)))),0)),0)","v":232.23561203707786},null,null,97,{"$f":"INDEX(Data_BB[Date],MATCH(N129,Data_BB[Index],0))","v":"2022-10-13"},{"$f":"MAX(IF(N129=Data_BB[Index],Data_BB[Adj Close],0),IF(N129=Data_BB[Lag Index U],Data_BB[Adj Close],0))","v":233.58174099999999},{"$f":"MIN(IF(N129=Data_BB[Index],Data_BB[Adj Close]),IF(N129=Data_BB[Lag Index U],Data_BB[Adj Close]))","v":227.91769400000001},{"$f":"MAX(IF(N129=Data_BB[Index],Data_BB[Upper Bollinger Band],0),IF(N129=Data_BB[Lag Index U],Data_BB[Upper Bollinger Band],0))","v":258.31575032208821},{"$f":"MIN(IF(N129=Data_BB[Index],Data_BB[Upper Bollinger Band]),IF(N129=Data_BB[Lag Index U],Data_BB[Upper Bollinger Band]))","v":258.02808320724313},{"$f":"MAX(IF(N129=Data_BB[Index],Data_BB[Lower Bollinger Band],0),IF(N129=Data_BB[Lag Index U],Data_BB[Lower Bollinger Band],0))","v":217.28293737791174},{"$f":"MIN(IF(N129=Data_BB[Index],Data_BB[Lower Bollinger Band]),IF(N129=Data_BB[Lag Index U],Data_BB[Lower Bollinger Band]))","v":215.95715079275683}]
[null,null,null,"2022-05-23",259.36697400000003,{"$f":"IF(Data_BB[[#This Row],[Adj Close]]<E131,TRUE,\"\")","v":""},{"$f":"IF(F129=Data_BB[[#This Row],[Up]],0,1)","v":1},{"$f":"SUM($G$33:G130)","v":55},54,{"$f":"AVERAGE(OFFSET(E129,1,,-MIN(Bollinger_Band_Range_BB,COUNTA(E$32:E129)))+Standard_Deviation_BB*IFERROR(STDEV(OFFSET(E129,1,,-MIN(Bollinger_Band_Range_BB,COUNTA(E$32:E129)))),0))","v":303.70564986874575},{"$f":"IFERROR(AVERAGE(OFFSET(E129,1,,-MIN(Bollinger_Band_Range_BB,COUNTA(E$32:E129)))-Standard_Deviation_BB*IFERROR(STDEV(OFFSET(E129,1,,-MIN(Bollinger_Band_Range_BB,COUNTA(E$32:E129)))),0)),0)","v":231.50674343125434},null,null,98,{"$f":"INDEX(Data_BB[Date],MATCH(N130,Data_BB[Index],0))","v":"2022-10-14"},{"$f":"MAX(IF(N130=Data_BB[Index],Data_BB[Adj Close],0),IF(N130=Data_BB[Lag Index U],Data_BB[Adj Close],0))","v":237.829758},{"$f":"MIN(IF(N130=Data_BB[Index],Data_BB[Adj Close]),IF(N130=Data_BB[Lag Index U],Data_BB[Adj Close]))","v":227.91769400000001},{"$f":"MAX(IF(N130=Data_BB[Index],Data_BB[Upper Bollinger Band],0),IF(N130=Data_BB[Lag Index U],Data_BB[Upper Bollinger Band],0))","v":258.02808320724313},{"$f":"MIN(IF(N130=Data_BB[Index],Data_BB[Upper Bollinger Band]),IF(N130=Data_BB[Lag Index U],Data_BB[Upper Bollinger Band]))","v":256.62248706163996},{"$f":"MAX(IF(N130=Data_BB[Index],Data_BB[Lower Bollinger Band],0),IF(N130=Data_BB[Lag Index U],Data_BB[Lower Bollinger Band],0))","v":216.27182143836004},{"$f":"MIN(IF(N130=Data_BB[Index],Data_BB[Lower Bollinger Band]),IF(N130=Data_BB[Lag Index U],Data_BB[Lower Bollinger Band]))","v":215.95715079275683}]
[null,null,null,"2022-05-24",258.34204099999999,{"$f":"IF(Data_BB[[#This Row],[Adj Close]]<E132,TRUE,\"\")","v":true},{"$f":"IF(F130=Data_BB[[#This Row],[Up]],0,1)","v":1},{"$f":"SUM($G$33:G131)","v":56},55,{"$f":"AVERAGE(OFFSET(E130,1,,-MIN(Bollinger_Band_Range_BB,COUNTA(E$32:E130)))+Standard_Deviation_BB*IFERROR(STDEV(OFFSET(E130,1,,-MIN(Bollinger_Band_Range_BB,COUNTA(E$32:E130)))),0))","v":303.73362378151239},{"$f":"IFERROR(AVERAGE(OFFSET(E130,1,,-MIN(Bollinger_Band_Range_BB,COUNTA(E$32:E130)))-Standard_Deviation_BB*IFERROR(STDEV(OFFSET(E130,1,,-MIN(Bollinger_Band_Range_BB,COUNTA(E$32:E130)))),0)),0)","v":230.48646601848759},null,null,99,{"$f":"INDEX(Data_BB[Date],MATCH(N131,Data_BB[Index],0))","v":"2022-10-18"},{"$f":"MAX(IF(N131=Data_BB[Index],Data_BB[Adj Close],0),IF(N131=Data_BB[Lag Index U],Data_BB[Adj Close],0))","v":237.829758},{"$f":"MIN(IF(N131=Data_BB[Index],Data_BB[Adj Close]),IF(N131=Data_BB[Lag Index U],Data_BB[Adj Close]))","v":235.48635899999999},{"$f":"MAX(IF(N131=Data_BB[Index],Data_BB[Upper Bollinger Band],0),IF(N131=Data_BB[Lag Index U],Data_BB[Upper Bollinger Band],0))","v":256.62248706163996},{"$f":"MIN(IF(N131=Data_BB[Index],Data_BB[Upper Bollinger Band]),IF(N131=Data_BB[Lag Index U],Data_BB[Upper Bollinger Band]))","v":256.02772748902635},{"$f":"MAX(IF(N131=Data_BB[Index],Data_BB[Lower Bollinger Band],0),IF(N131=Data_BB[Lag Index U],Data_BB[Lower Bollinger Band],0))","v":216.27182143836004},{"$f":"MIN(IF(N131=Data_BB[Index],Data_BB[Lower Bollinger Band]),IF(N131=Data_BB[Lag Index U],Data_BB[Lower Bollinger Band]))","v":216.13863311097367}]
[null,null,null,"2022-05-25",261.22778299999999,{"$f":"IF(Data_BB[[#This Row],[Adj Close]]<E133,TRUE,\"\")","v":true},{"$f":"IF(F131=Data_BB[[#This Row],[Up]],0,1)","v":0},{"$f":"SUM($G$33:G132)","v":56},56,{"$f":"AVERAGE(OFFSET(E131,1,,-MIN(Bollinger_Band_Range_BB,COUNTA(E$32:E131)))+Standard_Deviation_BB*IFERROR(STDEV(OFFSET(E131,1,,-MIN(Bollinger_Band_Range_BB,COUNTA(E$32:E131)))),0))","v":301.53327108030555},{"$f":"IFERROR(AVERAGE(OFFSET(E131,1,,-MIN(Bollinger_Band_Range_BB,COUNTA(E$32:E131)))-Standard_Deviation_BB*IFERROR(STDEV(OFFSET(E131,1,,-MIN(Bollinger_Band_Range_BB,COUNTA(E$32:E131)))),0)),0)","v":230.6924949196945},null,null,100,{"$f":"INDEX(Data_BB[Date],MATCH(N132,Data_BB[Index],0))","v":"2022-10-20"},{"$f":"MAX(IF(N132=Data_BB[Index],Data_BB[Adj Close],0),IF(N132=Data_BB[Lag Index U],Data_BB[Adj Close],0))","v":249.95558199999999},{"$f":"MIN(IF(N132=Data_BB[Index],Data_BB[Adj Close]),IF(N132=Data_BB[Lag Index U],Data_BB[Adj Close]))","v":235.48635899999999},{"$f":"MAX(IF(N132=Data_BB[Index],Data_BB[Upper Bollinger Band],0),IF(N132=Data_BB[Lag Index U],Data_BB[Upper Bollinger Band],0))","v":260.61638967108115},{"$f":"MIN(IF(N132=Data_BB[Index],Data_BB[Upper Bollinger Band]),IF(N132=Data_BB[Lag Index U],Data_BB[Upper Bollinger Band]))","v":256.02772748902635},{"$f":"MAX(IF(N132=Data_BB[Index],Data_BB[Lower Bollinger Band],0),IF(N132=Data_BB[Lag Index U],Data_BB[Lower Bollinger Band],0))","v":216.13863311097367},{"$f":"MIN(IF(N132=Data_BB[Index],Data_BB[Lower Bollinger Band]),IF(N132=Data_BB[Lag Index U],Data_BB[Lower Bollinger Band]))","v":214.36703172891885}]
[null,null,null,"2022-05-26",264.59112499999998,{"$f":"IF(Data_BB[[#This Row],[Adj Close]]<E134,TRUE,\"\")","v":true},{"$f":"IF(F132=Data_BB[[#This Row],[Up]],0,1)","v":0},{"$f":"SUM($G$33:G133)","v":56},56,{"$f":"AVERAGE(OFFSET(E132,1,,-MIN(Bollinger_Band_Range_BB,COUNTA(E$32:E132)))+Standard_Deviation_BB*IFERROR(STDEV(OFFSET(E132,1,,-MIN(Bollinger_Band_Range_BB,COUNTA(E$32:E132)))),0))","v":296.99481392901561},{"$f":"IFERROR(AVERAGE(OFFSET(E132,1,,-MIN(Bollinger_Band_Range_BB,COUNTA(E$32:E132)))-Standard_Deviation_BB*IFERROR(STDEV(OFFSET(E132,1,,-MIN(Bollinger_Band_Range_BB,COUNTA(E$32:E132)))),0)),0)","v":232.93660087098434},null,null,101,{"$f":"INDEX(Data_BB[Date],MATCH(N133,Data_BB[Index],0))","v":"2022-10-25"},{"$f":"MAX(IF(N133=Data_BB[Index],Data_BB[Adj Close],0),IF(N133=Data_BB[Lag Index U],Data_BB[Adj Close],0))","v":249.95558199999999},{"$f":"MIN(IF(N133=Data_BB[Index],Data_BB[Adj Close]),IF(N133=Data_BB[Lag Index U],Data_BB[Adj Close]))","v":226.11277799999999},{"$f":"MAX(IF(N133=Data_BB[Index],Data_BB[Upper Bollinger Band],0),IF(N133=Data_BB[Lag Index U],Data_BB[Upper Bollinger Band],0))","v":261.04677311247514},{"$f":"MIN(IF(N133=Data_BB[Index],Data_BB[Upper Bollinger Band]),IF(N133=Data_BB[Lag Index U],Data_BB[Upper Bollinger Band]))","v":260.46979961065335},{"$f":"MAX(IF(N133=Data_BB[Index],Data_BB[Lower Bollinger Band],0),IF(N133=Data_BB[Lag Index U],Data_BB[Lower Bollinger Band],0))","v":214.36703172891885},{"$f":"MIN(IF(N133=Data_BB[Index],Data_BB[Lower Bollinger Band]),IF(N133=Data_BB[Lag Index U],Data_BB[Lower Bollinger Band]))","v":211.89240848752485}]
[null,null,null,"2022-05-27",271.89498900000001,{"$f":"IF(Data_BB[[#This Row],[Adj Close]]<E135,TRUE,\"\")","v":""},{"$f":"IF(F133=Data_BB[[#This Row],[Up]],0,1)","v":1},{"$f":"SUM($G$33:G134)","v":57},56,{"$f":"AVERAGE(OFFSET(E133,1,,-MIN(Bollinger_Band_Range_BB,COUNTA(E$32:E133)))+Standard_Deviation_BB*IFERROR(STDEV(OFFSET(E133,1,,-MIN(Bollinger_Band_Range_BB,COUNTA(E$32:E133)))),0))","v":296.33814170141119},{"$f":"IFERROR(AVERAGE(OFFSET(E133,1,,-MIN(Bollinger_Band_Range_BB,COUNTA(E$32:E133)))-Standard_Deviation_BB*IFERROR(STDEV(OFFSET(E133,1,,-MIN(Bollinger_Band_Range_BB,COUNTA(E$32:E133)))),0)),0)","v":233.23155129858887},null,null,102,{"$f":"INDEX(Data_BB[Date],MATCH(N134,Data_BB[Index],0))","v":"2022-10-27"},{"$f":"MAX(IF(N134=Data_BB[Index],Data_BB[Adj Close],0),IF(N134=Data_BB[Lag Index U],Data_BB[Adj Close],0))","v":235.20713799999999},{"$f":"MIN(IF(N134=Data_BB[Index],Data_BB[Adj Close]),IF(N134=Data_BB[Lag Index U],Data_BB[Adj Close]))","v":226.11277799999999},{"$f":"MAX(IF(N134=Data_BB[Index],Data_BB[Upper Bollinger Band],0),IF(N134=Data_BB[Lag Index U],Data_BB[Upper Bollinger Band],0))","v":261.04677311247514},{"$f":"MIN(IF(N134=Data_BB[Index],Data_BB[Upper Bollinger Band]),IF(N134=Data_BB[Lag Index U],Data_BB[Upper Bollinger Band]))","v":261.03351082951519},{"$f":"MAX(IF(N134=Data_BB[Index],Data_BB[Lower Bollinger Band],0),IF(N134=Data_BB[Lag Index U],Data_BB[Lower Bollinger Band],0))","v":212.20183627048482},{"$f":"MIN(IF(N134=Data_BB[Index],Data_BB[Lower Bollinger Band]),IF(N134=Data_BB[Lag Index U],Data_BB[Lower Bollinger Band]))","v":211.89240848752485}]
[null,null,null,"2022-05-31",270.531769,{"$f":"IF(Data_BB[[#This Row],[Adj Close]]<E136,TRUE,\"\")","v":true},{"$f":"IF(F134=Data_BB[[#This Row],[Up]],0,1)","v":1},{"$f":"SUM($G$33:G135)","v":58},57,{"$f":"AVERAGE(OFFSET(E134,1,,-MIN(Bollinger_Band_Range_BB,COUNTA(E$32:E134)))+Standard_Deviation_BB*IFERROR(STDEV(OFFSET(E134,1,,-MIN(Bollinger_Band_Range_BB,COUNTA(E$32:E134)))),0))","v":293.52905958763438},{"$f":"IFERROR(AVERAGE(OFFSET(E134,1,,-MIN(Bollinger_Band_Range_BB,COUNTA(E$32:E134)))-Standard_Deviation_BB*IFERROR(STDEV(OFFSET(E134,1,,-MIN(Bollinger_Band_Range_BB,COUNTA(E$32:E134)))),0)),0)","v":234.85261461236556},null,null,103,{"$f":"INDEX(Data_BB[Date],MATCH(N135,Data_BB[Index],0))","v":"2022-10-28"},{"$f":"MAX(IF(N135=Data_BB[Index],Data_BB[Adj Close],0),IF(N135=Data_BB[Lag Index U],Data_BB[Adj Close],0))","v":235.20713799999999},{"$f":"MIN(IF(N135=Data_BB[Index],Data_BB[Adj Close]),IF(N135=Data_BB[Lag Index U],Data_BB[Adj Close]))","v":213.64790300000001},{"$f":"MAX(IF(N135=Data_BB[Index],Data_BB[Upper Bollinger Band],0),IF(N135=Data_BB[Lag Index U],Data_BB[Upper Bollinger Band],0))","v":261.03351082951519},{"$f":"MIN(IF(N135=Data_BB[Index],Data_BB[Upper Bollinger Band]),IF(N135=Data_BB[Lag Index U],Data_BB[Upper Bollinger Band]))","v":257.59347256674562},{"$f":"MAX(IF(N135=Data_BB[Index],Data_BB[Lower Bollinger Band],0),IF(N135=Data_BB[Lag Index U],Data_BB[Lower Bollinger Band],0))","v":212.20183627048482},{"$f":"MIN(IF(N135=Data_BB[Index],Data_BB[Lower Bollinger Band]),IF(N135=Data_BB[Lag Index U],Data_BB[Lower Bollinger Band]))","v":206.32303890643948}]
[null,null,null,"2022-06-01",271.07904100000002,{"$f":"IF(Data_BB[[#This Row],[Adj Close]]<E137,TRUE,\"\")","v":true},{"$f":"IF(F135=Data_BB[[#This Row],[Up]],0,1)","v":0},{"$f":"SUM($G$33:G136)","v":58},58,{"$f":"AVERAGE(OFFSET(E135,1,,-MIN(Bollinger_Band_Range_BB,COUNTA(E$32:E135)))+Standard_Deviation_BB*IFERROR(STDEV(OFFSET(E135,1,,-MIN(Bollinger_Band_Range_BB,COUNTA(E$32:E135)))),0))","v":291.45036103560398},{"$f":"IFERROR(AVERAGE(OFFSET(E135,1,,-MIN(Bollinger_Band_Range_BB,COUNTA(E$32:E135)))-Standard_Deviation_BB*IFERROR(STDEV(OFFSET(E135,1,,-MIN(Bollinger_Band_Range_BB,COUNTA(E$32:E135)))),0)),0)","v":236.065074764396},null,null,104,{"$f":"INDEX(Data_BB[Date],MATCH(N136,Data_BB[Index],0))","v":"2022-11-03"},{"$f":"MAX(IF(N136=Data_BB[Index],Data_BB[Adj Close],0),IF(N136=Data_BB[Lag Index U],Data_BB[Adj Close],0))","v":228.226822},{"$f":"MIN(IF(N136=Data_BB[Index],Data_BB[Adj Close]),IF(N136=Data_BB[Lag Index U],Data_BB[Adj Close]))","v":213.64790300000001},{"$f":"MAX(IF(N136=Data_BB[Index],Data_BB[Upper Bollinger Band],0),IF(N136=Data_BB[Lag Index U],Data_BB[Upper Bollinger Band],0))","v":258.27620270400189},{"$f":"MIN(IF(N136=Data_BB[Index],Data_BB[Upper Bollinger Band]),IF(N136=Data_BB[Lag Index U],Data_BB[Upper Bollinger Band]))","v":257.84187349356057},{"$f":"MAX(IF(N136=Data_BB[Index],Data_BB[Lower Bollinger Band],0),IF(N136=Data_BB[Lag Index U],Data_BB[Lower Bollinger Band],0))","v":206.32303890643948},{"$f":"MIN(IF(N136=Data_BB[Index],Data_BB[Lower Bollinger Band]),IF(N136=Data_BB[Lag Index U],Data_BB[Lower Bollinger Band]))","v":204.4697064959982}]
[null,null,null,"2022-06-02",273.22839399999998,{"$f":"IF(Data_BB[[#This Row],[Adj Close]]<E138,TRUE,\"\")","v":""},{"$f":"IF(F136=Data_BB[[#This Row],[Up]],0,1)","v":1},{"$f":"SUM($G$33:G137)","v":59},58,{"$f":"AVERAGE(OFFSET(E136,1,,-MIN(Bollinger_Band_Range_BB,COUNTA(E$32:E136)))+Standard_Deviation_BB*IFERROR(STDEV(OFFSET(E136,1,,-MIN(Bollinger_Band_Range_BB,COUNTA(E$32:E136)))),0))","v":286.01645416112899},{"$f":"IFERROR(AVERAGE(OFFSET(E136,1,,-MIN(Bollinger_Band_Range_BB,COUNTA(E$32:E136)))-Standard_Deviation_BB*IFERROR(STDEV(OFFSET(E136,1,,-MIN(Bollinger_Band_Range_BB,COUNTA(E$32:E136)))),0)),0)","v":240.03360993887094},null,null,105,{"$f":"INDEX(Data_BB[Date],MATCH(N137,Data_BB[Index],0))","v":"2022-11-08"},{"$f":"MAX(IF(N137=Data_BB[Index],Data_BB[Adj Close],0),IF(N137=Data_BB[Lag Index U],Data_BB[Adj Close],0))","v":228.226822},{"$f":"MIN(IF(N137=Data_BB[Index],Data_BB[Adj Close]),IF(N137=Data_BB[Lag Index U],Data_BB[Adj Close]))","v":223.879074},{"$f":"MAX(IF(N137=Data_BB[Index],Data_BB[Upper Bollinger Band],0),IF(N137=Data_BB[Lag Index U],Data_BB[Upper Bollinger Band],0))","v":258.23808900924348},{"$f":"MIN(IF(N137=Data_BB[Index],Data_BB[Upper Bollinger Band]),IF(N137=Data_BB[Lag Index U],Data_BB[Upper Bollinger Band]))","v":258.14584790937897},{"$f":"MAX(IF(N137=Data_BB[Index],Data_BB[Lower Bollinger Band],0),IF(N137=Data_BB[Lag Index U],Data_BB[Lower Bollinger Band],0))","v":204.94508849062103},{"$f":"MIN(IF(N137=Data_BB[Index],Data_BB[Lower Bollinger Band]),IF(N137=Data_BB[Lag Index U],Data_BB[Lower Bollinger Band]))","v":204.72919629075648}]
[null,null,null,"2022-06-03",268.69085699999999,{"$f":"IF(Data_BB[[#This Row],[Adj Close]]<E139,TRUE,\"\")","v":""},{"$f":"IF(F137=Data_BB[[#This Row],[Up]],0,1)","v":0},{"$f":"SUM($G$33:G138)","v":59},59,{"$f":"AVERAGE(OFFSET(E137,1,,-MIN(Bollinger_Band_Range_BB,COUNTA(E$32:E137)))+Standard_Deviation_BB*IFERROR(STDEV(OFFSET(E137,1,,-MIN(Bollinger_Band_Range_BB,COUNTA(E$32:E137)))),0))","v":284.39227544893339},{"$f":"IFERROR(AVERAGE(OFFSET(E137,1,,-MIN(Bollinger_Band_Range_BB,COUNTA(E$32:E137)))-Standard_Deviation_BB*IFERROR(STDEV(OFFSET(E137,1,,-MIN(Bollinger_Band_Range_BB,COUNTA(E$32:E137)))),0)),0)","v":240.99252685106663},null,null,106,{"$f":"INDEX(Data_BB[Date],MATCH(N138,Data_BB[Index],0))","v":"2022-11-09"},{"$f":"MAX(IF(N138=Data_BB[Index],Data_BB[Adj Close],0),IF(N138=Data_BB[Lag Index U],Data_BB[Adj Close],0))","v":246.415558},{"$f":"MIN(IF(N138=Data_BB[Index],Data_BB[Adj Close]),IF(N138=Data_BB[Lag Index U],Data_BB[Adj Close]))","v":223.879074},{"$f":"MAX(IF(N138=Data_BB[Index],Data_BB[Upper Bollinger Band],0),IF(N138=Data_BB[Lag Index U],Data_BB[Upper Bollinger Band],0))","v":262.01886466326221},{"$f":"MIN(IF(N138=Data_BB[Index],Data_BB[Upper Bollinger Band]),IF(N138=Data_BB[Lag Index U],Data_BB[Upper Bollinger Band]))","v":258.23808900924348},{"$f":"MAX(IF(N138=Data_BB[Index],Data_BB[Lower Bollinger Band],0),IF(N138=Data_BB[Lag Index U],Data_BB[Lower Bollinger Band],0))","v":204.72919629075648},{"$f":"MIN(IF(N138=Data_BB[Index],Data_BB[Lower Bollinger Band]),IF(N138=Data_BB[Lag Index U],Data_BB[Lower Bollinger Band]))","v":203.66974943673785}]
[null,null,null,"2022-06-06",267.42709400000001,{"$f":"IF(Data_BB[[#This Row],[Adj Close]]<E140,TRUE,\"\")","v":true},{"$f":"IF(F138=Data_BB[[#This Row],[Up]],0,1)","v":1},{"$f":"SUM($G$33:G139)","v":60},59,{"$f":"AVERAGE(OFFSET(E138,1,,-MIN(Bollinger_Band_Range_BB,COUNTA(E$32:E138)))+Standard_Deviation_BB*IFERROR(STDEV(OFFSET(E138,1,,-MIN(Bollinger_Band_Range_BB,COUNTA(E$32:E138)))),0))","v":283.23505909460414},{"$f":"IFERROR(AVERAGE(OFFSET(E138,1,,-MIN(Bollinger_Band_Range_BB,COUNTA(E$32:E138)))-Standard_Deviation_BB*IFERROR(STDEV(OFFSET(E138,1,,-MIN(Bollinger_Band_Range_BB,COUNTA(E$32:E138)))),0)),0)","v":241.61820940539582},null,null,107,{"$f":"INDEX(Data_BB[Date],MATCH(N139,Data_BB[Index],0))","v":"2022-11-11"},{"$f":"MAX(IF(N139=Data_BB[Index],Data_BB[Adj Close],0),IF(N139=Data_BB[Lag Index U],Data_BB[Adj Close],0))","v":246.415558},{"$f":"MIN(IF(N139=Data_BB[Index],Data_BB[Adj Close]),IF(N139=Data_BB[Lag Index U],Data_BB[Adj Close]))","v":240.871185},{"$f":"MAX(IF(N139=Data_BB[Index],Data_BB[Upper Bollinger Band],0),IF(N139=Data_BB[Lag Index U],Data_BB[Upper Bollinger Band],0))","v":262.6022460738177},{"$f":"MIN(IF(N139=Data_BB[Index],Data_BB[Upper Bollinger Band]),IF(N139=Data_BB[Lag Index U],Data_BB[Upper Bollinger Band]))","v":262.01886466326221},{"$f":"MAX(IF(N139=Data_BB[Index],Data_BB[Lower Bollinger Band],0),IF(N139=Data_BB[Lag Index U],Data_BB[Lower Bollinger Band],0))","v":203.66974943673785},{"$f":"MIN(IF(N139=Data_BB[Index],Data_BB[Lower Bollinger Band]),IF(N139=Data_BB[Lag Index U],Data_BB[Lower Bollinger Band]))","v":203.48723772618234}]
[null,null,null,"2022-06-07",271.158661,{"$f":"IF(Data_BB[[#This Row],[Adj Close]]<E141,TRUE,\"\")","v":""},{"$f":"IF(F139=Data_BB[[#This Row],[Up]],0,1)","v":1},{"$f":"SUM($G$33:G140)","v":61},60,{"$f":"AVERAGE(OFFSET(E139,1,,-MIN(Bollinger_Band_Range_BB,COUNTA(E$32:E139)))+Standard_Deviation_BB*IFERROR(STDEV(OFFSET(E139,1,,-MIN(Bollinger_Band_Range_BB,COUNTA(E$32:E139)))),0))","v":284.47007988242137},{"$f":"IFERROR(AVERAGE(OFFSET(E139,1,,-MIN(Bollinger_Band_Range_BB,COUNTA(E$32:E139)))-Standard_Deviation_BB*IFERROR(STDEV(OFFSET(E139,1,,-MIN(Bollinger_Band_Range_BB,COUNTA(E$32:E139)))),0)),0)","v":241.23246841757873},null,null,108,{"$f":"INDEX(Data_BB[Date],MATCH(N140,Data_BB[Index],0))","v":"2022-11-14"},{"$f":"MAX(IF(N140=Data_BB[Index],Data_BB[Adj Close],0),IF(N140=Data_BB[Lag Index U],Data_BB[Adj Close],0))","v":241.729996},{"$f":"MIN(IF(N140=Data_BB[Index],Data_BB[Adj Close]),IF(N140=Data_BB[Lag Index U],Data_BB[Adj Close]))","v":240.871185},{"$f":"MAX(IF(N140=Data_BB[Index],Data_BB[Upper Bollinger Band],0),IF(N140=Data_BB[Lag Index U],Data_BB[Upper Bollinger Band],0))","v":263.92758141967141},{"$f":"MIN(IF(N140=Data_BB[Index],Data_BB[Upper Bollinger Band]),IF(N140=Data_BB[Lag Index U],Data_BB[Upper Bollinger Band]))","v":262.6022460738177},{"$f":"MAX(IF(N140=Data_BB[Index],Data_BB[Lower Bollinger Band],0),IF(N140=Data_BB[Lag Index U],Data_BB[Lower Bollinger Band],0))","v":203.48723772618234},{"$f":"MIN(IF(N140=Data_BB[Index],Data_BB[Lower Bollinger Band]),IF(N140=Data_BB[Lag Index U],Data_BB[Lower Bollinger Band]))","v":203.09938408032855}]
[null,null,null,"2022-06-08",269.07894900000002,{"$f":"IF(Data_BB[[#This Row],[Adj Close]]<E142,TRUE,\"\")","v":""},{"$f":"IF(F140=Data_BB[[#This Row],[Up]],0,1)","v":0},{"$f":"SUM($G$33:G141)","v":61},61,{"$f":"AVERAGE(OFFSET(E140,1,,-MIN(Bollinger_Band_Range_BB,COUNTA(E$32:E140)))+Standard_Deviation_BB*IFERROR(STDEV(OFFSET(E140,1,,-MIN(Bollinger_Band_Range_BB,COUNTA(E$32:E140)))),0))","v":284.72746935317684},{"$f":"IFERROR(AVERAGE(OFFSET(E140,1,,-MIN(Bollinger_Band_Range_BB,COUNTA(E$32:E140)))-Standard_Deviation_BB*IFERROR(STDEV(OFFSET(E140,1,,-MIN(Bollinger_Band_Range_BB,COUNTA(E$32:E140)))),0)),0)","v":241.12794764682309},null,null,109,{"$f":"INDEX(Data_BB[Date],MATCH(N141,Data_BB[Index],0))","v":"2022-11-16"},{"$f":"MAX(IF(N141=Data_BB[Index],Data_BB[Adj Close],0),IF(N141=Data_BB[Lag Index U],Data_BB[Adj Close],0))","v":241.729996},{"$f":"MIN(IF(N141=Data_BB[Index],Data_BB[Adj Close]),IF(N141=Data_BB[Lag Index U],Data_BB[Adj Close]))","v":241.220001},{"$f":"MAX(IF(N141=Data_BB[Index],Data_BB[Upper Bollinger Band],0),IF(N141=Data_BB[Lag Index U],Data_BB[Upper Bollinger Band],0))","v":264.70772446971387},{"$f":"MIN(IF(N141=Data_BB[Index],Data_BB[Upper Bollinger Band]),IF(N141=Data_BB[Lag Index U],Data_BB[Upper Bollinger Band]))","v":263.92758141967141},{"$f":"MAX(IF(N141=Data_BB[Index],Data_BB[Lower Bollinger Band],0),IF(N141=Data_BB[Lag Index U],Data_BB[Lower Bollinger Band],0))","v":203.09938408032855},{"$f":"MIN(IF(N141=Data_BB[Index],Data_BB[Lower Bollinger Band]),IF(N141=Data_BB[Lag Index U],Data_BB[Lower Bollinger Band]))","v":202.93860443028615}]
[null,null,null,"2022-06-09",263.48663299999998,{"$f":"IF(Data_BB[[#This Row],[Adj Close]]<E143,TRUE,\"\")","v":""},{"$f":"IF(F141=Data_BB[[#This Row],[Up]],0,1)","v":0},{"$f":"SUM($G$33:G142)","v":61},61,{"$f":"AVERAGE(OFFSET(E141,1,,-MIN(Bollinger_Band_Range_BB,COUNTA(E$32:E141)))+Standard_Deviation_BB*IFERROR(STDEV(OFFSET(E141,1,,-MIN(Bollinger_Band_Range_BB,COUNTA(E$32:E141)))),0))","v":284.76091347341634},{"$f":"IFERROR(AVERAGE(OFFSET(E141,1,,-MIN(Bollinger_Band_Range_BB,COUNTA(E$32:E141)))-Standard_Deviation_BB*IFERROR(STDEV(OFFSET(E141,1,,-MIN(Bollinger_Band_Range_BB,COUNTA(E$32:E141)))),0)),0)","v":241.57666592658356},null,null,110,{"$f":"INDEX(Data_BB[Date],MATCH(N142,Data_BB[Index],0))","v":"2022-11-18"},{"$f":"MAX(IF(N142=Data_BB[Index],Data_BB[Adj Close],0),IF(N142=Data_BB[Lag Index U],Data_BB[Adj Close],0))","v":247.58000200000001},{"$f":"MIN(IF(N142=Data_BB[Index],Data_BB[Adj Close]),IF(N142=Data_BB[Lag Index U],Data_BB[Adj Close]))","v":241.220001},{"$f":"MAX(IF(N142=Data_BB[Index],Data_BB[Upper Bollinger Band],0),IF(N142=Data_BB[Lag Index U],Data_BB[Upper Bollinger Band],0))","v":264.67143714830553},{"$f":"MIN(IF(N142=Data_BB[Index],Data_BB[Upper Bollinger Band]),IF(N142=Data_BB[Lag Index U],Data_BB[Upper Bollinger Band]))","v":262.35055844934925},{"$f":"MAX(IF(N142=Data_BB[Index],Data_BB[Lower Bollinger Band],0),IF(N142=Data_BB[Lag Index U],Data_BB[Lower Bollinger Band],0))","v":204.33073745065067},{"$f":"MIN(IF(N142=Data_BB[Index],Data_BB[Lower Bollinger Band]),IF(N142=Data_BB[Lag Index U],Data_BB[Lower Bollinger Band]))","v":202.95293435169449}]
[null,null,null,"2022-06-10",251.74468999999999,{"$f":"IF(Data_BB[[#This Row],[Adj Close]]<E144,TRUE,\"\")","v":""},{"$f":"IF(F142=Data_BB[[#This Row],[Up]],0,1)","v":0},{"$f":"SUM($G$33:G143)","v":61},61,{"$f":"AVERAGE(OFFSET(E142,1,,-MIN(Bollinger_Band_Range_BB,COUNTA(E$32:E142)))+Standard_Deviation_BB*IFERROR(STDEV(OFFSET(E142,1,,-MIN(Bollinger_Band_Range_BB,COUNTA(E$32:E142)))),0))","v":285.07427174522678},{"$f":"IFERROR(AVERAGE(OFFSET(E142,1,,-MIN(Bollinger_Band_Range_BB,COUNTA(E$32:E142)))-Standard_Deviation_BB*IFERROR(STDEV(OFFSET(E142,1,,-MIN(Bollinger_Band_Range_BB,COUNTA(E$32:E142)))),0)),0)","v":241.08751265477321},null,null,111,{"$f":"INDEX(Data_BB[Date],MATCH(N143,Data_BB[Index],0))","v":"2022-11-23"},{"$f":"MAX(IF(N143=Data_BB[Index],Data_BB[Adj Close],0),IF(N143=Data_BB[Lag Index U],Data_BB[Adj Close],0))","v":247.58000200000001},{"$f":"MIN(IF(N143=Data_BB[Index],Data_BB[Adj Close]),IF(N143=Data_BB[Lag Index U],Data_BB[Adj Close]))","v":240.33000200000001},{"$f":"MAX(IF(N143=Data_BB[Index],Data_BB[Upper Bollinger Band],0),IF(N143=Data_BB[Lag Index U],Data_BB[Upper Bollinger Band],0))","v":267.48114108690004},{"$f":"MIN(IF(N143=Data_BB[Index],Data_BB[Upper Bollinger Band]),IF(N143=Data_BB[Lag Index U],Data_BB[Upper Bollinger Band]))","v":264.64050372207123},{"$f":"MAX(IF(N143=Data_BB[Index],Data_BB[Lower Bollinger Band],0),IF(N143=Data_BB[Lag Index U],Data_BB[Lower Bollinger Band],0))","v":204.56940381309997},{"$f":"MIN(IF(N143=Data_BB[Index],Data_BB[Lower Bollinger Band]),IF(N143=Data_BB[Lag Index U],Data_BB[Lower Bollinger Band]))","v":203.73179867792871}]
[null,null,null,"2022-06-13",241.06750500000001,{"$f":"IF(Data_BB[[#This Row],[Adj Close]]<E145,TRUE,\"\")","v":true},{"$f":"IF(F143=Data_BB[[#This Row],[Up]],0,1)","v":1},{"$f":"SUM($G$33:G144)","v":62},61,{"$f":"AVERAGE(OFFSET(E143,1,,-MIN(Bollinger_Band_Range_BB,COUNTA(E$32:E143)))+Standard_Deviation_BB*IFERROR(STDEV(OFFSET(E143,1,,-MIN(Bollinger_Band_Range_BB,COUNTA(E$32:E143)))),0))","v":288.60028798118765},{"$f":"IFERROR(AVERAGE(OFFSET(E143,1,,-MIN(Bollinger_Band_Range_BB,COUNTA(E$32:E143)))-Standard_Deviation_BB*IFERROR(STDEV(OFFSET(E143,1,,-MIN(Bollinger_Band_Range_BB,COUNTA(E$32:E143)))),0)),0)","v":235.74515421881239},null,null,112,{"$f":"INDEX(Data_BB[Date],MATCH(N144,Data_BB[Index],0))","v":"2022-11-29"},{"$f":"MAX(IF(N144=Data_BB[Index],Data_BB[Adj Close],0),IF(N144=Data_BB[Lag Index U],Data_BB[Adj Close],0))","v":255.13999899999999},{"$f":"MIN(IF(N144=Data_BB[Index],Data_BB[Adj Close]),IF(N144=Data_BB[Lag Index U],Data_BB[Adj Close]))","v":240.33000200000001},{"$f":"MAX(IF(N144=Data_BB[Index],Data_BB[Upper Bollinger Band],0),IF(N144=Data_BB[Lag Index U],Data_BB[Upper Bollinger Band],0))","v":270.72686674318186},{"$f":"MIN(IF(N144=Data_BB[Index],Data_BB[Upper Bollinger Band]),IF(N144=Data_BB[Lag Index U],Data_BB[Upper Bollinger Band]))","v":267.48114108690004},{"$f":"MAX(IF(N144=Data_BB[Index],Data_BB[Lower Bollinger Band],0),IF(N144=Data_BB[Lag Index U],Data_BB[Lower Bollinger Band],0))","v":204.56940381309997},{"$f":"MIN(IF(N144=Data_BB[Index],Data_BB[Lower Bollinger Band]),IF(N144=Data_BB[Lag Index U],Data_BB[Lower Bollinger Band]))","v":204.08479875681817}]
[null,null,null,"2022-06-14",243.28653,{"$f":"IF(Data_BB[[#This Row],[Adj Close]]<E146,TRUE,\"\")","v":true},{"$f":"IF(F144=Data_BB[[#This Row],[Up]],0,1)","v":0},{"$f":"SUM($G$33:G145)","v":62},62,{"$f":"AVERAGE(OFFSET(E144,1,,-MIN(Bollinger_Band_Range_BB,COUNTA(E$32:E144)))+Standard_Deviation_BB*IFERROR(STDEV(OFFSET(E144,1,,-MIN(Bollinger_Band_Range_BB,COUNTA(E$32:E144)))),0))","v":290.64740770015771},{"$f":"IFERROR(AVERAGE(OFFSET(E144,1,,-MIN(Bollinger_Band_Range_BB,COUNTA(E$32:E144)))-Standard_Deviation_BB*IFERROR(STDEV(OFFSET(E144,1,,-MIN(Bollinger_Band_Range_BB,COUNTA(E$32:E144)))),0)),0)","v":232.06587209984232},null,null,113,{"$f":"INDEX(Data_BB[Date],MATCH(N145,Data_BB[Index],0))","v":"2022-11-30"},{"$f":"MAX(IF(N145=Data_BB[Index],Data_BB[Adj Close],0),IF(N145=Data_BB[Lag Index U],Data_BB[Adj Close],0))","v":255.13999899999999},{"$f":"MIN(IF(N145=Data_BB[Index],Data_BB[Adj Close]),IF(N145=Data_BB[Lag Index U],Data_BB[Adj Close]))","v":254.69000199999999},{"$f":"MAX(IF(N145=Data_BB[Index],Data_BB[Upper Bollinger Band],0),IF(N145=Data_BB[Lag Index U],Data_BB[Upper Bollinger Band],0))","v":271.88100396368452},{"$f":"MIN(IF(N145=Data_BB[Index],Data_BB[Upper Bollinger Band]),IF(N145=Data_BB[Lag Index U],Data_BB[Upper Bollinger Band]))","v":270.72686674318186},{"$f":"MAX(IF(N145=Data_BB[Index],Data_BB[Lower Bollinger Band],0),IF(N145=Data_BB[Lag Index U],Data_BB[Lower Bollinger Band],0))","v":206.45151413631547},{"$f":"MIN(IF(N145=Data_BB[Index],Data_BB[Lower Bollinger Band]),IF(N145=Data_BB[Lag Index U],Data_BB[Lower Bollinger Band]))","v":204.08479875681817}]
[null,null,null,"2022-06-15",250.520737,{"$f":"IF(Data_BB[[#This Row],[Adj Close]]<E147,TRUE,\"\")","v":""},{"$f":"IF(F145=Data_BB[[#This Row],[Up]],0,1)","v":1},{"$f":"SUM($G$33:G146)","v":63},62,{"$f":"AVERAGE(OFFSET(E145,1,,-MIN(Bollinger_Band_Range_BB,COUNTA(E$32:E145)))+Standard_Deviation_BB*IFERROR(STDEV(OFFSET(E145,1,,-MIN(Bollinger_Band_Range_BB,COUNTA(E$32:E145)))),0))","v":290.68423851857159},{"$f":"IFERROR(AVERAGE(OFFSET(E145,1,,-MIN(Bollinger_Band_Range_BB,COUNTA(E$32:E145)))-Standard_Deviation_BB*IFERROR(STDEV(OFFSET(E145,1,,-MIN(Bollinger_Band_Range_BB,COUNTA(E$32:E145)))),0)),0)","v":230.59214708142827},null,null,114,{"$f":"INDEX(Data_BB[Date],MATCH(N146,Data_BB[Index],0))","v":"2022-12-01"},{"$f":"MAX(IF(N146=Data_BB[Index],Data_BB[Adj Close],0),IF(N146=Data_BB[Lag Index U],Data_BB[Adj Close],0))","v":255.020004},{"$f":"MIN(IF(N146=Data_BB[Index],Data_BB[Adj Close]),IF(N146=Data_BB[Lag Index U],Data_BB[Adj Close]))","v":254.69000199999999},{"$f":"MAX(IF(N146=Data_BB[Index],Data_BB[Upper Bollinger Band],0),IF(N146=Data_BB[Lag Index U],Data_BB[Upper Bollinger Band],0))","v":271.88100396368452},{"$f":"MIN(IF(N146=Data_BB[Index],Data_BB[Upper Bollinger Band]),IF(N146=Data_BB[Lag Index U],Data_BB[Upper Bollinger Band]))","v":270.22305219180168},{"$f":"MAX(IF(N146=Data_BB[Index],Data_BB[Lower Bollinger Band],0),IF(N146=Data_BB[Lag Index U],Data_BB[Lower Bollinger Band],0))","v":212.24667600819831},{"$f":"MIN(IF(N146=Data_BB[Index],Data_BB[Lower Bollinger Band]),IF(N146=Data_BB[Lag Index U],Data_BB[Lower Bollinger Band]))","v":206.45151413631547}]
[null,null,null,"2022-06-16",243.76416,{"$f":"IF(Data_BB[[#This Row],[Adj Close]]<E148,TRUE,\"\")","v":true},{"$f":"IF(F146=Data_BB[[#This Row],[Up]],0,1)","v":1},{"$f":"SUM($G$33:G147)","v":64},63,{"$f":"AVERAGE(OFFSET(E146,1,,-MIN(Bollinger_Band_Range_BB,COUNTA(E$32:E146)))+Standard_Deviation_BB*IFERROR(STDEV(OFFSET(E146,1,,-MIN(Bollinger_Band_Range_BB,COUNTA(E$32:E146)))),0))","v":291.91516595546148},{"$f":"IFERROR(AVERAGE(OFFSET(E146,1,,-MIN(Bollinger_Band_Range_BB,COUNTA(E$32:E146)))-Standard_Deviation_BB*IFERROR(STDEV(OFFSET(E146,1,,-MIN(Bollinger_Band_Range_BB,COUNTA(E$32:E146)))),0)),0)","v":228.45470264453851},null,null,115,{"$f":"INDEX(Data_BB[Date],MATCH(N147,Data_BB[Index],0))","v":"2022-12-02"},{"$f":"MAX(IF(N147=Data_BB[Index],Data_BB[Adj Close],0),IF(N147=Data_BB[Lag Index U],Data_BB[Adj Close],0))","v":255.020004},{"$f":"MIN(IF(N147=Data_BB[Index],Data_BB[Adj Close]),IF(N147=Data_BB[Lag Index U],Data_BB[Adj Close]))","v":244.36999499999999},{"$f":"MAX(IF(N147=Data_BB[Index],Data_BB[Upper Bollinger Band],0),IF(N147=Data_BB[Lag Index U],Data_BB[Upper Bollinger Band],0))","v":270.22305219180168},{"$f":"MIN(IF(N147=Data_BB[Index],Data_BB[Upper Bollinger Band]),IF(N147=Data_BB[Lag Index U],Data_BB[Upper Bollinger Band]))","v":264.98254705135241},{"$f":"MAX(IF(N147=Data_BB[Index],Data_BB[Lower Bollinger Band],0),IF(N147=Data_BB[Lag Index U],Data_BB[Lower Bollinger Band],0))","v":223.83375084864755},{"$f":"MIN(IF(N147=Data_BB[Index],Data_BB[Lower Bollinger Band]),IF(N147=Data_BB[Lag Index U],Data_BB[Lower Bollinger Band]))","v":212.24667600819831}]
[null,null,null,"2022-06-17",246.430969,{"$f":"IF(Data_BB[[#This Row],[Adj Close]]<E149,TRUE,\"\")","v":true},{"$f":"IF(F147=Data_BB[[#This Row],[Up]],0,1)","v":0},{"$f":"SUM($G$33:G148)","v":64},64,{"$f":"AVERAGE(OFFSET(E147,1,,-MIN(Bollinger_Band_Range_BB,COUNTA(E$32:E147)))+Standard_Deviation_BB*IFERROR(STDEV(OFFSET(E147,1,,-MIN(Bollinger_Band_Range_BB,COUNTA(E$32:E147)))),0))","v":292.51772182143583},{"$f":"IFERROR(AVERAGE(OFFSET(E147,1,,-MIN(Bollinger_Band_Range_BB,COUNTA(E$32:E147)))-Standard_Deviation_BB*IFERROR(STDEV(OFFSET(E147,1,,-MIN(Bollinger_Band_Range_BB,COUNTA(E$32:E147)))),0)),0)","v":227.30584857856417},null,null,116,{"$f":"INDEX(Data_BB[Date],MATCH(N148,Data_BB[Index],0))","v":"2022-12-07"},{"$f":"MAX(IF(N148=Data_BB[Index],Data_BB[Adj Close],0),IF(N148=Data_BB[Lag Index U],Data_BB[Adj Close],0))","v":247.39999399999999},{"$f":"MIN(IF(N148=Data_BB[Index],Data_BB[Adj Close]),IF(N148=Data_BB[Lag Index U],Data_BB[Adj Close]))","v":244.36999499999999},{"$f":"MAX(IF(N148=Data_BB[Index],Data_BB[Upper Bollinger Band],0),IF(N148=Data_BB[Lag Index U],Data_BB[Upper Bollinger Band],0))","v":264.98254705135241},{"$f":"MIN(IF(N148=Data_BB[Index],Data_BB[Upper Bollinger Band]),IF(N148=Data_BB[Lag Index U],Data_BB[Upper Bollinger Band]))","v":260.24066486854178},{"$f":"MAX(IF(N148=Data_BB[Index],Data_BB[Lower Bollinger Band],0),IF(N148=Data_BB[Lag Index U],Data_BB[Lower Bollinger Band],0))","v":230.92772503145821},{"$f":"MIN(IF(N148=Data_BB[Index],Data_BB[Lower Bollinger Band]),IF(N148=Data_BB[Lag Index U],Data_BB[Lower Bollinger Band]))","v":223.83375084864755}]
[null,null,null,"2022-06-21",252.49099699999999,{"$f":"IF(Data_BB[[#This Row],[Adj Close]]<E150,TRUE,\"\")","v":""},{"$f":"IF(F148=Data_BB[[#This Row],[Up]],0,1)","v":1},{"$f":"SUM($G$33:G149)","v":65},64,{"$f":"AVERAGE(OFFSET(E148,1,,-MIN(Bollinger_Band_Range_BB,COUNTA(E$32:E148)))+Standard_Deviation_BB*IFERROR(STDEV(OFFSET(E148,1,,-MIN(Bollinger_Band_Range_BB,COUNTA(E$32:E148)))),0))","v":292.4390415692742},{"$f":"IFERROR(AVERAGE(OFFSET(E148,1,,-MIN(Bollinger_Band_Range_BB,COUNTA(E$32:E148)))-Standard_Deviation_BB*IFERROR(STDEV(OFFSET(E148,1,,-MIN(Bollinger_Band_Range_BB,COUNTA(E$32:E148)))),0)),0)","v":227.50194823072579},null,null,117,{"$f":"INDEX(Data_BB[Date],MATCH(N149,Data_BB[Index],0))","v":"2022-12-08"},{"$f":"MAX(IF(N149=Data_BB[Index],Data_BB[Adj Close],0),IF(N149=Data_BB[Lag Index U],Data_BB[Adj Close],0))","v":247.39999399999999},{"$f":"MIN(IF(N149=Data_BB[Index],Data_BB[Adj Close]),IF(N149=Data_BB[Lag Index U],Data_BB[Adj Close]))","v":245.41999799999999},{"$f":"MAX(IF(N149=Data_BB[Index],Data_BB[Upper Bollinger Band],0),IF(N149=Data_BB[Lag Index U],Data_BB[Upper Bollinger Band],0))","v":260.24066486854178},{"$f":"MIN(IF(N149=Data_BB[Index],Data_BB[Upper Bollinger Band]),IF(N149=Data_BB[Lag Index U],Data_BB[Upper Bollinger Band]))","v":260.2136209052465},{"$f":"MAX(IF(N149=Data_BB[Index],Data_BB[Lower Bollinger Band],0),IF(N149=Data_BB[Lag Index U],Data_BB[Lower Bollinger Band],0))","v":231.26705229475351},{"$f":"MIN(IF(N149=Data_BB[Index],Data_BB[Lower Bollinger Band]),IF(N149=Data_BB[Lag Index U],Data_BB[Lower Bollinger Band]))","v":230.92772503145821}]
[null,null,null,"2022-06-22",251.88400300000001,{"$f":"IF(Data_BB[[#This Row],[Adj Close]]<E151,TRUE,\"\")","v":true},{"$f":"IF(F149=Data_BB[[#This Row],[Up]],0,1)","v":1},{"$f":"SUM($G$33:G150)","v":66},65,{"$f":"AVERAGE(OFFSET(E149,1,,-MIN(Bollinger_Band_Range_BB,COUNTA(E$32:E149)))+Standard_Deviation_BB*IFERROR(STDEV(OFFSET(E149,1,,-MIN(Bollinger_Band_Range_BB,COUNTA(E$32:E149)))),0))","v":292.51568179181669},{"$f":"IFERROR(AVERAGE(OFFSET(E149,1,,-MIN(Bollinger_Band_Range_BB,COUNTA(E$32:E149)))-Standard_Deviation_BB*IFERROR(STDEV(OFFSET(E149,1,,-MIN(Bollinger_Band_Range_BB,COUNTA(E$32:E149)))),0)),0)","v":226.67701090818338},null,null,118,{"$f":"INDEX(Data_BB[Date],MATCH(N150,Data_BB[Index],0))","v":"2022-12-09"},{"$f":"MAX(IF(N150=Data_BB[Index],Data_BB[Adj Close],0),IF(N150=Data_BB[Lag Index U],Data_BB[Adj Close],0))","v":257.22000100000002},{"$f":"MIN(IF(N150=Data_BB[Index],Data_BB[Adj Close]),IF(N150=Data_BB[Lag Index U],Data_BB[Adj Close]))","v":245.41999799999999},{"$f":"MAX(IF(N150=Data_BB[Index],Data_BB[Upper Bollinger Band],0),IF(N150=Data_BB[Lag Index U],Data_BB[Upper Bollinger Band],0))","v":264.89656725542659},{"$f":"MIN(IF(N150=Data_BB[Index],Data_BB[Upper Bollinger Band]),IF(N150=Data_BB[Lag Index U],Data_BB[Upper Bollinger Band]))","v":260.2136209052465},{"$f":"MAX(IF(N150=Data_BB[Index],Data_BB[Lower Bollinger Band],0),IF(N150=Data_BB[Lag Index U],Data_BB[Lower Bollinger Band],0))","v":231.26705229475351},{"$f":"MIN(IF(N150=Data_BB[Index],Data_BB[Lower Bollinger Band]),IF(N150=Data_BB[Lag Index U],Data_BB[Lower Bollinger Band]))","v":230.39143164457346}]
[null,null,null,"2022-06-23",257.58578499999999,{"$f":"IF(Data_BB[[#This Row],[Adj Close]]<E152,TRUE,\"\")","v":true},{"$f":"IF(F150=Data_BB[[#This Row],[Up]],0,1)","v":0},{"$f":"SUM($G$33:G151)","v":66},66,{"$f":"AVERAGE(OFFSET(E150,1,,-MIN(Bollinger_Band_Range_BB,COUNTA(E$32:E150)))+Standard_Deviation_BB*IFERROR(STDEV(OFFSET(E150,1,,-MIN(Bollinger_Band_Range_BB,COUNTA(E$32:E150)))),0))","v":292.49542262956669},{"$f":"IFERROR(AVERAGE(OFFSET(E150,1,,-MIN(Bollinger_Band_Range_BB,COUNTA(E$32:E150)))-Standard_Deviation_BB*IFERROR(STDEV(OFFSET(E150,1,,-MIN(Bollinger_Band_Range_BB,COUNTA(E$32:E150)))),0)),0)","v":226.62164447043338},null,null,119,{"$f":"INDEX(Data_BB[Date],MATCH(N151,Data_BB[Index],0))","v":"2022-12-14"},{"$f":"MAX(IF(N151=Data_BB[Index],Data_BB[Adj Close],0),IF(N151=Data_BB[Lag Index U],Data_BB[Adj Close],0))","v":257.22000100000002},{"$f":"MIN(IF(N151=Data_BB[Index],Data_BB[Adj Close]),IF(N151=Data_BB[Lag Index U],Data_BB[Adj Close]))","v":240.449997},{"$f":"MAX(IF(N151=Data_BB[Index],Data_BB[Upper Bollinger Band],0),IF(N151=Data_BB[Lag Index U],Data_BB[Upper Bollinger Band],0))","v":264.89656725542659},{"$f":"MIN(IF(N151=Data_BB[Index],Data_BB[Upper Bollinger Band]),IF(N151=Data_BB[Lag Index U],Data_BB[Upper Bollinger Band]))","v":264.49081850120058},{"$f":"MAX(IF(N151=Data_BB[Index],Data_BB[Lower Bollinger Band],0),IF(N151=Data_BB[Lag Index U],Data_BB[Lower Bollinger Band],0))","v":231.82618119879947},{"$f":"MIN(IF(N151=Data_BB[Index],Data_BB[Lower Bollinger Band]),IF(N151=Data_BB[Lag Index U],Data_BB[Lower Bollinger Band]))","v":230.39143164457346}]
[null,null,null,"2022-06-24",266.382294,{"$f":"IF(Data_BB[[#This Row],[Adj Close]]<E153,TRUE,\"\")","v":""},{"$f":"IF(F151=Data_BB[[#This Row],[Up]],0,1)","v":1},{"$f":"SUM($G$33:G152)","v":67},66,{"$f":"AVERAGE(OFFSET(E151,1,,-MIN(Bollinger_Band_Range_BB,COUNTA(E$32:E151)))+Standard_Deviation_BB*IFERROR(STDEV(OFFSET(E151,1,,-MIN(Bollinger_Band_Range_BB,COUNTA(E$32:E151)))),0))","v":293.05698741275512},{"$f":"IFERROR(AVERAGE(OFFSET(E151,1,,-MIN(Bollinger_Band_Range_BB,COUNTA(E$32:E151)))-Standard_Deviation_BB*IFERROR(STDEV(OFFSET(E151,1,,-MIN(Bollinger_Band_Range_BB,COUNTA(E$32:E151)))),0)),0)","v":226.57553078724487},null,null,120,{"$f":"INDEX(Data_BB[Date],MATCH(N152,Data_BB[Index],0))","v":"2022-12-19"},{"$f":"MAX(IF(N152=Data_BB[Index],Data_BB[Adj Close],0),IF(N152=Data_BB[Lag Index U],Data_BB[Adj Close],0))","v":244.429993},{"$f":"MIN(IF(N152=Data_BB[Index],Data_BB[Adj Close]),IF(N152=Data_BB[Lag Index U],Data_BB[Adj Close]))","v":240.449997},{"$f":"MAX(IF(N152=Data_BB[Index],Data_BB[Upper Bollinger Band],0),IF(N152=Data_BB[Lag Index U],Data_BB[Upper Bollinger Band],0))","v":264.67418611532372},{"$f":"MIN(IF(N152=Data_BB[Index],Data_BB[Upper Bollinger Band]),IF(N152=Data_BB[Lag Index U],Data_BB[Upper Bollinger Band]))","v":264.6146326834633},{"$f":"MAX(IF(N152=Data_BB[Index],Data_BB[Lower Bollinger Band],0),IF(N152=Data_BB[Lag Index U],Data_BB[Lower Bollinger Band],0))","v":231.62536661653672},{"$f":"MIN(IF(N152=Data_BB[Index],Data_BB[Lower Bollinger Band]),IF(N152=Data_BB[Lag Index U],Data_BB[Lower Bollinger Band]))","v":231.48081258467627}]
[null,null,null,"2022-06-27",263.58612099999999,{"$f":"IF(Data_BB[[#This Row],[Adj Close]]<E154,TRUE,\"\")","v":""},{"$f":"IF(F152=Data_BB[[#This Row],[Up]],0,1)","v":0},{"$f":"SUM($G$33:G153)","v":67},67,{"$f":"AVERAGE(OFFSET(E152,1,,-MIN(Bollinger_Band_Range_BB,COUNTA(E$32:E152)))+Standard_Deviation_BB*IFERROR(STDEV(OFFSET(E152,1,,-MIN(Bollinger_Band_Range_BB,COUNTA(E$32:E152)))),0))","v":292.94513397258015},{"$f":"IFERROR(AVERAGE(OFFSET(E152,1,,-MIN(Bollinger_Band_Range_BB,COUNTA(E$32:E152)))-Standard_Deviation_BB*IFERROR(STDEV(OFFSET(E152,1,,-MIN(Bollinger_Band_Range_BB,COUNTA(E$32:E152)))),0)),0)","v":226.58688382741985},null,null,121,{"$f":"INDEX(Data_BB[Date],MATCH(N153,Data_BB[Index],0))","v":"2022-12-21"},{"$f":"MAX(IF(N153=Data_BB[Index],Data_BB[Adj Close],0),IF(N153=Data_BB[Lag Index U],Data_BB[Adj Close],0))","v":244.429993},{"$f":"MIN(IF(N153=Data_BB[Index],Data_BB[Adj Close]),IF(N153=Data_BB[Lag Index U],Data_BB[Adj Close]))","v":238.19000199999999},{"$f":"MAX(IF(N153=Data_BB[Index],Data_BB[Upper Bollinger Band],0),IF(N153=Data_BB[Lag Index U],Data_BB[Upper Bollinger Band],0))","v":265.4840472430771},{"$f":"MIN(IF(N153=Data_BB[Index],Data_BB[Upper Bollinger Band]),IF(N153=Data_BB[Lag Index U],Data_BB[Upper Bollinger Band]))","v":264.67418611532372},{"$f":"MAX(IF(N153=Data_BB[Index],Data_BB[Lower Bollinger Band],0),IF(N153=Data_BB[Lag Index U],Data_BB[Lower Bollinger Band],0))","v":231.48081258467627},{"$f":"MIN(IF(N153=Data_BB[Index],Data_BB[Lower Bollinger Band]),IF(N153=Data_BB[Lag Index U],Data_BB[Lower Bollinger Band]))","v":229.73195145692284}]
[null,null,null,"2022-06-28",255.21751399999999,{"$f":"IF(Data_BB[[#This Row],[Adj Close]]<E155,TRUE,\"\")","v":true},{"$f":"IF(F153=Data_BB[[#This Row],[Up]],0,1)","v":1},{"$f":"SUM($G$33:G154)","v":68},67,{"$f":"AVERAGE(OFFSET(E153,1,,-MIN(Bollinger_Band_Range_BB,COUNTA(E$32:E153)))+Standard_Deviation_BB*IFERROR(STDEV(OFFSET(E153,1,,-MIN(Bollinger_Band_Range_BB,COUNTA(E$32:E153)))),0))","v":291.09394653669176},{"$f":"IFERROR(AVERAGE(OFFSET(E153,1,,-MIN(Bollinger_Band_Range_BB,COUNTA(E$32:E153)))-Standard_Deviation_BB*IFERROR(STDEV(OFFSET(E153,1,,-MIN(Bollinger_Band_Range_BB,COUNTA(E$32:E153)))),0)),0)","v":226.77032376330823},null,null,122,{"$f":"INDEX(Data_BB[Date],MATCH(N154,Data_BB[Index],0))","v":"2022-12-22"},{"$f":"MAX(IF(N154=Data_BB[Index],Data_BB[Adj Close],0),IF(N154=Data_BB[Lag Index U],Data_BB[Adj Close],0))","v":238.729996},{"$f":"MIN(IF(N154=Data_BB[Index],Data_BB[Adj Close]),IF(N154=Data_BB[Lag Index U],Data_BB[Adj Close]))","v":238.19000199999999},{"$f":"MAX(IF(N154=Data_BB[Index],Data_BB[Upper Bollinger Band],0),IF(N154=Data_BB[Lag Index U],Data_BB[Upper Bollinger Band],0))","v":266.01314909146481},{"$f":"MIN(IF(N154=Data_BB[Index],Data_BB[Upper Bollinger Band]),IF(N154=Data_BB[Lag Index U],Data_BB[Upper Bollinger Band]))","v":265.4840472430771},{"$f":"MAX(IF(N154=Data_BB[Index],Data_BB[Lower Bollinger Band],0),IF(N154=Data_BB[Lag Index U],Data_BB[Lower Bollinger Band],0))","v":229.73195145692284},{"$f":"MIN(IF(N154=Data_BB[Index],Data_BB[Lower Bollinger Band]),IF(N154=Data_BB[Lag Index U],Data_BB[Lower Bollinger Band]))","v":228.32684870853518}]
[null,null,null,"2022-06-29",258.97891199999998,{"$f":"IF(Data_BB[[#This Row],[Adj Close]]<E156,TRUE,\"\")","v":""},{"$f":"IF(F154=Data_BB[[#This Row],[Up]],0,1)","v":1},{"$f":"SUM($G$33:G155)","v":69},68,{"$f":"AVERAGE(OFFSET(E154,1,,-MIN(Bollinger_Band_Range_BB,COUNTA(E$32:E154)))+Standard_Deviation_BB*IFERROR(STDEV(OFFSET(E154,1,,-MIN(Bollinger_Band_Range_BB,COUNTA(E$32:E154)))),0))","v":289.45894742021022},{"$f":"IFERROR(AVERAGE(OFFSET(E154,1,,-MIN(Bollinger_Band_Range_BB,COUNTA(E$32:E154)))-Standard_Deviation_BB*IFERROR(STDEV(OFFSET(E154,1,,-MIN(Bollinger_Band_Range_BB,COUNTA(E$32:E154)))),0)),0)","v":227.2500371797899},null,null,123,{"$f":"INDEX(Data_BB[Date],MATCH(N155,Data_BB[Index],0))","v":"2022-12-23"},{"$f":"MAX(IF(N155=Data_BB[Index],Data_BB[Adj Close],0),IF(N155=Data_BB[Lag Index U],Data_BB[Adj Close],0))","v":238.729996},{"$f":"MIN(IF(N155=Data_BB[Index],Data_BB[Adj Close]),IF(N155=Data_BB[Lag Index U],Data_BB[Adj Close]))","v":234.529999},{"$f":"MAX(IF(N155=Data_BB[Index],Data_BB[Upper Bollinger Band],0),IF(N155=Data_BB[Lag Index U],Data_BB[Upper Bollinger Band],0))","v":267.65039583665725},{"$f":"MIN(IF(N155=Data_BB[Index],Data_BB[Upper Bollinger Band]),IF(N155=Data_BB[Lag Index U],Data_BB[Upper Bollinger Band]))","v":266.01314909146481},{"$f":"MAX(IF(N155=Data_BB[Index],Data_BB[Lower Bollinger Band],0),IF(N155=Data_BB[Lag Index U],Data_BB[Lower Bollinger Band],0))","v":228.32684870853518},{"$f":"MIN(IF(N155=Data_BB[Index],Data_BB[Lower Bollinger Band]),IF(N155=Data_BB[Lag Index U],Data_BB[Lower Bollinger Band]))","v":225.62960286334274}]
[null,null,null,"2022-06-30",255.56578099999999,{"$f":"IF(Data_BB[[#This Row],[Adj Close]]<E157,TRUE,\"\")","v":true},{"$f":"IF(F155=Data_BB[[#This Row],[Up]],0,1)","v":1},{"$f":"SUM($G$33:G156)","v":70},69,{"$f":"AVERAGE(OFFSET(E155,1,,-MIN(Bollinger_Band_Range_BB,COUNTA(E$32:E155)))+Standard_Deviation_BB*IFERROR(STDEV(OFFSET(E155,1,,-MIN(Bollinger_Band_Range_BB,COUNTA(E$32:E155)))),0))","v":287.39115704146013},{"$f":"IFERROR(AVERAGE(OFFSET(E155,1,,-MIN(Bollinger_Band_Range_BB,COUNTA(E$32:E155)))-Standard_Deviation_BB*IFERROR(STDEV(OFFSET(E155,1,,-MIN(Bollinger_Band_Range_BB,COUNTA(E$32:E155)))),0)),0)","v":227.76650155853986},null,null,124,{"$f":"INDEX(Data_BB[Date],MATCH(N156,Data_BB[Index],0))","v":"2022-12-28"},{"$f":"MAX(IF(N156=Data_BB[Index],Data_BB[Adj Close],0),IF(N156=Data_BB[Lag Index U],Data_BB[Adj Close],0))","v":241.009995},{"$f":"MIN(IF(N156=Data_BB[Index],Data_BB[Adj Close]),IF(N156=Data_BB[Lag Index U],Data_BB[Adj Close]))","v":234.529999},{"$f":"MAX(IF(N156=Data_BB[Index],Data_BB[Upper Bollinger Band],0),IF(N156=Data_BB[Lag Index U],Data_BB[Upper Bollinger Band],0))","v":267.65039583665725},{"$f":"MIN(IF(N156=Data_BB[Index],Data_BB[Upper Bollinger Band]),IF(N156=Data_BB[Lag Index U],Data_BB[Upper Bollinger Band]))","v":266.36628419410761},{"$f":"MAX(IF(N156=Data_BB[Index],Data_BB[Lower Bollinger Band],0),IF(N156=Data_BB[Lag Index U],Data_BB[Lower Bollinger Band],0))","v":225.62960286334274},{"$f":"MIN(IF(N156=Data_BB[Index],Data_BB[Lower Bollinger Band]),IF(N156=Data_BB[Lag Index U],Data_BB[Lower Bollinger Band]))","v":225.50071410589243}]
[null,null,null,"2022-07-01",258.30221599999999,{"$f":"IF(Data_BB[[#This Row],[Adj Close]]<E158,TRUE,\"\")","v":true},{"$f":"IF(F156=Data_BB[[#This Row],[Up]],0,1)","v":0},{"$f":"SUM($G$33:G157)","v":70},70,{"$f":"AVERAGE(OFFSET(E156,1,,-MIN(Bollinger_Band_Range_BB,COUNTA(E$32:E156)))+Standard_Deviation_BB*IFERROR(STDEV(OFFSET(E156,1,,-MIN(Bollinger_Band_Range_BB,COUNTA(E$32:E156)))),0))","v":284.54058181837581},{"$f":"IFERROR(AVERAGE(OFFSET(E156,1,,-MIN(Bollinger_Band_Range_BB,COUNTA(E$32:E156)))-Standard_Deviation_BB*IFERROR(STDEV(OFFSET(E156,1,,-MIN(Bollinger_Band_Range_BB,COUNTA(E$32:E156)))),0)),0)","v":229.12445898162417},null,null,125,{"$f":"INDEX(Data_BB[Date],MATCH(N157,Data_BB[Index],0))","v":"2022-12-29"},{"$f":"MAX(IF(N157=Data_BB[Index],Data_BB[Adj Close],0),IF(N157=Data_BB[Lag Index U],Data_BB[Adj Close],0))","v":241.009995},{"$f":"MIN(IF(N157=Data_BB[Index],Data_BB[Adj Close]),IF(N157=Data_BB[Lag Index U],Data_BB[Adj Close]))","v":222.30999800000001},{"$f":"MAX(IF(N157=Data_BB[Index],Data_BB[Upper Bollinger Band],0),IF(N157=Data_BB[Lag Index U],Data_BB[Upper Bollinger Band],0))","v":267.48246755847288},{"$f":"MIN(IF(N157=Data_BB[Index],Data_BB[Upper Bollinger Band]),IF(N157=Data_BB[Lag Index U],Data_BB[Upper Bollinger Band]))","v":263.3160212281233},{"$f":"MAX(IF(N157=Data_BB[Index],Data_BB[Lower Bollinger Band],0),IF(N157=Data_BB[Lag Index U],Data_BB[Lower Bollinger Band],0))","v":225.51997737187671},{"$f":"MIN(IF(N157=Data_BB[Index],Data_BB[Lower Bollinger Band]),IF(N157=Data_BB[Lag Index U],Data_BB[Lower Bollinger Band]))","v":216.96253224152707}]
[null,null,null,"2022-07-05",261.556152,{"$f":"IF(Data_BB[[#This Row],[Adj Close]]<E159,TRUE,\"\")","v":true},{"$f":"IF(F157=Data_BB[[#This Row],[Up]],0,1)","v":0},{"$f":"SUM($G$33:G158)","v":70},70,{"$f":"AVERAGE(OFFSET(E157,1,,-MIN(Bollinger_Band_Range_BB,COUNTA(E$32:E157)))+Standard_Deviation_BB*IFERROR(STDEV(OFFSET(E157,1,,-MIN(Bollinger_Band_Range_BB,COUNTA(E$32:E157)))),0))","v":283.13081609010499},{"$f":"IFERROR(AVERAGE(OFFSET(E157,1,,-MIN(Bollinger_Band_Range_BB,COUNTA(E$32:E157)))-Standard_Deviation_BB*IFERROR(STDEV(OFFSET(E157,1,,-MIN(Bollinger_Band_Range_BB,COUNTA(E$32:E157)))),0)),0)","v":229.82075420989494},null,null,126,{"$f":"INDEX(Data_BB[Date],MATCH(N158,Data_BB[Index],0))","v":"2023-01-05"},{"$f":"MAX(IF(N158=Data_BB[Index],Data_BB[Adj Close],0),IF(N158=Data_BB[Lag Index U],Data_BB[Adj Close],0))","v":240.35000600000001},{"$f":"MIN(IF(N158=Data_BB[Index],Data_BB[Adj Close]),IF(N158=Data_BB[Lag Index U],Data_BB[Adj Close]))","v":222.30999800000001},{"$f":"MAX(IF(N158=Data_BB[Index],Data_BB[Upper Bollinger Band],0),IF(N158=Data_BB[Lag Index U],Data_BB[Upper Bollinger Band],0))","v":269.141591788342},{"$f":"MIN(IF(N158=Data_BB[Index],Data_BB[Upper Bollinger Band]),IF(N158=Data_BB[Lag Index U],Data_BB[Upper Bollinger Band]))","v":255.65147277164027},{"$f":"MAX(IF(N158=Data_BB[Index],Data_BB[Lower Bollinger Band],0),IF(N158=Data_BB[Lag Index U],Data_BB[Lower Bollinger Band],0))","v":216.98452742835974},{"$f":"MIN(IF(N158=Data_BB[Index],Data_BB[Lower Bollinger Band]),IF(N158=Data_BB[Lag Index U],Data_BB[Lower Bollinger Band]))","v":209.78219297630412}]
[null,null,null,"2022-07-06",264.89959700000003,{"$f":"IF(Data_BB[[#This Row],[Adj Close]]<E160,TRUE,\"\")","v":true},{"$f":"IF(F158=Data_BB[[#This Row],[Up]],0,1)","v":0},{"$f":"SUM($G$33:G159)","v":70},70,{"$f":"AVERAGE(OFFSET(E158,1,,-MIN(Bollinger_Band_Range_BB,COUNTA(E$32:E158)))+Standard_Deviation_BB*IFERROR(STDEV(OFFSET(E158,1,,-MIN(Bollinger_Band_Range_BB,COUNTA(E$32:E158)))),0))","v":282.56281895248151},{"$f":"IFERROR(AVERAGE(OFFSET(E158,1,,-MIN(Bollinger_Band_Range_BB,COUNTA(E$32:E158)))-Standard_Deviation_BB*IFERROR(STDEV(OFFSET(E158,1,,-MIN(Bollinger_Band_Range_BB,COUNTA(E$32:E158)))),0)),0)","v":230.13600164751841},null,null,127,{"$f":"INDEX(Data_BB[Date],MATCH(N159,Data_BB[Index],0))","v":"2023-01-17"},{"$f":"MAX(IF(N159=Data_BB[Index],Data_BB[Adj Close],0),IF(N159=Data_BB[Lag Index U],Data_BB[Adj Close],0))","v":240.35000600000001},{"$f":"MIN(IF(N159=Data_BB[Index],Data_BB[Adj Close]),IF(N159=Data_BB[Lag Index U],Data_BB[Adj Close]))","v":231.929993},{"$f":"MAX(IF(N159=Data_BB[Index],Data_BB[Upper Bollinger Band],0),IF(N159=Data_BB[Lag Index U],Data_BB[Upper Bollinger Band],0))","v":255.65147277164027},{"$f":"MIN(IF(N159=Data_BB[Index],Data_BB[Upper Bollinger Band]),IF(N159=Data_BB[Lag Index U],Data_BB[Upper Bollinger Band]))","v":253.73917926011717},{"$f":"MAX(IF(N159=Data_BB[Index],Data_BB[Lower Bollinger Band],0),IF(N159=Data_BB[Lag Index U],Data_BB[Lower Bollinger Band],0))","v":217.46647214028604},{"$f":"MIN(IF(N159=Data_BB[Index],Data_BB[Lower Bollinger Band]),IF(N159=Data_BB[Lag Index U],Data_BB[Lower Bollinger Band]))","v":216.98452742835974}]
[null,null,null,"2022-07-07",267.07882699999999,{"$f":"IF(Data_BB[[#This Row],[Adj Close]]<E161,TRUE,\"\")","v":""},{"$f":"IF(F159=Data_BB[[#This Row],[Up]],0,1)","v":1},{"$f":"SUM($G$33:G160)","v":71},70,{"$f":"AVERAGE(OFFSET(E159,1,,-MIN(Bollinger_Band_Range_BB,COUNTA(E$32:E159)))+Standard_Deviation_BB*IFERROR(STDEV(OFFSET(E159,1,,-MIN(Bollinger_Band_Range_BB,COUNTA(E$32:E159)))),0))","v":281.39207662567134},{"$f":"IFERROR(AVERAGE(OFFSET(E159,1,,-MIN(Bollinger_Band_Range_BB,COUNTA(E$32:E159)))-Standard_Deviation_BB*IFERROR(STDEV(OFFSET(E159,1,,-MIN(Bollinger_Band_Range_BB,COUNTA(E$32:E159)))),0)),0)","v":230.8987605743288},null,null,128,{"$f":"INDEX(Data_BB[Date],MATCH(N160,Data_BB[Index],0))","v":"2023-01-19"},{"$f":"MAX(IF(N160=Data_BB[Index],Data_BB[Adj Close],0),IF(N160=Data_BB[Lag Index U],Data_BB[Adj Close],0))","v":242.58000200000001},{"$f":"MIN(IF(N160=Data_BB[Index],Data_BB[Adj Close]),IF(N160=Data_BB[Lag Index U],Data_BB[Adj Close]))","v":231.929993},{"$f":"MAX(IF(N160=Data_BB[Index],Data_BB[Upper Bollinger Band],0),IF(N160=Data_BB[Lag Index U],Data_BB[Upper Bollinger Band],0))","v":253.73917926011717},{"$f":"MIN(IF(N160=Data_BB[Index],Data_BB[Upper Bollinger Band]),IF(N160=Data_BB[Lag Index U],Data_BB[Upper Bollinger Band]))","v":252.93555661085051},{"$f":"MAX(IF(N160=Data_BB[Index],Data_BB[Lower Bollinger Band],0),IF(N160=Data_BB[Lag Index U],Data_BB[Lower Bollinger Band],0))","v":217.61744348914945},{"$f":"MIN(IF(N160=Data_BB[Index],Data_BB[Lower Bollinger Band]),IF(N160=Data_BB[Lag Index U],Data_BB[Lower Bollinger Band]))","v":217.15682013988288}]
[null,null,null,"2022-07-08",266.342468,{"$f":"IF(Data_BB[[#This Row],[Adj Close]]<E162,TRUE,\"\")","v":""},{"$f":"IF(F160=Data_BB[[#This Row],[Up]],0,1)","v":0},{"$f":"SUM($G$33:G161)","v":71},{"$f":"N(H160)","v":71},{"$f":"AVERAGE(OFFSET(E160,1,,-MIN(Bollinger_Band_Range_BB,COUNTA(E$32:E160)))+Standard_Deviation_BB*IFERROR(STDEV(OFFSET(E160,1,,-MIN(Bollinger_Band_Range_BB,COUNTA(E$32:E160)))),0))","v":280.65071062758784},{"$f":"IFERROR(AVERAGE(OFFSET(E160,1,,-MIN(Bollinger_Band_Range_BB,COUNTA(E$32:E160)))-Standard_Deviation_BB*IFERROR(STDEV(OFFSET(E160,1,,-MIN(Bollinger_Band_Range_BB,COUNTA(E$32:E160)))),0)),0)","v":231.36647847241215},null,null,129,{"$f":"INDEX(Data_BB[Date],MATCH(N161,Data_BB[Index],0))","v":"2023-01-23"},{"$f":"MAX(IF(N161=Data_BB[Index],Data_BB[Adj Close],0),IF(N161=Data_BB[Lag Index U],Data_BB[Adj Close],0))","v":242.58000200000001},{"$f":"MIN(IF(N161=Data_BB[Index],Data_BB[Adj Close]),IF(N161=Data_BB[Lag Index U],Data_BB[Adj Close]))","v":240.61000100000001},{"$f":"MAX(IF(N161=Data_BB[Index],Data_BB[Upper Bollinger Band],0),IF(N161=Data_BB[Lag Index U],Data_BB[Upper Bollinger Band],0))","v":253.90795754214659},{"$f":"MIN(IF(N161=Data_BB[Index],Data_BB[Upper Bollinger Band]),IF(N161=Data_BB[Lag Index U],Data_BB[Upper Bollinger Band]))","v":252.93555661085051},{"$f":"MAX(IF(N161=Data_BB[Index],Data_BB[Lower Bollinger Band],0),IF(N161=Data_BB[Lag Index U],Data_BB[Lower Bollinger Band],0))","v":217.61744348914945},{"$f":"MIN(IF(N161=Data_BB[Index],Data_BB[Lower Bollinger Band]),IF(N161=Data_BB[Lag Index U],Data_BB[Lower Bollinger Band]))","v":217.2180421578534}]
[null,null,null,"2022-07-11",263.20797700000003,{"$f":"IF(Data_BB[[#This Row],[Adj Close]]<E163,TRUE,\"\")","v":""},{"$f":"IF(F161=Data_BB[[#This Row],[Up]],0,1)","v":0},{"$f":"SUM($G$33:G162)","v":71},71,{"$f":"AVERAGE(OFFSET(E161,1,,-MIN(Bollinger_Band_Range_BB,COUNTA(E$32:E161)))+Standard_Deviation_BB*IFERROR(STDEV(OFFSET(E161,1,,-MIN(Bollinger_Band_Range_BB,COUNTA(E$32:E161)))),0))","v":280.59739940910839},{"$f":"IFERROR(AVERAGE(OFFSET(E161,1,,-MIN(Bollinger_Band_Range_BB,COUNTA(E$32:E161)))-Standard_Deviation_BB*IFERROR(STDEV(OFFSET(E161,1,,-MIN(Bollinger_Band_Range_BB,COUNTA(E$32:E161)))),0)),0)","v":231.39192409089165},null,null,{"$f":"N(N161)+1","v":130},{"$f":"INDEX(Data_BB[Date],MATCH(N162,Data_BB[Index],0))","v":"2023-01-25"},{"$f":"MAX(IF(N162=Data_BB[Index],Data_BB[Adj Close],0),IF(N162=Data_BB[Lag Index U],Data_BB[Adj Close],0))","v":248.16000399999999},{"$f":"MIN(IF(N162=Data_BB[Index],Data_BB[Adj Close]),IF(N162=Data_BB[Lag Index U],Data_BB[Adj Close]))","v":240.61000100000001},{"$f":"MAX(IF(N162=Data_BB[Index],Data_BB[Upper Bollinger Band],0),IF(N162=Data_BB[Lag Index U],Data_BB[Upper Bollinger Band],0))","v":258.45587345940419},{"$f":"MIN(IF(N162=Data_BB[Index],Data_BB[Upper Bollinger Band]),IF(N162=Data_BB[Lag Index U],Data_BB[Upper Bollinger Band]))","v":253.90795754214659},{"$f":"MAX(IF(N162=Data_BB[Index],Data_BB[Lower Bollinger Band],0),IF(N162=Data_BB[Lag Index U],Data_BB[Lower Bollinger Band],0))","v":217.2180421578534},{"$f":"MIN(IF(N162=Data_BB[Index],Data_BB[Lower Bollinger Band]),IF(N162=Data_BB[Lag Index U],Data_BB[Lower Bollinger Band]))","v":215.13712604059575}]
[null,null,null,"2022-07-12",252.42132599999999,{"$f":"IF(Data_BB[[#This Row],[Adj Close]]<E164,TRUE,\"\")","v":""},{"$f":"IF(F162=Data_BB[[#This Row],[Up]],0,1)","v":0},{"$f":"SUM($G$33:G163)","v":71},71,{"$f":"AVERAGE(OFFSET(E162,1,,-MIN(Bollinger_Band_Range_BB,COUNTA(E$32:E162)))+Standard_Deviation_BB*IFERROR(STDEV(OFFSET(E162,1,,-MIN(Bollinger_Band_Range_BB,COUNTA(E$32:E162)))),0))","v":280.57999848443779},{"$f":"IFERROR(AVERAGE(OFFSET(E162,1,,-MIN(Bollinger_Band_Range_BB,COUNTA(E$32:E162)))-Standard_Deviation_BB*IFERROR(STDEV(OFFSET(E162,1,,-MIN(Bollinger_Band_Range_BB,COUNTA(E$32:E162)))),0)),0)","v":231.47698861556219}]
[null,null,null,"2022-07-13",251.47601299999999,{"$f":"IF(Data_BB[[#This Row],[Adj Close]]<E165,TRUE,\"\")","v":true},{"$f":"IF(F163=Data_BB[[#This Row],[Up]],0,1)","v":1},{"$f":"SUM($G$33:G164)","v":72},71,{"$f":"AVERAGE(OFFSET(E163,1,,-MIN(Bollinger_Band_Range_BB,COUNTA(E$32:E163)))+Standard_Deviation_BB*IFERROR(STDEV(OFFSET(E163,1,,-MIN(Bollinger_Band_Range_BB,COUNTA(E$32:E163)))),0))","v":278.99891594425497},{"$f":"IFERROR(AVERAGE(OFFSET(E163,1,,-MIN(Bollinger_Band_Range_BB,COUNTA(E$32:E163)))-Standard_Deviation_BB*IFERROR(STDEV(OFFSET(E163,1,,-MIN(Bollinger_Band_Range_BB,COUNTA(E$32:E163)))),0)),0)","v":234.09892195574508}]
[null,null,null,"2022-07-14",252.82933,{"$f":"IF(Data_BB[[#This Row],[Adj Close]]<E166,TRUE,\"\")","v":true},{"$f":"IF(F164=Data_BB[[#This Row],[Up]],0,1)","v":0},{"$f":"SUM($G$33:G165)","v":72},72,{"$f":"AVERAGE(OFFSET(E164,1,,-MIN(Bollinger_Band_Range_BB,COUNTA(E$32:E164)))+Standard_Deviation_BB*IFERROR(STDEV(OFFSET(E164,1,,-MIN(Bollinger_Band_Range_BB,COUNTA(E$32:E164)))),0))","v":277.64358484059022},{"$f":"IFERROR(AVERAGE(OFFSET(E164,1,,-MIN(Bollinger_Band_Range_BB,COUNTA(E$32:E164)))-Standard_Deviation_BB*IFERROR(STDEV(OFFSET(E164,1,,-MIN(Bollinger_Band_Range_BB,COUNTA(E$32:E164)))),0)),0)","v":236.40853305940982}]
[null,null,null,"2022-07-15",255.45631399999999,{"$f":"IF(Data_BB[[#This Row],[Adj Close]]<E167,TRUE,\"\")","v":""},{"$f":"IF(F165=Data_BB[[#This Row],[Up]],0,1)","v":1},{"$f":"SUM($G$33:G166)","v":73},72,{"$f":"AVERAGE(OFFSET(E165,1,,-MIN(Bollinger_Band_Range_BB,COUNTA(E$32:E165)))+Standard_Deviation_BB*IFERROR(STDEV(OFFSET(E165,1,,-MIN(Bollinger_Band_Range_BB,COUNTA(E$32:E165)))),0))","v":277.41301381554138},{"$f":"IFERROR(AVERAGE(OFFSET(E165,1,,-MIN(Bollinger_Band_Range_BB,COUNTA(E$32:E165)))-Standard_Deviation_BB*IFERROR(STDEV(OFFSET(E165,1,,-MIN(Bollinger_Band_Range_BB,COUNTA(E$32:E165)))),0)),0)","v":237.13266178445861}]
[null,null,null,"2022-07-18",252.99847399999999,{"$f":"IF(Data_BB[[#This Row],[Adj Close]]<E168,TRUE,\"\")","v":true},{"$f":"IF(F166=Data_BB[[#This Row],[Up]],0,1)","v":1},{"$f":"SUM($G$33:G167)","v":74},73,{"$f":"AVERAGE(OFFSET(E166,1,,-MIN(Bollinger_Band_Range_BB,COUNTA(E$32:E166)))+Standard_Deviation_BB*IFERROR(STDEV(OFFSET(E166,1,,-MIN(Bollinger_Band_Range_BB,COUNTA(E$32:E166)))),0))","v":275.78507725525998},{"$f":"IFERROR(AVERAGE(OFFSET(E166,1,,-MIN(Bollinger_Band_Range_BB,COUNTA(E$32:E166)))-Standard_Deviation_BB*IFERROR(STDEV(OFFSET(E166,1,,-MIN(Bollinger_Band_Range_BB,COUNTA(E$32:E166)))),0)),0)","v":239.68402974474012}]
[null,null,null,"2022-07-19",258.25250199999999,{"$f":"IF(Data_BB[[#This Row],[Adj Close]]<E169,TRUE,\"\")","v":true},{"$f":"IF(F167=Data_BB[[#This Row],[Up]],0,1)","v":0},{"$f":"SUM($G$33:G168)","v":74},74,{"$f":"AVERAGE(OFFSET(E167,1,,-MIN(Bollinger_Band_Range_BB,COUNTA(E$32:E167)))+Standard_Deviation_BB*IFERROR(STDEV(OFFSET(E167,1,,-MIN(Bollinger_Band_Range_BB,COUNTA(E$32:E167)))),0))","v":274.51561258348329},{"$f":"IFERROR(AVERAGE(OFFSET(E167,1,,-MIN(Bollinger_Band_Range_BB,COUNTA(E$32:E167)))-Standard_Deviation_BB*IFERROR(STDEV(OFFSET(E167,1,,-MIN(Bollinger_Band_Range_BB,COUNTA(E$32:E167)))),0)),0)","v":242.13564771651676}]
[null,null,null,"2022-07-20",260.97900399999997,{"$f":"IF(Data_BB[[#This Row],[Adj Close]]<E170,TRUE,\"\")","v":true},{"$f":"IF(F168=Data_BB[[#This Row],[Up]],0,1)","v":0},{"$f":"SUM($G$33:G169)","v":74},74,{"$f":"AVERAGE(OFFSET(E168,1,,-MIN(Bollinger_Band_Range_BB,COUNTA(E$32:E168)))+Standard_Deviation_BB*IFERROR(STDEV(OFFSET(E168,1,,-MIN(Bollinger_Band_Range_BB,COUNTA(E$32:E168)))),0))","v":274.48592863735337},{"$f":"IFERROR(AVERAGE(OFFSET(E168,1,,-MIN(Bollinger_Band_Range_BB,COUNTA(E$32:E168)))-Standard_Deviation_BB*IFERROR(STDEV(OFFSET(E168,1,,-MIN(Bollinger_Band_Range_BB,COUNTA(E$32:E168)))),0)),0)","v":243.01413236264662}]
[null,null,null,"2022-07-21",263.53634599999998,{"$f":"IF(Data_BB[[#This Row],[Adj Close]]<E171,TRUE,\"\")","v":""},{"$f":"IF(F169=Data_BB[[#This Row],[Up]],0,1)","v":1},{"$f":"SUM($G$33:G170)","v":75},74,{"$f":"AVERAGE(OFFSET(E169,1,,-MIN(Bollinger_Band_Range_BB,COUNTA(E$32:E169)))+Standard_Deviation_BB*IFERROR(STDEV(OFFSET(E169,1,,-MIN(Bollinger_Band_Range_BB,COUNTA(E$32:E169)))),0))","v":274.59448509487464},{"$f":"IFERROR(AVERAGE(OFFSET(E169,1,,-MIN(Bollinger_Band_Range_BB,COUNTA(E$32:E169)))-Standard_Deviation_BB*IFERROR(STDEV(OFFSET(E169,1,,-MIN(Bollinger_Band_Range_BB,COUNTA(E$32:E169)))),0)),0)","v":244.07081020512533}]
[null,null,null,"2022-07-22",259.07839999999999,{"$f":"IF(Data_BB[[#This Row],[Adj Close]]<E172,TRUE,\"\")","v":""},{"$f":"IF(F170=Data_BB[[#This Row],[Up]],0,1)","v":0},{"$f":"SUM($G$33:G171)","v":75},75,{"$f":"AVERAGE(OFFSET(E170,1,,-MIN(Bollinger_Band_Range_BB,COUNTA(E$32:E170)))+Standard_Deviation_BB*IFERROR(STDEV(OFFSET(E170,1,,-MIN(Bollinger_Band_Range_BB,COUNTA(E$32:E170)))),0))","v":274.62095891534307},{"$f":"IFERROR(AVERAGE(OFFSET(E170,1,,-MIN(Bollinger_Band_Range_BB,COUNTA(E$32:E170)))-Standard_Deviation_BB*IFERROR(STDEV(OFFSET(E170,1,,-MIN(Bollinger_Band_Range_BB,COUNTA(E$32:E170)))),0)),0)","v":244.1935978846569}]
[null,null,null,"2022-07-25",257.55590799999999,{"$f":"IF(Data_BB[[#This Row],[Adj Close]]<E173,TRUE,\"\")","v":""},{"$f":"IF(F171=Data_BB[[#This Row],[Up]],0,1)","v":0},{"$f":"SUM($G$33:G172)","v":75},75,{"$f":"AVERAGE(OFFSET(E171,1,,-MIN(Bollinger_Band_Range_BB,COUNTA(E$32:E171)))+Standard_Deviation_BB*IFERROR(STDEV(OFFSET(E171,1,,-MIN(Bollinger_Band_Range_BB,COUNTA(E$32:E171)))),0))","v":273.39472915163458},{"$f":"IFERROR(AVERAGE(OFFSET(E171,1,,-MIN(Bollinger_Band_Range_BB,COUNTA(E$32:E171)))-Standard_Deviation_BB*IFERROR(STDEV(OFFSET(E171,1,,-MIN(Bollinger_Band_Range_BB,COUNTA(E$32:E171)))),0)),0)","v":244.53718904836532}]
[null,null,null,"2022-07-26",250.660034,{"$f":"IF(Data_BB[[#This Row],[Adj Close]]<E174,TRUE,\"\")","v":true},{"$f":"IF(F172=Data_BB[[#This Row],[Up]],0,1)","v":1},{"$f":"SUM($G$33:G173)","v":76},75,{"$f":"AVERAGE(OFFSET(E172,1,,-MIN(Bollinger_Band_Range_BB,COUNTA(E$32:E172)))+Standard_Deviation_BB*IFERROR(STDEV(OFFSET(E172,1,,-MIN(Bollinger_Band_Range_BB,COUNTA(E$32:E172)))),0))","v":273.37952384254663},{"$f":"IFERROR(AVERAGE(OFFSET(E172,1,,-MIN(Bollinger_Band_Range_BB,COUNTA(E$32:E172)))-Standard_Deviation_BB*IFERROR(STDEV(OFFSET(E172,1,,-MIN(Bollinger_Band_Range_BB,COUNTA(E$32:E172)))),0)),0)","v":243.25978565745336}]
[null,null,null,"2022-07-27",267.417145,{"$f":"IF(Data_BB[[#This Row],[Adj Close]]<E175,TRUE,\"\")","v":true},{"$f":"IF(F173=Data_BB[[#This Row],[Up]],0,1)","v":0},{"$f":"SUM($G$33:G174)","v":76},76,{"$f":"AVERAGE(OFFSET(E173,1,,-MIN(Bollinger_Band_Range_BB,COUNTA(E$32:E173)))+Standard_Deviation_BB*IFERROR(STDEV(OFFSET(E173,1,,-MIN(Bollinger_Band_Range_BB,COUNTA(E$32:E173)))),0))","v":274.98953896849838},{"$f":"IFERROR(AVERAGE(OFFSET(E173,1,,-MIN(Bollinger_Band_Range_BB,COUNTA(E$32:E173)))-Standard_Deviation_BB*IFERROR(STDEV(OFFSET(E173,1,,-MIN(Bollinger_Band_Range_BB,COUNTA(E$32:E173)))),0)),0)","v":242.86973363150165}]
[null,null,null,"2022-07-28",275.04940800000003,{"$f":"IF(Data_BB[[#This Row],[Adj Close]]<E176,TRUE,\"\")","v":true},{"$f":"IF(F174=Data_BB[[#This Row],[Up]],0,1)","v":0},{"$f":"SUM($G$33:G175)","v":76},76,{"$f":"AVERAGE(OFFSET(E174,1,,-MIN(Bollinger_Band_Range_BB,COUNTA(E$32:E174)))+Standard_Deviation_BB*IFERROR(STDEV(OFFSET(E174,1,,-MIN(Bollinger_Band_Range_BB,COUNTA(E$32:E174)))),0))","v":279.09518731797044},{"$f":"IFERROR(AVERAGE(OFFSET(E174,1,,-MIN(Bollinger_Band_Range_BB,COUNTA(E$32:E174)))-Standard_Deviation_BB*IFERROR(STDEV(OFFSET(E174,1,,-MIN(Bollinger_Band_Range_BB,COUNTA(E$32:E174)))),0)),0)","v":240.37113488202959}]
[null,null,null,"2022-07-29",279.358093,{"$f":"IF(Data_BB[[#This Row],[Adj Close]]<E177,TRUE,\"\")","v":""},{"$f":"IF(F175=Data_BB[[#This Row],[Up]],0,1)","v":1},{"$f":"SUM($G$33:G176)","v":77},76,{"$f":"AVERAGE(OFFSET(E175,1,,-MIN(Bollinger_Band_Range_BB,COUNTA(E$32:E175)))+Standard_Deviation_BB*IFERROR(STDEV(OFFSET(E175,1,,-MIN(Bollinger_Band_Range_BB,COUNTA(E$32:E175)))),0))","v":284.06771798318618},{"$f":"IFERROR(AVERAGE(OFFSET(E175,1,,-MIN(Bollinger_Band_Range_BB,COUNTA(E$32:E175)))-Standard_Deviation_BB*IFERROR(STDEV(OFFSET(E175,1,,-MIN(Bollinger_Band_Range_BB,COUNTA(E$32:E175)))),0)),0)","v":237.77783541681379}]
[null,null,null,"2022-08-01",276.64154100000002,{"$f":"IF(Data_BB[[#This Row],[Adj Close]]<E178,TRUE,\"\")","v":""},{"$f":"IF(F176=Data_BB[[#This Row],[Up]],0,1)","v":0},{"$f":"SUM($G$33:G177)","v":77},77,{"$f":"AVERAGE(OFFSET(E176,1,,-MIN(Bollinger_Band_Range_BB,COUNTA(E$32:E176)))+Standard_Deviation_BB*IFERROR(STDEV(OFFSET(E176,1,,-MIN(Bollinger_Band_Range_BB,COUNTA(E$32:E176)))),0))","v":287.16773751916219},{"$f":"IFERROR(AVERAGE(OFFSET(E176,1,,-MIN(Bollinger_Band_Range_BB,COUNTA(E$32:E176)))-Standard_Deviation_BB*IFERROR(STDEV(OFFSET(E176,1,,-MIN(Bollinger_Band_Range_BB,COUNTA(E$32:E176)))),0)),0)","v":236.5117483808379}]
[null,null,null,"2022-08-02",273.46722399999999,{"$f":"IF(Data_BB[[#This Row],[Adj Close]]<E179,TRUE,\"\")","v":true},{"$f":"IF(F177=Data_BB[[#This Row],[Up]],0,1)","v":1},{"$f":"SUM($G$33:G178)","v":78},77,{"$f":"AVERAGE(OFFSET(E177,1,,-MIN(Bollinger_Band_Range_BB,COUNTA(E$32:E177)))+Standard_Deviation_BB*IFERROR(STDEV(OFFSET(E177,1,,-MIN(Bollinger_Band_Range_BB,COUNTA(E$32:E177)))),0))","v":288.93341640227015},{"$f":"IFERROR(AVERAGE(OFFSET(E177,1,,-MIN(Bollinger_Band_Range_BB,COUNTA(E$32:E177)))-Standard_Deviation_BB*IFERROR(STDEV(OFFSET(E177,1,,-MIN(Bollinger_Band_Range_BB,COUNTA(E$32:E177)))),0)),0)","v":235.93717669772985}]
[null,null,null,"2022-08-03",281.07955900000002,{"$f":"IF(Data_BB[[#This Row],[Adj Close]]<E180,TRUE,\"\")","v":true},{"$f":"IF(F178=Data_BB[[#This Row],[Up]],0,1)","v":0},{"$f":"SUM($G$33:G179)","v":78},78,{"$f":"AVERAGE(OFFSET(E178,1,,-MIN(Bollinger_Band_Range_BB,COUNTA(E$32:E178)))+Standard_Deviation_BB*IFERROR(STDEV(OFFSET(E178,1,,-MIN(Bollinger_Band_Range_BB,COUNTA(E$32:E178)))),0))","v":292.53132468947138},{"$f":"IFERROR(AVERAGE(OFFSET(E178,1,,-MIN(Bollinger_Band_Range_BB,COUNTA(E$32:E178)))-Standard_Deviation_BB*IFERROR(STDEV(OFFSET(E178,1,,-MIN(Bollinger_Band_Range_BB,COUNTA(E$32:E178)))),0)),0)","v":233.95726461052863}]
[null,null,null,"2022-08-04",282.25375400000001,{"$f":"IF(Data_BB[[#This Row],[Adj Close]]<E181,TRUE,\"\")","v":""},{"$f":"IF(F179=Data_BB[[#This Row],[Up]],0,1)","v":1},{"$f":"SUM($G$33:G180)","v":79},78,{"$f":"AVERAGE(OFFSET(E179,1,,-MIN(Bollinger_Band_Range_BB,COUNTA(E$32:E179)))+Standard_Deviation_BB*IFERROR(STDEV(OFFSET(E179,1,,-MIN(Bollinger_Band_Range_BB,COUNTA(E$32:E179)))),0))","v":295.88534950437537},{"$f":"IFERROR(AVERAGE(OFFSET(E179,1,,-MIN(Bollinger_Band_Range_BB,COUNTA(E$32:E179)))-Standard_Deviation_BB*IFERROR(STDEV(OFFSET(E179,1,,-MIN(Bollinger_Band_Range_BB,COUNTA(E$32:E179)))),0)),0)","v":232.12073249562474}]
[null,null,null,"2022-08-05",281.51739500000002,{"$f":"IF(Data_BB[[#This Row],[Adj Close]]<E182,TRUE,\"\")","v":""},{"$f":"IF(F180=Data_BB[[#This Row],[Up]],0,1)","v":0},{"$f":"SUM($G$33:G181)","v":79},79,{"$f":"AVERAGE(OFFSET(E180,1,,-MIN(Bollinger_Band_Range_BB,COUNTA(E$32:E180)))+Standard_Deviation_BB*IFERROR(STDEV(OFFSET(E180,1,,-MIN(Bollinger_Band_Range_BB,COUNTA(E$32:E180)))),0))","v":298.72852194948189},{"$f":"IFERROR(AVERAGE(OFFSET(E180,1,,-MIN(Bollinger_Band_Range_BB,COUNTA(E$32:E180)))-Standard_Deviation_BB*IFERROR(STDEV(OFFSET(E180,1,,-MIN(Bollinger_Band_Range_BB,COUNTA(E$32:E180)))),0)),0)","v":230.79505275051821}]
[null,null,null,"2022-08-08",278.940155,{"$f":"IF(Data_BB[[#This Row],[Adj Close]]<E183,TRUE,\"\")","v":true},{"$f":"IF(F181=Data_BB[[#This Row],[Up]],0,1)","v":1},{"$f":"SUM($G$33:G182)","v":80},79,{"$f":"AVERAGE(OFFSET(E181,1,,-MIN(Bollinger_Band_Range_BB,COUNTA(E$32:E181)))+Standard_Deviation_BB*IFERROR(STDEV(OFFSET(E181,1,,-MIN(Bollinger_Band_Range_BB,COUNTA(E$32:E181)))),0))","v":300.78979873279576},{"$f":"IFERROR(AVERAGE(OFFSET(E181,1,,-MIN(Bollinger_Band_Range_BB,COUNTA(E$32:E181)))-Standard_Deviation_BB*IFERROR(STDEV(OFFSET(E181,1,,-MIN(Bollinger_Band_Range_BB,COUNTA(E$32:E181)))),0)),0)","v":230.30699376720423}]
[null,null,null,"2022-08-09",280.91039999999998,{"$f":"IF(Data_BB[[#This Row],[Adj Close]]<E184,TRUE,\"\")","v":true},{"$f":"IF(F182=Data_BB[[#This Row],[Up]],0,1)","v":0},{"$f":"SUM($G$33:G183)","v":80},80,{"$f":"AVERAGE(OFFSET(E182,1,,-MIN(Bollinger_Band_Range_BB,COUNTA(E$32:E182)))+Standard_Deviation_BB*IFERROR(STDEV(OFFSET(E182,1,,-MIN(Bollinger_Band_Range_BB,COUNTA(E$32:E182)))),0))","v":302.36908889762725},{"$f":"IFERROR(AVERAGE(OFFSET(E182,1,,-MIN(Bollinger_Band_Range_BB,COUNTA(E$32:E182)))-Standard_Deviation_BB*IFERROR(STDEV(OFFSET(E182,1,,-MIN(Bollinger_Band_Range_BB,COUNTA(E$32:E182)))),0)),0)","v":231.57661100237274}]
[null,null,null,"2022-08-10",287.73663299999998,{"$f":"IF(Data_BB[[#This Row],[Adj Close]]<E185,TRUE,\"\")","v":""},{"$f":"IF(F183=Data_BB[[#This Row],[Up]],0,1)","v":1},{"$f":"SUM($G$33:G184)","v":81},80,{"$f":"AVERAGE(OFFSET(E183,1,,-MIN(Bollinger_Band_Range_BB,COUNTA(E$32:E183)))+Standard_Deviation_BB*IFERROR(STDEV(OFFSET(E183,1,,-MIN(Bollinger_Band_Range_BB,COUNTA(E$32:E183)))),0))","v":305.01043704963263},{"$f":"IFERROR(AVERAGE(OFFSET(E183,1,,-MIN(Bollinger_Band_Range_BB,COUNTA(E$32:E183)))-Standard_Deviation_BB*IFERROR(STDEV(OFFSET(E183,1,,-MIN(Bollinger_Band_Range_BB,COUNTA(E$32:E183)))),0)),0)","v":232.56132485036733}]
[null,null,null,"2022-08-11",285.607147,{"$f":"IF(Data_BB[[#This Row],[Adj Close]]<E186,TRUE,\"\")","v":true},{"$f":"IF(F184=Data_BB[[#This Row],[Up]],0,1)","v":1},{"$f":"SUM($G$33:G185)","v":82},81,{"$f":"AVERAGE(OFFSET(E184,1,,-MIN(Bollinger_Band_Range_BB,COUNTA(E$32:E184)))+Standard_Deviation_BB*IFERROR(STDEV(OFFSET(E184,1,,-MIN(Bollinger_Band_Range_BB,COUNTA(E$32:E184)))),0))","v":306.48303511177096},{"$f":"IFERROR(AVERAGE(OFFSET(E184,1,,-MIN(Bollinger_Band_Range_BB,COUNTA(E$32:E184)))-Standard_Deviation_BB*IFERROR(STDEV(OFFSET(E184,1,,-MIN(Bollinger_Band_Range_BB,COUNTA(E$32:E184)))),0)),0)","v":234.36650848822896}]
[null,null,null,"2022-08-12",290.47311400000001,{"$f":"IF(Data_BB[[#This Row],[Adj Close]]<E187,TRUE,\"\")","v":true},{"$f":"IF(F185=Data_BB[[#This Row],[Up]],0,1)","v":0},{"$f":"SUM($G$33:G186)","v":82},82,{"$f":"AVERAGE(OFFSET(E185,1,,-MIN(Bollinger_Band_Range_BB,COUNTA(E$32:E185)))+Standard_Deviation_BB*IFERROR(STDEV(OFFSET(E185,1,,-MIN(Bollinger_Band_Range_BB,COUNTA(E$32:E185)))),0))","v":308.99159877767943},{"$f":"IFERROR(AVERAGE(OFFSET(E185,1,,-MIN(Bollinger_Band_Range_BB,COUNTA(E$32:E185)))-Standard_Deviation_BB*IFERROR(STDEV(OFFSET(E185,1,,-MIN(Bollinger_Band_Range_BB,COUNTA(E$32:E185)))),0)),0)","v":235.35962482232063}]
[null,null,null,"2022-08-15",292.02545199999997,{"$f":"IF(Data_BB[[#This Row],[Adj Close]]<E188,TRUE,\"\")","v":""},{"$f":"IF(F186=Data_BB[[#This Row],[Up]],0,1)","v":1},{"$f":"SUM($G$33:G187)","v":83},82,{"$f":"AVERAGE(OFFSET(E186,1,,-MIN(Bollinger_Band_Range_BB,COUNTA(E$32:E186)))+Standard_Deviation_BB*IFERROR(STDEV(OFFSET(E186,1,,-MIN(Bollinger_Band_Range_BB,COUNTA(E$32:E186)))),0))","v":310.62051143971075},{"$f":"IFERROR(AVERAGE(OFFSET(E186,1,,-MIN(Bollinger_Band_Range_BB,COUNTA(E$32:E186)))-Standard_Deviation_BB*IFERROR(STDEV(OFFSET(E186,1,,-MIN(Bollinger_Band_Range_BB,COUNTA(E$32:E186)))),0)),0)","v":237.63340996028927}]
[null,null,null,"2022-08-16",291.26916499999999,{"$f":"IF(Data_BB[[#This Row],[Adj Close]]<E189,TRUE,\"\")","v":""},{"$f":"IF(F187=Data_BB[[#This Row],[Up]],0,1)","v":0},{"$f":"SUM($G$33:G188)","v":83},83,{"$f":"AVERAGE(OFFSET(E187,1,,-MIN(Bollinger_Band_Range_BB,COUNTA(E$32:E187)))+Standard_Deviation_BB*IFERROR(STDEV(OFFSET(E187,1,,-MIN(Bollinger_Band_Range_BB,COUNTA(E$32:E187)))),0))","v":312.18916513151362},{"$f":"IFERROR(AVERAGE(OFFSET(E187,1,,-MIN(Bollinger_Band_Range_BB,COUNTA(E$32:E187)))-Standard_Deviation_BB*IFERROR(STDEV(OFFSET(E187,1,,-MIN(Bollinger_Band_Range_BB,COUNTA(E$32:E187)))),0)),0)","v":239.36642256848646}]
[null,null,null,"2022-08-17",290.50134300000002,{"$f":"IF(Data_BB[[#This Row],[Adj Close]]<E190,TRUE,\"\")","v":""},{"$f":"IF(F188=Data_BB[[#This Row],[Up]],0,1)","v":0},{"$f":"SUM($G$33:G189)","v":83},83,{"$f":"AVERAGE(OFFSET(E188,1,,-MIN(Bollinger_Band_Range_BB,COUNTA(E$32:E188)))+Standard_Deviation_BB*IFERROR(STDEV(OFFSET(E188,1,,-MIN(Bollinger_Band_Range_BB,COUNTA(E$32:E188)))),0))","v":313.36614364160715},{"$f":"IFERROR(AVERAGE(OFFSET(E188,1,,-MIN(Bollinger_Band_Range_BB,COUNTA(E$32:E188)))-Standard_Deviation_BB*IFERROR(STDEV(OFFSET(E188,1,,-MIN(Bollinger_Band_Range_BB,COUNTA(E$32:E188)))),0)),0)","v":241.14167795839293}]
[null,null,null,"2022-08-18",289.35455300000001,{"$f":"IF(Data_BB[[#This Row],[Adj Close]]<E191,TRUE,\"\")","v":""},{"$f":"IF(F189=Data_BB[[#This Row],[Up]],0,1)","v":0},{"$f":"SUM($G$33:G190)","v":83},83,{"$f":"AVERAGE(OFFSET(E189,1,,-MIN(Bollinger_Band_Range_BB,COUNTA(E$32:E189)))+Standard_Deviation_BB*IFERROR(STDEV(OFFSET(E189,1,,-MIN(Bollinger_Band_Range_BB,COUNTA(E$32:E189)))),0))","v":314.16127104408679},{"$f":"IFERROR(AVERAGE(OFFSET(E189,1,,-MIN(Bollinger_Band_Range_BB,COUNTA(E$32:E189)))-Standard_Deviation_BB*IFERROR(STDEV(OFFSET(E189,1,,-MIN(Bollinger_Band_Range_BB,COUNTA(E$32:E189)))),0)),0)","v":242.92837125591328}]
[null,null,null,"2022-08-19",285.34585600000003,{"$f":"IF(Data_BB[[#This Row],[Adj Close]]<E192,TRUE,\"\")","v":""},{"$f":"IF(F190=Data_BB[[#This Row],[Up]],0,1)","v":0},{"$f":"SUM($G$33:G191)","v":83},83,{"$f":"AVERAGE(OFFSET(E190,1,,-MIN(Bollinger_Band_Range_BB,COUNTA(E$32:E190)))+Standard_Deviation_BB*IFERROR(STDEV(OFFSET(E190,1,,-MIN(Bollinger_Band_Range_BB,COUNTA(E$32:E190)))),0))","v":312.94295002138443},{"$f":"IFERROR(AVERAGE(OFFSET(E190,1,,-MIN(Bollinger_Band_Range_BB,COUNTA(E$32:E190)))-Standard_Deviation_BB*IFERROR(STDEV(OFFSET(E190,1,,-MIN(Bollinger_Band_Range_BB,COUNTA(E$32:E190)))),0)),0)","v":246.7734378786156}]
[null,null,null,"2022-08-22",276.96945199999999,{"$f":"IF(Data_BB[[#This Row],[Adj Close]]<E193,TRUE,\"\")","v":""},{"$f":"IF(F191=Data_BB[[#This Row],[Up]],0,1)","v":0},{"$f":"SUM($G$33:G192)","v":83},83,{"$f":"AVERAGE(OFFSET(E191,1,,-MIN(Bollinger_Band_Range_BB,COUNTA(E$32:E191)))+Standard_Deviation_BB*IFERROR(STDEV(OFFSET(E191,1,,-MIN(Bollinger_Band_Range_BB,COUNTA(E$32:E191)))),0))","v":310.05250783792798},{"$f":"IFERROR(AVERAGE(OFFSET(E191,1,,-MIN(Bollinger_Band_Range_BB,COUNTA(E$32:E191)))-Standard_Deviation_BB*IFERROR(STDEV(OFFSET(E191,1,,-MIN(Bollinger_Band_Range_BB,COUNTA(E$32:E191)))),0)),0)","v":251.60523446207199}]
[null,null,null,"2022-08-23",275.66314699999998,{"$f":"IF(Data_BB[[#This Row],[Adj Close]]<E194,TRUE,\"\")","v":""},{"$f":"IF(F192=Data_BB[[#This Row],[Up]],0,1)","v":0},{"$f":"SUM($G$33:G193)","v":83},83,{"$f":"AVERAGE(OFFSET(E192,1,,-MIN(Bollinger_Band_Range_BB,COUNTA(E$32:E192)))+Standard_Deviation_BB*IFERROR(STDEV(OFFSET(E192,1,,-MIN(Bollinger_Band_Range_BB,COUNTA(E$32:E192)))),0))","v":302.5906558203842},{"$f":"IFERROR(AVERAGE(OFFSET(E192,1,,-MIN(Bollinger_Band_Range_BB,COUNTA(E$32:E192)))-Standard_Deviation_BB*IFERROR(STDEV(OFFSET(E192,1,,-MIN(Bollinger_Band_Range_BB,COUNTA(E$32:E192)))),0)),0)","v":261.56739777961582}]
[null,null,null,"2022-08-24",275.01498400000003,{"$f":"IF(Data_BB[[#This Row],[Adj Close]]<E195,TRUE,\"\")","v":true},{"$f":"IF(F193=Data_BB[[#This Row],[Up]],0,1)","v":1},{"$f":"SUM($G$33:G194)","v":84},83,{"$f":"AVERAGE(OFFSET(E193,1,,-MIN(Bollinger_Band_Range_BB,COUNTA(E$32:E193)))+Standard_Deviation_BB*IFERROR(STDEV(OFFSET(E193,1,,-MIN(Bollinger_Band_Range_BB,COUNTA(E$32:E193)))),0))","v":300.92966897032846},{"$f":"IFERROR(AVERAGE(OFFSET(E193,1,,-MIN(Bollinger_Band_Range_BB,COUNTA(E$32:E193)))-Standard_Deviation_BB*IFERROR(STDEV(OFFSET(E193,1,,-MIN(Bollinger_Band_Range_BB,COUNTA(E$32:E193)))),0)),0)","v":263.9881685296715}]
[null,null,null,"2022-08-25",278.06637599999999,{"$f":"IF(Data_BB[[#This Row],[Adj Close]]<E196,TRUE,\"\")","v":""},{"$f":"IF(F194=Data_BB[[#This Row],[Up]],0,1)","v":1},{"$f":"SUM($G$33:G195)","v":85},84,{"$f":"AVERAGE(OFFSET(E194,1,,-MIN(Bollinger_Band_Range_BB,COUNTA(E$32:E194)))+Standard_Deviation_BB*IFERROR(STDEV(OFFSET(E194,1,,-MIN(Bollinger_Band_Range_BB,COUNTA(E$32:E194)))),0))","v":300.61217920692428},{"$f":"IFERROR(AVERAGE(OFFSET(E194,1,,-MIN(Bollinger_Band_Range_BB,COUNTA(E$32:E194)))-Standard_Deviation_BB*IFERROR(STDEV(OFFSET(E194,1,,-MIN(Bollinger_Band_Range_BB,COUNTA(E$32:E194)))),0)),0)","v":264.60735509307568}]
[null,null,null,"2022-08-26",267.33660900000001,{"$f":"IF(Data_BB[[#This Row],[Adj Close]]<E197,TRUE,\"\")","v":""},{"$f":"IF(F195=Data_BB[[#This Row],[Up]],0,1)","v":0},{"$f":"SUM($G$33:G196)","v":85},85,{"$f":"AVERAGE(OFFSET(E195,1,,-MIN(Bollinger_Band_Range_BB,COUNTA(E$32:E195)))+Standard_Deviation_BB*IFERROR(STDEV(OFFSET(E195,1,,-MIN(Bollinger_Band_Range_BB,COUNTA(E$32:E195)))),0))","v":302.6521339861535},{"$f":"IFERROR(AVERAGE(OFFSET(E195,1,,-MIN(Bollinger_Band_Range_BB,COUNTA(E$32:E195)))-Standard_Deviation_BB*IFERROR(STDEV(OFFSET(E195,1,,-MIN(Bollinger_Band_Range_BB,COUNTA(E$32:E195)))),0)),0)","v":261.36525191384652}]
[null,null,null,"2022-08-29",264.48464999999999,{"$f":"IF(Data_BB[[#This Row],[Adj Close]]<E198,TRUE,\"\")","v":""},{"$f":"IF(F196=Data_BB[[#This Row],[Up]],0,1)","v":0},{"$f":"SUM($G$33:G197)","v":85},85,{"$f":"AVERAGE(OFFSET(E196,1,,-MIN(Bollinger_Band_Range_BB,COUNTA(E$32:E196)))+Standard_Deviation_BB*IFERROR(STDEV(OFFSET(E196,1,,-MIN(Bollinger_Band_Range_BB,COUNTA(E$32:E196)))),0))","v":304.94805501757844},{"$f":"IFERROR(AVERAGE(OFFSET(E196,1,,-MIN(Bollinger_Band_Range_BB,COUNTA(E$32:E196)))-Standard_Deviation_BB*IFERROR(STDEV(OFFSET(E196,1,,-MIN(Bollinger_Band_Range_BB,COUNTA(E$32:E196)))),0)),0)","v":257.85364178242156}]
[null,null,null,"2022-08-30",262.23098800000002,{"$f":"IF(Data_BB[[#This Row],[Adj Close]]<E199,TRUE,\"\")","v":""},{"$f":"IF(F197=Data_BB[[#This Row],[Up]],0,1)","v":0},{"$f":"SUM($G$33:G198)","v":85},85,{"$f":"AVERAGE(OFFSET(E197,1,,-MIN(Bollinger_Band_Range_BB,COUNTA(E$32:E197)))+Standard_Deviation_BB*IFERROR(STDEV(OFFSET(E197,1,,-MIN(Bollinger_Band_Range_BB,COUNTA(E$32:E197)))),0))","v":307.21586491307687},{"$f":"IFERROR(AVERAGE(OFFSET(E197,1,,-MIN(Bollinger_Band_Range_BB,COUNTA(E$32:E197)))-Standard_Deviation_BB*IFERROR(STDEV(OFFSET(E197,1,,-MIN(Bollinger_Band_Range_BB,COUNTA(E$32:E197)))),0)),0)","v":254.46220828692316}]
[null,null,null,"2022-08-31",260.73519900000002,{"$f":"IF(Data_BB[[#This Row],[Adj Close]]<E200,TRUE,\"\")","v":""},{"$f":"IF(F198=Data_BB[[#This Row],[Up]],0,1)","v":0},{"$f":"SUM($G$33:G199)","v":85},85,{"$f":"AVERAGE(OFFSET(E198,1,,-MIN(Bollinger_Band_Range_BB,COUNTA(E$32:E198)))+Standard_Deviation_BB*IFERROR(STDEV(OFFSET(E198,1,,-MIN(Bollinger_Band_Range_BB,COUNTA(E$32:E198)))),0))","v":309.44196682769262},{"$f":"IFERROR(AVERAGE(OFFSET(E198,1,,-MIN(Bollinger_Band_Range_BB,COUNTA(E$32:E198)))-Standard_Deviation_BB*IFERROR(STDEV(OFFSET(E198,1,,-MIN(Bollinger_Band_Range_BB,COUNTA(E$32:E198)))),0)),0)","v":250.2016703723074}]
[null,null,null,"2022-09-01",259.66821299999998,{"$f":"IF(Data_BB[[#This Row],[Adj Close]]<E201,TRUE,\"\")","v":""},{"$f":"IF(F199=Data_BB[[#This Row],[Up]],0,1)","v":0},{"$f":"SUM($G$33:G200)","v":85},85,{"$f":"AVERAGE(OFFSET(E199,1,,-MIN(Bollinger_Band_Range_BB,COUNTA(E$32:E199)))+Standard_Deviation_BB*IFERROR(STDEV(OFFSET(E199,1,,-MIN(Bollinger_Band_Range_BB,COUNTA(E$32:E199)))),0))","v":311.1712341779338},{"$f":"IFERROR(AVERAGE(OFFSET(E199,1,,-MIN(Bollinger_Band_Range_BB,COUNTA(E$32:E199)))-Standard_Deviation_BB*IFERROR(STDEV(OFFSET(E199,1,,-MIN(Bollinger_Band_Range_BB,COUNTA(E$32:E199)))),0)),0)","v":246.21384892206621}]
[null,null,null,"2022-09-02",255.340408,{"$f":"IF(Data_BB[[#This Row],[Adj Close]]<E202,TRUE,\"\")","v":""},{"$f":"IF(F200=Data_BB[[#This Row],[Up]],0,1)","v":0},{"$f":"SUM($G$33:G201)","v":85},85,{"$f":"AVERAGE(OFFSET(E200,1,,-MIN(Bollinger_Band_Range_BB,COUNTA(E$32:E200)))+Standard_Deviation_BB*IFERROR(STDEV(OFFSET(E200,1,,-MIN(Bollinger_Band_Range_BB,COUNTA(E$32:E200)))),0))","v":313.34432091113683},{"$f":"IFERROR(AVERAGE(OFFSET(E200,1,,-MIN(Bollinger_Band_Range_BB,COUNTA(E$32:E200)))-Standard_Deviation_BB*IFERROR(STDEV(OFFSET(E200,1,,-MIN(Bollinger_Band_Range_BB,COUNTA(E$32:E200)))),0)),0)","v":241.42306348886319}]
[null,null,null,"2022-09-06",252.53829999999999,{"$f":"IF(Data_BB[[#This Row],[Adj Close]]<E203,TRUE,\"\")","v":true},{"$f":"IF(F201=Data_BB[[#This Row],[Up]],0,1)","v":1},{"$f":"SUM($G$33:G202)","v":86},85,{"$f":"AVERAGE(OFFSET(E201,1,,-MIN(Bollinger_Band_Range_BB,COUNTA(E$32:E201)))+Standard_Deviation_BB*IFERROR(STDEV(OFFSET(E201,1,,-MIN(Bollinger_Band_Range_BB,COUNTA(E$32:E201)))),0))","v":315.66047059597793},{"$f":"IFERROR(AVERAGE(OFFSET(E201,1,,-MIN(Bollinger_Band_Range_BB,COUNTA(E$32:E201)))-Standard_Deviation_BB*IFERROR(STDEV(OFFSET(E201,1,,-MIN(Bollinger_Band_Range_BB,COUNTA(E$32:E201)))),0)),0)","v":236.46672830402204}]
[null,null,null,"2022-09-07",257.36471599999999,{"$f":"IF(Data_BB[[#This Row],[Adj Close]]<E204,TRUE,\"\")","v":true},{"$f":"IF(F202=Data_BB[[#This Row],[Up]],0,1)","v":0},{"$f":"SUM($G$33:G203)","v":86},86,{"$f":"AVERAGE(OFFSET(E202,1,,-MIN(Bollinger_Band_Range_BB,COUNTA(E$32:E202)))+Standard_Deviation_BB*IFERROR(STDEV(OFFSET(E202,1,,-MIN(Bollinger_Band_Range_BB,COUNTA(E$32:E202)))),0))","v":316.22971867663767},{"$f":"IFERROR(AVERAGE(OFFSET(E202,1,,-MIN(Bollinger_Band_Range_BB,COUNTA(E$32:E202)))-Standard_Deviation_BB*IFERROR(STDEV(OFFSET(E202,1,,-MIN(Bollinger_Band_Range_BB,COUNTA(E$32:E202)))),0)),0)","v":233.54291182336223}]
[null,null,null,"2022-09-08",257.79348800000002,{"$f":"IF(Data_BB[[#This Row],[Adj Close]]<E205,TRUE,\"\")","v":true},{"$f":"IF(F203=Data_BB[[#This Row],[Up]],0,1)","v":0},{"$f":"SUM($G$33:G204)","v":86},86,{"$f":"AVERAGE(OFFSET(E203,1,,-MIN(Bollinger_Band_Range_BB,COUNTA(E$32:E203)))+Standard_Deviation_BB*IFERROR(STDEV(OFFSET(E203,1,,-MIN(Bollinger_Band_Range_BB,COUNTA(E$32:E203)))),0))","v":315.20083066857495},{"$f":"IFERROR(AVERAGE(OFFSET(E203,1,,-MIN(Bollinger_Band_Range_BB,COUNTA(E$32:E203)))-Standard_Deviation_BB*IFERROR(STDEV(OFFSET(E203,1,,-MIN(Bollinger_Band_Range_BB,COUNTA(E$32:E203)))),0)),0)","v":231.57748533142507}]
[null,null,null,"2022-09-09",263.71679699999999,{"$f":"IF(Data_BB[[#This Row],[Adj Close]]<E206,TRUE,\"\")","v":true},{"$f":"IF(F204=Data_BB[[#This Row],[Up]],0,1)","v":0},{"$f":"SUM($G$33:G205)","v":86},86,{"$f":"AVERAGE(OFFSET(E204,1,,-MIN(Bollinger_Band_Range_BB,COUNTA(E$32:E204)))+Standard_Deviation_BB*IFERROR(STDEV(OFFSET(E204,1,,-MIN(Bollinger_Band_Range_BB,COUNTA(E$32:E204)))),0))","v":313.65248003186338},{"$f":"IFERROR(AVERAGE(OFFSET(E204,1,,-MIN(Bollinger_Band_Range_BB,COUNTA(E$32:E204)))-Standard_Deviation_BB*IFERROR(STDEV(OFFSET(E204,1,,-MIN(Bollinger_Band_Range_BB,COUNTA(E$32:E204)))),0)),0)","v":230.93680096813665}]
[null,null,null,"2022-09-12",265.90063500000002,{"$f":"IF(Data_BB[[#This Row],[Adj Close]]<E207,TRUE,\"\")","v":""},{"$f":"IF(F205=Data_BB[[#This Row],[Up]],0,1)","v":1},{"$f":"SUM($G$33:G206)","v":87},86,{"$f":"AVERAGE(OFFSET(E205,1,,-MIN(Bollinger_Band_Range_BB,COUNTA(E$32:E205)))+Standard_Deviation_BB*IFERROR(STDEV(OFFSET(E205,1,,-MIN(Bollinger_Band_Range_BB,COUNTA(E$32:E205)))),0))","v":310.55023829284568},{"$f":"IFERROR(AVERAGE(OFFSET(E205,1,,-MIN(Bollinger_Band_Range_BB,COUNTA(E$32:E205)))-Standard_Deviation_BB*IFERROR(STDEV(OFFSET(E205,1,,-MIN(Bollinger_Band_Range_BB,COUNTA(E$32:E205)))),0)),0)","v":231.58179480715435}]
[null,null,null,"2022-09-13",251.28185999999999,{"$f":"IF(Data_BB[[#This Row],[Adj Close]]<E208,TRUE,\"\")","v":true},{"$f":"IF(F206=Data_BB[[#This Row],[Up]],0,1)","v":1},{"$f":"SUM($G$33:G207)","v":88},87,{"$f":"AVERAGE(OFFSET(E206,1,,-MIN(Bollinger_Band_Range_BB,COUNTA(E$32:E206)))+Standard_Deviation_BB*IFERROR(STDEV(OFFSET(E206,1,,-MIN(Bollinger_Band_Range_BB,COUNTA(E$32:E206)))),0))","v":307.71998083002921},{"$f":"IFERROR(AVERAGE(OFFSET(E206,1,,-MIN(Bollinger_Band_Range_BB,COUNTA(E$32:E206)))-Standard_Deviation_BB*IFERROR(STDEV(OFFSET(E206,1,,-MIN(Bollinger_Band_Range_BB,COUNTA(E$32:E206)))),0)),0)","v":230.33769306997073}]
[null,null,null,"2022-09-14",251.5112,{"$f":"IF(Data_BB[[#This Row],[Adj Close]]<E209,TRUE,\"\")","v":""},{"$f":"IF(F207=Data_BB[[#This Row],[Up]],0,1)","v":1},{"$f":"SUM($G$33:G208)","v":89},88,{"$f":"AVERAGE(OFFSET(E207,1,,-MIN(Bollinger_Band_Range_BB,COUNTA(E$32:E207)))+Standard_Deviation_BB*IFERROR(STDEV(OFFSET(E207,1,,-MIN(Bollinger_Band_Range_BB,COUNTA(E$32:E207)))),0))","v":304.06290464882096},{"$f":"IFERROR(AVERAGE(OFFSET(E207,1,,-MIN(Bollinger_Band_Range_BB,COUNTA(E$32:E207)))-Standard_Deviation_BB*IFERROR(STDEV(OFFSET(E207,1,,-MIN(Bollinger_Band_Range_BB,COUNTA(E$32:E207)))),0)),0)","v":230.01897275117904}]
[null,null,null,"2022-09-15",244.69042999999999,{"$f":"IF(Data_BB[[#This Row],[Adj Close]]<E210,TRUE,\"\")","v":""},{"$f":"IF(F208=Data_BB[[#This Row],[Up]],0,1)","v":0},{"$f":"SUM($G$33:G209)","v":89},89,{"$f":"AVERAGE(OFFSET(E208,1,,-MIN(Bollinger_Band_Range_BB,COUNTA(E$32:E208)))+Standard_Deviation_BB*IFERROR(STDEV(OFFSET(E208,1,,-MIN(Bollinger_Band_Range_BB,COUNTA(E$32:E208)))),0))","v":300.76201210128983},{"$f":"IFERROR(AVERAGE(OFFSET(E208,1,,-MIN(Bollinger_Band_Range_BB,COUNTA(E$32:E208)))-Standard_Deviation_BB*IFERROR(STDEV(OFFSET(E208,1,,-MIN(Bollinger_Band_Range_BB,COUNTA(E$32:E208)))),0)),0)","v":228.73877399871017}]
[null,null,null,"2022-09-16",244.05223100000001,{"$f":"IF(Data_BB[[#This Row],[Adj Close]]<E211,TRUE,\"\")","v":""},{"$f":"IF(F209=Data_BB[[#This Row],[Up]],0,1)","v":0},{"$f":"SUM($G$33:G210)","v":89},89,{"$f":"AVERAGE(OFFSET(E209,1,,-MIN(Bollinger_Band_Range_BB,COUNTA(E$32:E209)))+Standard_Deviation_BB*IFERROR(STDEV(OFFSET(E209,1,,-MIN(Bollinger_Band_Range_BB,COUNTA(E$32:E209)))),0))","v":296.6087410839117},{"$f":"IFERROR(AVERAGE(OFFSET(E209,1,,-MIN(Bollinger_Band_Range_BB,COUNTA(E$32:E209)))-Standard_Deviation_BB*IFERROR(STDEV(OFFSET(E209,1,,-MIN(Bollinger_Band_Range_BB,COUNTA(E$32:E209)))),0)),0)","v":228.36181281608833}]
[null,null,null,"2022-09-19",243.83284,{"$f":"IF(Data_BB[[#This Row],[Adj Close]]<E212,TRUE,\"\")","v":""},{"$f":"IF(F210=Data_BB[[#This Row],[Up]],0,1)","v":0},{"$f":"SUM($G$33:G211)","v":89},89,{"$f":"AVERAGE(OFFSET(E210,1,,-MIN(Bollinger_Band_Range_BB,COUNTA(E$32:E210)))+Standard_Deviation_BB*IFERROR(STDEV(OFFSET(E210,1,,-MIN(Bollinger_Band_Range_BB,COUNTA(E$32:E210)))),0))","v":292.67176994985118},{"$f":"IFERROR(AVERAGE(OFFSET(E210,1,,-MIN(Bollinger_Band_Range_BB,COUNTA(E$32:E210)))-Standard_Deviation_BB*IFERROR(STDEV(OFFSET(E210,1,,-MIN(Bollinger_Band_Range_BB,COUNTA(E$32:E210)))),0)),0)","v":228.14748235014878}]
[null,null,null,"2022-09-20",241.76866100000001,{"$f":"IF(Data_BB[[#This Row],[Adj Close]]<E213,TRUE,\"\")","v":""},{"$f":"IF(F211=Data_BB[[#This Row],[Up]],0,1)","v":0},{"$f":"SUM($G$33:G212)","v":89},89,{"$f":"AVERAGE(OFFSET(E211,1,,-MIN(Bollinger_Band_Range_BB,COUNTA(E$32:E211)))+Standard_Deviation_BB*IFERROR(STDEV(OFFSET(E211,1,,-MIN(Bollinger_Band_Range_BB,COUNTA(E$32:E211)))),0))","v":290.99460103352379},{"$f":"IFERROR(AVERAGE(OFFSET(E211,1,,-MIN(Bollinger_Band_Range_BB,COUNTA(E$32:E211)))-Standard_Deviation_BB*IFERROR(STDEV(OFFSET(E211,1,,-MIN(Bollinger_Band_Range_BB,COUNTA(E$32:E211)))),0)),0)","v":226.30457216647619}]
[null,null,null,"2022-09-21",238.27848800000001,{"$f":"IF(Data_BB[[#This Row],[Adj Close]]<E214,TRUE,\"\")","v":true},{"$f":"IF(F212=Data_BB[[#This Row],[Up]],0,1)","v":1},{"$f":"SUM($G$33:G213)","v":90},89,{"$f":"AVERAGE(OFFSET(E212,1,,-MIN(Bollinger_Band_Range_BB,COUNTA(E$32:E212)))+Standard_Deviation_BB*IFERROR(STDEV(OFFSET(E212,1,,-MIN(Bollinger_Band_Range_BB,COUNTA(E$32:E212)))),0))","v":289.5302490083904},{"$f":"IFERROR(AVERAGE(OFFSET(E212,1,,-MIN(Bollinger_Band_Range_BB,COUNTA(E$32:E212)))-Standard_Deviation_BB*IFERROR(STDEV(OFFSET(E212,1,,-MIN(Bollinger_Band_Range_BB,COUNTA(E$32:E212)))),0)),0)","v":224.03045829160965}]
[null,null,null,"2022-09-22",240.30278000000001,{"$f":"IF(Data_BB[[#This Row],[Adj Close]]<E215,TRUE,\"\")","v":""},{"$f":"IF(F213=Data_BB[[#This Row],[Up]],0,1)","v":1},{"$f":"SUM($G$33:G214)","v":91},90,{"$f":"AVERAGE(OFFSET(E213,1,,-MIN(Bollinger_Band_Range_BB,COUNTA(E$32:E213)))+Standard_Deviation_BB*IFERROR(STDEV(OFFSET(E213,1,,-MIN(Bollinger_Band_Range_BB,COUNTA(E$32:E213)))),0))","v":286.90580182959656},{"$f":"IFERROR(AVERAGE(OFFSET(E213,1,,-MIN(Bollinger_Band_Range_BB,COUNTA(E$32:E213)))-Standard_Deviation_BB*IFERROR(STDEV(OFFSET(E213,1,,-MIN(Bollinger_Band_Range_BB,COUNTA(E$32:E213)))),0)),0)","v":223.18368507040341}]
[null,null,null,"2022-09-23",237.25138899999999,{"$f":"IF(Data_BB[[#This Row],[Adj Close]]<E216,TRUE,\"\")","v":""},{"$f":"IF(F214=Data_BB[[#This Row],[Up]],0,1)","v":0},{"$f":"SUM($G$33:G215)","v":91},91,{"$f":"AVERAGE(OFFSET(E214,1,,-MIN(Bollinger_Band_Range_BB,COUNTA(E$32:E214)))+Standard_Deviation_BB*IFERROR(STDEV(OFFSET(E214,1,,-MIN(Bollinger_Band_Range_BB,COUNTA(E$32:E214)))),0))","v":282.57749435776424},{"$f":"IFERROR(AVERAGE(OFFSET(E214,1,,-MIN(Bollinger_Band_Range_BB,COUNTA(E$32:E214)))-Standard_Deviation_BB*IFERROR(STDEV(OFFSET(E214,1,,-MIN(Bollinger_Band_Range_BB,COUNTA(E$32:E214)))),0)),0)","v":223.43049384223568}]
[null,null,null,"2022-09-26",236.78270000000001,{"$f":"IF(Data_BB[[#This Row],[Adj Close]]<E217,TRUE,\"\")","v":""},{"$f":"IF(F215=Data_BB[[#This Row],[Up]],0,1)","v":0},{"$f":"SUM($G$33:G216)","v":91},91,{"$f":"AVERAGE(OFFSET(E215,1,,-MIN(Bollinger_Band_Range_BB,COUNTA(E$32:E215)))+Standard_Deviation_BB*IFERROR(STDEV(OFFSET(E215,1,,-MIN(Bollinger_Band_Range_BB,COUNTA(E$32:E215)))),0))","v":281.13799787223422},{"$f":"IFERROR(AVERAGE(OFFSET(E215,1,,-MIN(Bollinger_Band_Range_BB,COUNTA(E$32:E215)))-Standard_Deviation_BB*IFERROR(STDEV(OFFSET(E215,1,,-MIN(Bollinger_Band_Range_BB,COUNTA(E$32:E215)))),0)),0)","v":221.81459942776573}]
[null,null,null,"2022-09-27",235.74563599999999,{"$f":"IF(Data_BB[[#This Row],[Adj Close]]<E218,TRUE,\"\")","v":true},{"$f":"IF(F216=Data_BB[[#This Row],[Up]],0,1)","v":1},{"$f":"SUM($G$33:G217)","v":92},91,{"$f":"AVERAGE(OFFSET(E216,1,,-MIN(Bollinger_Band_Range_BB,COUNTA(E$32:E216)))+Standard_Deviation_BB*IFERROR(STDEV(OFFSET(E216,1,,-MIN(Bollinger_Band_Range_BB,COUNTA(E$32:E216)))),0))","v":279.9945527352171},{"$f":"IFERROR(AVERAGE(OFFSET(E216,1,,-MIN(Bollinger_Band_Range_BB,COUNTA(E$32:E216)))-Standard_Deviation_BB*IFERROR(STDEV(OFFSET(E216,1,,-MIN(Bollinger_Band_Range_BB,COUNTA(E$32:E216)))),0)),0)","v":220.08414316478292}]
[null,null,null,"2022-09-28",240.39254800000001,{"$f":"IF(Data_BB[[#This Row],[Adj Close]]<E219,TRUE,\"\")","v":""},{"$f":"IF(F217=Data_BB[[#This Row],[Up]],0,1)","v":1},{"$f":"SUM($G$33:G218)","v":93},92,{"$f":"AVERAGE(OFFSET(E217,1,,-MIN(Bollinger_Band_Range_BB,COUNTA(E$32:E217)))+Standard_Deviation_BB*IFERROR(STDEV(OFFSET(E217,1,,-MIN(Bollinger_Band_Range_BB,COUNTA(E$32:E217)))),0))","v":278.26796005381391},{"$f":"IFERROR(AVERAGE(OFFSET(E217,1,,-MIN(Bollinger_Band_Range_BB,COUNTA(E$32:E217)))-Standard_Deviation_BB*IFERROR(STDEV(OFFSET(E217,1,,-MIN(Bollinger_Band_Range_BB,COUNTA(E$32:E217)))),0)),0)","v":219.62689184618608}]
[null,null,null,"2022-09-29",236.83256499999999,{"$f":"IF(Data_BB[[#This Row],[Adj Close]]<E220,TRUE,\"\")","v":""},{"$f":"IF(F218=Data_BB[[#This Row],[Up]],0,1)","v":0},{"$f":"SUM($G$33:G219)","v":93},93,{"$f":"AVERAGE(OFFSET(E218,1,,-MIN(Bollinger_Band_Range_BB,COUNTA(E$32:E218)))+Standard_Deviation_BB*IFERROR(STDEV(OFFSET(E218,1,,-MIN(Bollinger_Band_Range_BB,COUNTA(E$32:E218)))),0))","v":276.90474642030739},{"$f":"IFERROR(AVERAGE(OFFSET(E218,1,,-MIN(Bollinger_Band_Range_BB,COUNTA(E$32:E218)))-Standard_Deviation_BB*IFERROR(STDEV(OFFSET(E218,1,,-MIN(Bollinger_Band_Range_BB,COUNTA(E$32:E218)))),0)),0)","v":218.59984207969273}]
[null,null,null,"2022-09-30",232.24548300000001,{"$f":"IF(Data_BB[[#This Row],[Adj Close]]<E221,TRUE,\"\")","v":true},{"$f":"IF(F219=Data_BB[[#This Row],[Up]],0,1)","v":1},{"$f":"SUM($G$33:G220)","v":94},93,{"$f":"AVERAGE(OFFSET(E219,1,,-MIN(Bollinger_Band_Range_BB,COUNTA(E$32:E219)))+Standard_Deviation_BB*IFERROR(STDEV(OFFSET(E219,1,,-MIN(Bollinger_Band_Range_BB,COUNTA(E$32:E219)))),0))","v":276.02402305683495},{"$f":"IFERROR(AVERAGE(OFFSET(E219,1,,-MIN(Bollinger_Band_Range_BB,COUNTA(E$32:E219)))-Standard_Deviation_BB*IFERROR(STDEV(OFFSET(E219,1,,-MIN(Bollinger_Band_Range_BB,COUNTA(E$32:E219)))),0)),0)","v":216.73829244316508}]
[null,null,null,"2022-10-03",240.06346099999999,{"$f":"IF(Data_BB[[#This Row],[Adj Close]]<E222,TRUE,\"\")","v":true},{"$f":"IF(F220=Data_BB[[#This Row],[Up]],0,1)","v":0},{"$f":"SUM($G$33:G221)","v":94},94,{"$f":"AVERAGE(OFFSET(E220,1,,-MIN(Bollinger_Band_Range_BB,COUNTA(E$32:E220)))+Standard_Deviation_BB*IFERROR(STDEV(OFFSET(E220,1,,-MIN(Bollinger_Band_Range_BB,COUNTA(E$32:E220)))),0))","v":274.84155470943307},{"$f":"IFERROR(AVERAGE(OFFSET(E220,1,,-MIN(Bollinger_Band_Range_BB,COUNTA(E$32:E220)))-Standard_Deviation_BB*IFERROR(STDEV(OFFSET(E220,1,,-MIN(Bollinger_Band_Range_BB,COUNTA(E$32:E220)))),0)),0)","v":216.39306609056695}]
[null,null,null,"2022-10-04",248.180588,{"$f":"IF(Data_BB[[#This Row],[Adj Close]]<E223,TRUE,\"\")","v":true},{"$f":"IF(F221=Data_BB[[#This Row],[Up]],0,1)","v":0},{"$f":"SUM($G$33:G222)","v":94},94,{"$f":"AVERAGE(OFFSET(E221,1,,-MIN(Bollinger_Band_Range_BB,COUNTA(E$32:E221)))+Standard_Deviation_BB*IFERROR(STDEV(OFFSET(E221,1,,-MIN(Bollinger_Band_Range_BB,COUNTA(E$32:E221)))),0))","v":274.27899321468391},{"$f":"IFERROR(AVERAGE(OFFSET(E221,1,,-MIN(Bollinger_Band_Range_BB,COUNTA(E$32:E221)))-Standard_Deviation_BB*IFERROR(STDEV(OFFSET(E221,1,,-MIN(Bollinger_Band_Range_BB,COUNTA(E$32:E221)))),0)),0)","v":216.51985638531619}]
[null,null,null,"2022-10-05",248.49968000000001,{"$f":"IF(Data_BB[[#This Row],[Adj Close]]<E224,TRUE,\"\")","v":""},{"$f":"IF(F222=Data_BB[[#This Row],[Up]],0,1)","v":1},{"$f":"SUM($G$33:G223)","v":95},94,{"$f":"AVERAGE(OFFSET(E222,1,,-MIN(Bollinger_Band_Range_BB,COUNTA(E$32:E222)))+Standard_Deviation_BB*IFERROR(STDEV(OFFSET(E222,1,,-MIN(Bollinger_Band_Range_BB,COUNTA(E$32:E222)))),0))","v":272.68530026179167},{"$f":"IFERROR(AVERAGE(OFFSET(E222,1,,-MIN(Bollinger_Band_Range_BB,COUNTA(E$32:E222)))-Standard_Deviation_BB*IFERROR(STDEV(OFFSET(E222,1,,-MIN(Bollinger_Band_Range_BB,COUNTA(E$32:E222)))),0)),0)","v":217.22704573820843}]
[null,null,null,"2022-10-06",246.096451,{"$f":"IF(Data_BB[[#This Row],[Adj Close]]<E225,TRUE,\"\")","v":""},{"$f":"IF(F223=Data_BB[[#This Row],[Up]],0,1)","v":0},{"$f":"SUM($G$33:G224)","v":95},95,{"$f":"AVERAGE(OFFSET(E223,1,,-MIN(Bollinger_Band_Range_BB,COUNTA(E$32:E223)))+Standard_Deviation_BB*IFERROR(STDEV(OFFSET(E223,1,,-MIN(Bollinger_Band_Range_BB,COUNTA(E$32:E223)))),0))","v":270.60523689331916},{"$f":"IFERROR(AVERAGE(OFFSET(E223,1,,-MIN(Bollinger_Band_Range_BB,COUNTA(E$32:E223)))-Standard_Deviation_BB*IFERROR(STDEV(OFFSET(E223,1,,-MIN(Bollinger_Band_Range_BB,COUNTA(E$32:E223)))),0)),0)","v":218.13740540668078}]
[null,null,null,"2022-10-07",233.58174099999999,{"$f":"IF(Data_BB[[#This Row],[Adj Close]]<E226,TRUE,\"\")","v":""},{"$f":"IF(F224=Data_BB[[#This Row],[Up]],0,1)","v":0},{"$f":"SUM($G$33:G225)","v":95},{"$f":"N(H224)","v":95},{"$f":"AVERAGE(OFFSET(E224,1,,-MIN(Bollinger_Band_Range_BB,COUNTA(E$32:E224)))+Standard_Deviation_BB*IFERROR(STDEV(OFFSET(E224,1,,-MIN(Bollinger_Band_Range_BB,COUNTA(E$32:E224)))),0))","v":266.20078606187161},{"$f":"IFERROR(AVERAGE(OFFSET(E224,1,,-MIN(Bollinger_Band_Range_BB,COUNTA(E$32:E224)))-Standard_Deviation_BB*IFERROR(STDEV(OFFSET(E224,1,,-MIN(Bollinger_Band_Range_BB,COUNTA(E$32:E224)))),0)),0)","v":219.5283506381285}]
[null,null,null,"2022-10-10",228.60575900000001,{"$f":"IF(Data_BB[[#This Row],[Adj Close]]<E227,TRUE,\"\")","v":""},{"$f":"IF(F225=Data_BB[[#This Row],[Up]],0,1)","v":0},{"$f":"SUM($G$33:G226)","v":95},95,{"$f":"AVERAGE(OFFSET(E225,1,,-MIN(Bollinger_Band_Range_BB,COUNTA(E$32:E225)))+Standard_Deviation_BB*IFERROR(STDEV(OFFSET(E225,1,,-MIN(Bollinger_Band_Range_BB,COUNTA(E$32:E225)))),0))","v":259.8830851433267},{"$f":"IFERROR(AVERAGE(OFFSET(E225,1,,-MIN(Bollinger_Band_Range_BB,COUNTA(E$32:E225)))-Standard_Deviation_BB*IFERROR(STDEV(OFFSET(E225,1,,-MIN(Bollinger_Band_Range_BB,COUNTA(E$32:E225)))),0)),0)","v":222.11656395667336}]
[null,null,null,"2022-10-11",224.77654999999999,{"$f":"IF(Data_BB[[#This Row],[Adj Close]]<E228,TRUE,\"\")","v":true},{"$f":"IF(F226=Data_BB[[#This Row],[Up]],0,1)","v":1},{"$f":"SUM($G$33:G227)","v":96},95,{"$f":"AVERAGE(OFFSET(E226,1,,-MIN(Bollinger_Band_Range_BB,COUNTA(E$32:E226)))+Standard_Deviation_BB*IFERROR(STDEV(OFFSET(E226,1,,-MIN(Bollinger_Band_Range_BB,COUNTA(E$32:E226)))),0))","v":260.03461202151186},{"$f":"IFERROR(AVERAGE(OFFSET(E226,1,,-MIN(Bollinger_Band_Range_BB,COUNTA(E$32:E226)))-Standard_Deviation_BB*IFERROR(STDEV(OFFSET(E226,1,,-MIN(Bollinger_Band_Range_BB,COUNTA(E$32:E226)))),0)),0)","v":219.31450607848825}]
[null,null,null,"2022-10-12",225.11558500000001,{"$f":"IF(Data_BB[[#This Row],[Adj Close]]<E229,TRUE,\"\")","v":true},{"$f":"IF(F227=Data_BB[[#This Row],[Up]],0,1)","v":0},{"$f":"SUM($G$33:G228)","v":96},96,{"$f":"AVERAGE(OFFSET(E227,1,,-MIN(Bollinger_Band_Range_BB,COUNTA(E$32:E227)))+Standard_Deviation_BB*IFERROR(STDEV(OFFSET(E227,1,,-MIN(Bollinger_Band_Range_BB,COUNTA(E$32:E227)))),0))","v":259.14102687888919},{"$f":"IFERROR(AVERAGE(OFFSET(E227,1,,-MIN(Bollinger_Band_Range_BB,COUNTA(E$32:E227)))-Standard_Deviation_BB*IFERROR(STDEV(OFFSET(E227,1,,-MIN(Bollinger_Band_Range_BB,COUNTA(E$32:E227)))),0)),0)","v":217.56852972111082}]
[null,null,null,"2022-10-13",233.58174099999999,{"$f":"IF(Data_BB[[#This Row],[Adj Close]]<E230,TRUE,\"\")","v":""},{"$f":"IF(F228=Data_BB[[#This Row],[Up]],0,1)","v":1},{"$f":"SUM($G$33:G229)","v":97},96,{"$f":"AVERAGE(OFFSET(E228,1,,-MIN(Bollinger_Band_Range_BB,COUNTA(E$32:E228)))+Standard_Deviation_BB*IFERROR(STDEV(OFFSET(E228,1,,-MIN(Bollinger_Band_Range_BB,COUNTA(E$32:E228)))),0))","v":258.31575032208821},{"$f":"IFERROR(AVERAGE(OFFSET(E228,1,,-MIN(Bollinger_Band_Range_BB,COUNTA(E$32:E228)))-Standard_Deviation_BB*IFERROR(STDEV(OFFSET(E228,1,,-MIN(Bollinger_Band_Range_BB,COUNTA(E$32:E228)))),0)),0)","v":217.28293737791174}]
[null,null,null,"2022-10-14",227.91769400000001,{"$f":"IF(Data_BB[[#This Row],[Adj Close]]<E231,TRUE,\"\")","v":true},{"$f":"IF(F229=Data_BB[[#This Row],[Up]],0,1)","v":1},{"$f":"SUM($G$33:G230)","v":98},97,{"$f":"AVERAGE(OFFSET(E229,1,,-MIN(Bollinger_Band_Range_BB,COUNTA(E$32:E229)))+Standard_Deviation_BB*IFERROR(STDEV(OFFSET(E229,1,,-MIN(Bollinger_Band_Range_BB,COUNTA(E$32:E229)))),0))","v":258.02808320724313},{"$f":"IFERROR(AVERAGE(OFFSET(E229,1,,-MIN(Bollinger_Band_Range_BB,COUNTA(E$32:E229)))-Standard_Deviation_BB*IFERROR(STDEV(OFFSET(E229,1,,-MIN(Bollinger_Band_Range_BB,COUNTA(E$32:E229)))),0)),0)","v":215.95715079275683}]
[null,null,null,"2022-10-17",236.86248800000001,{"$f":"IF(Data_BB[[#This Row],[Adj Close]]<E232,TRUE,\"\")","v":true},{"$f":"IF(F230=Data_BB[[#This Row],[Up]],0,1)","v":0},{"$f":"SUM($G$33:G231)","v":98},98,{"$f":"AVERAGE(OFFSET(E230,1,,-MIN(Bollinger_Band_Range_BB,COUNTA(E$32:E230)))+Standard_Deviation_BB*IFERROR(STDEV(OFFSET(E230,1,,-MIN(Bollinger_Band_Range_BB,COUNTA(E$32:E230)))),0))","v":257.11810970988438},{"$f":"IFERROR(AVERAGE(OFFSET(E230,1,,-MIN(Bollinger_Band_Range_BB,COUNTA(E$32:E230)))-Standard_Deviation_BB*IFERROR(STDEV(OFFSET(E230,1,,-MIN(Bollinger_Band_Range_BB,COUNTA(E$32:E230)))),0)),0)","v":216.17008909011571}]
[null,null,null,"2022-10-18",237.829758,{"$f":"IF(Data_BB[[#This Row],[Adj Close]]<E233,TRUE,\"\")","v":""},{"$f":"IF(F231=Data_BB[[#This Row],[Up]],0,1)","v":1},{"$f":"SUM($G$33:G232)","v":99},98,{"$f":"AVERAGE(OFFSET(E231,1,,-MIN(Bollinger_Band_Range_BB,COUNTA(E$32:E231)))+Standard_Deviation_BB*IFERROR(STDEV(OFFSET(E231,1,,-MIN(Bollinger_Band_Range_BB,COUNTA(E$32:E231)))),0))","v":256.62248706163996},{"$f":"IFERROR(AVERAGE(OFFSET(E231,1,,-MIN(Bollinger_Band_Range_BB,COUNTA(E$32:E231)))-Standard_Deviation_BB*IFERROR(STDEV(OFFSET(E231,1,,-MIN(Bollinger_Band_Range_BB,COUNTA(E$32:E231)))),0)),0)","v":216.27182143836004}]
[null,null,null,"2022-10-19",235.81542999999999,{"$f":"IF(Data_BB[[#This Row],[Adj Close]]<E234,TRUE,\"\")","v":""},{"$f":"IF(F232=Data_BB[[#This Row],[Up]],0,1)","v":0},{"$f":"SUM($G$33:G233)","v":99},99,{"$f":"AVERAGE(OFFSET(E232,1,,-MIN(Bollinger_Band_Range_BB,COUNTA(E$32:E232)))+Standard_Deviation_BB*IFERROR(STDEV(OFFSET(E232,1,,-MIN(Bollinger_Band_Range_BB,COUNTA(E$32:E232)))),0))","v":256.46105107713043},{"$f":"IFERROR(AVERAGE(OFFSET(E232,1,,-MIN(Bollinger_Band_Range_BB,COUNTA(E$32:E232)))-Standard_Deviation_BB*IFERROR(STDEV(OFFSET(E232,1,,-MIN(Bollinger_Band_Range_BB,COUNTA(E$32:E232)))),0)),0)","v":216.18695162286963}]
[null,null,null,"2022-10-20",235.48635899999999,{"$f":"IF(Data_BB[[#This Row],[Adj Close]]<E235,TRUE,\"\")","v":true},{"$f":"IF(F233=Data_BB[[#This Row],[Up]],0,1)","v":1},{"$f":"SUM($G$33:G234)","v":100},99,{"$f":"AVERAGE(OFFSET(E233,1,,-MIN(Bollinger_Band_Range_BB,COUNTA(E$32:E233)))+Standard_Deviation_BB*IFERROR(STDEV(OFFSET(E233,1,,-MIN(Bollinger_Band_Range_BB,COUNTA(E$32:E233)))),0))","v":256.02772748902635},{"$f":"IFERROR(AVERAGE(OFFSET(E233,1,,-MIN(Bollinger_Band_Range_BB,COUNTA(E$32:E233)))-Standard_Deviation_BB*IFERROR(STDEV(OFFSET(E233,1,,-MIN(Bollinger_Band_Range_BB,COUNTA(E$32:E233)))),0)),0)","v":216.13863311097367}]
[null,null,null,"2022-10-21",241.43957499999999,{"$f":"IF(Data_BB[[#This Row],[Adj Close]]<E236,TRUE,\"\")","v":true},{"$f":"IF(F234=Data_BB[[#This Row],[Up]],0,1)","v":0},{"$f":"SUM($G$33:G235)","v":100},100,{"$f":"AVERAGE(OFFSET(E234,1,,-MIN(Bollinger_Band_Range_BB,COUNTA(E$32:E234)))+Standard_Deviation_BB*IFERROR(STDEV(OFFSET(E234,1,,-MIN(Bollinger_Band_Range_BB,COUNTA(E$32:E234)))),0))","v":256.54878703577231},{"$f":"IFERROR(AVERAGE(OFFSET(E234,1,,-MIN(Bollinger_Band_Range_BB,COUNTA(E$32:E234)))-Standard_Deviation_BB*IFERROR(STDEV(OFFSET(E234,1,,-MIN(Bollinger_Band_Range_BB,COUNTA(E$32:E234)))),0)),0)","v":216.03639216422766}]
[null,null,null,"2022-10-24",246.55517599999999,{"$f":"IF(Data_BB[[#This Row],[Adj Close]]<E237,TRUE,\"\")","v":true},{"$f":"IF(F235=Data_BB[[#This Row],[Up]],0,1)","v":0},{"$f":"SUM($G$33:G236)","v":100},100,{"$f":"AVERAGE(OFFSET(E235,1,,-MIN(Bollinger_Band_Range_BB,COUNTA(E$32:E235)))+Standard_Deviation_BB*IFERROR(STDEV(OFFSET(E235,1,,-MIN(Bollinger_Band_Range_BB,COUNTA(E$32:E235)))),0))","v":258.17809686720705},{"$f":"IFERROR(AVERAGE(OFFSET(E235,1,,-MIN(Bollinger_Band_Range_BB,COUNTA(E$32:E235)))-Standard_Deviation_BB*IFERROR(STDEV(OFFSET(E235,1,,-MIN(Bollinger_Band_Range_BB,COUNTA(E$32:E235)))),0)),0)","v":215.38432993279292}]
[null,null,null,"2022-10-25",249.95558199999999,{"$f":"IF(Data_BB[[#This Row],[Adj Close]]<E238,TRUE,\"\")","v":""},{"$f":"IF(F236=Data_BB[[#This Row],[Up]],0,1)","v":1},{"$f":"SUM($G$33:G237)","v":101},100,{"$f":"AVERAGE(OFFSET(E236,1,,-MIN(Bollinger_Band_Range_BB,COUNTA(E$32:E236)))+Standard_Deviation_BB*IFERROR(STDEV(OFFSET(E236,1,,-MIN(Bollinger_Band_Range_BB,COUNTA(E$32:E236)))),0))","v":260.61638967108115},{"$f":"IFERROR(AVERAGE(OFFSET(E236,1,,-MIN(Bollinger_Band_Range_BB,COUNTA(E$32:E236)))-Standard_Deviation_BB*IFERROR(STDEV(OFFSET(E236,1,,-MIN(Bollinger_Band_Range_BB,COUNTA(E$32:E236)))),0)),0)","v":214.36703172891885}]
[null,null,null,"2022-10-26",230.669937,{"$f":"IF(Data_BB[[#This Row],[Adj Close]]<E239,TRUE,\"\")","v":""},{"$f":"IF(F237=Data_BB[[#This Row],[Up]],0,1)","v":0},{"$f":"SUM($G$33:G238)","v":101},101,{"$f":"AVERAGE(OFFSET(E237,1,,-MIN(Bollinger_Band_Range_BB,COUNTA(E$32:E237)))+Standard_Deviation_BB*IFERROR(STDEV(OFFSET(E237,1,,-MIN(Bollinger_Band_Range_BB,COUNTA(E$32:E237)))),0))","v":260.46979961065335},{"$f":"IFERROR(AVERAGE(OFFSET(E237,1,,-MIN(Bollinger_Band_Range_BB,COUNTA(E$32:E237)))-Standard_Deviation_BB*IFERROR(STDEV(OFFSET(E237,1,,-MIN(Bollinger_Band_Range_BB,COUNTA(E$32:E237)))),0)),0)","v":213.54136068934662}]
[null,null,null,"2022-10-27",226.11277799999999,{"$f":"IF(Data_BB[[#This Row],[Adj Close]]<E240,TRUE,\"\")","v":true},{"$f":"IF(F238=Data_BB[[#This Row],[Up]],0,1)","v":1},{"$f":"SUM($G$33:G239)","v":102},101,{"$f":"AVERAGE(OFFSET(E238,1,,-MIN(Bollinger_Band_Range_BB,COUNTA(E$32:E238)))+Standard_Deviation_BB*IFERROR(STDEV(OFFSET(E238,1,,-MIN(Bollinger_Band_Range_BB,COUNTA(E$32:E238)))),0))","v":261.04677311247514},{"$f":"IFERROR(AVERAGE(OFFSET(E238,1,,-MIN(Bollinger_Band_Range_BB,COUNTA(E$32:E238)))-Standard_Deviation_BB*IFERROR(STDEV(OFFSET(E238,1,,-MIN(Bollinger_Band_Range_BB,COUNTA(E$32:E238)))),0)),0)","v":211.89240848752485}]
[null,null,null,"2022-10-28",235.20713799999999,{"$f":"IF(Data_BB[[#This Row],[Adj Close]]<E241,TRUE,\"\")","v":""},{"$f":"IF(F239=Data_BB[[#This Row],[Up]],0,1)","v":1},{"$f":"SUM($G$33:G240)","v":103},102,{"$f":"AVERAGE(OFFSET(E239,1,,-MIN(Bollinger_Band_Range_BB,COUNTA(E$32:E239)))+Standard_Deviation_BB*IFERROR(STDEV(OFFSET(E239,1,,-MIN(Bollinger_Band_Range_BB,COUNTA(E$32:E239)))),0))","v":261.03351082951519},{"$f":"IFERROR(AVERAGE(OFFSET(E239,1,,-MIN(Bollinger_Band_Range_BB,COUNTA(E$32:E239)))-Standard_Deviation_BB*IFERROR(STDEV(OFFSET(E239,1,,-MIN(Bollinger_Band_Range_BB,COUNTA(E$32:E239)))),0)),0)","v":212.20183627048482}]
[null,null,null,"2022-10-31",231.47766100000001,{"$f":"IF(Data_BB[[#This Row],[Adj Close]]<E242,TRUE,\"\")","v":""},{"$f":"IF(F240=Data_BB[[#This Row],[Up]],0,1)","v":0},{"$f":"SUM($G$33:G241)","v":103},103,{"$f":"AVERAGE(OFFSET(E240,1,,-MIN(Bollinger_Band_Range_BB,COUNTA(E$32:E240)))+Standard_Deviation_BB*IFERROR(STDEV(OFFSET(E240,1,,-MIN(Bollinger_Band_Range_BB,COUNTA(E$32:E240)))),0))","v":260.70934494736446},{"$f":"IFERROR(AVERAGE(OFFSET(E240,1,,-MIN(Bollinger_Band_Range_BB,COUNTA(E$32:E240)))-Standard_Deviation_BB*IFERROR(STDEV(OFFSET(E240,1,,-MIN(Bollinger_Band_Range_BB,COUNTA(E$32:E240)))),0)),0)","v":211.66742215263548}]
[null,null,null,"2022-11-01",227.52879300000001,{"$f":"IF(Data_BB[[#This Row],[Adj Close]]<E243,TRUE,\"\")","v":""},{"$f":"IF(F241=Data_BB[[#This Row],[Up]],0,1)","v":0},{"$f":"SUM($G$33:G242)","v":103},103,{"$f":"AVERAGE(OFFSET(E241,1,,-MIN(Bollinger_Band_Range_BB,COUNTA(E$32:E241)))+Standard_Deviation_BB*IFERROR(STDEV(OFFSET(E241,1,,-MIN(Bollinger_Band_Range_BB,COUNTA(E$32:E241)))),0))","v":258.78999046828937},{"$f":"IFERROR(AVERAGE(OFFSET(E241,1,,-MIN(Bollinger_Band_Range_BB,COUNTA(E$32:E241)))-Standard_Deviation_BB*IFERROR(STDEV(OFFSET(E241,1,,-MIN(Bollinger_Band_Range_BB,COUNTA(E$32:E241)))),0)),0)","v":211.52159713171062}]
[null,null,null,"2022-11-02",219.48147599999999,{"$f":"IF(Data_BB[[#This Row],[Adj Close]]<E244,TRUE,\"\")","v":""},{"$f":"IF(F242=Data_BB[[#This Row],[Up]],0,1)","v":0},{"$f":"SUM($G$33:G243)","v":103},103,{"$f":"AVERAGE(OFFSET(E242,1,,-MIN(Bollinger_Band_Range_BB,COUNTA(E$32:E242)))+Standard_Deviation_BB*IFERROR(STDEV(OFFSET(E242,1,,-MIN(Bollinger_Band_Range_BB,COUNTA(E$32:E242)))),0))","v":257.59347256674562},{"$f":"IFERROR(AVERAGE(OFFSET(E242,1,,-MIN(Bollinger_Band_Range_BB,COUNTA(E$32:E242)))-Standard_Deviation_BB*IFERROR(STDEV(OFFSET(E242,1,,-MIN(Bollinger_Band_Range_BB,COUNTA(E$32:E242)))),0)),0)","v":209.81629463325436}]
[null,null,null,"2022-11-03",213.64790300000001,{"$f":"IF(Data_BB[[#This Row],[Adj Close]]<E245,TRUE,\"\")","v":true},{"$f":"IF(F243=Data_BB[[#This Row],[Up]],0,1)","v":1},{"$f":"SUM($G$33:G244)","v":104},103,{"$f":"AVERAGE(OFFSET(E243,1,,-MIN(Bollinger_Band_Range_BB,COUNTA(E$32:E243)))+Standard_Deviation_BB*IFERROR(STDEV(OFFSET(E243,1,,-MIN(Bollinger_Band_Range_BB,COUNTA(E$32:E243)))),0))","v":257.84187349356057},{"$f":"IFERROR(AVERAGE(OFFSET(E243,1,,-MIN(Bollinger_Band_Range_BB,COUNTA(E$32:E243)))-Standard_Deviation_BB*IFERROR(STDEV(OFFSET(E243,1,,-MIN(Bollinger_Band_Range_BB,COUNTA(E$32:E243)))),0)),0)","v":206.32303890643948}]
[null,null,null,"2022-11-04",220.76783800000001,{"$f":"IF(Data_BB[[#This Row],[Adj Close]]<E246,TRUE,\"\")","v":true},{"$f":"IF(F244=Data_BB[[#This Row],[Up]],0,1)","v":0},{"$f":"SUM($G$33:G245)","v":104},104,{"$f":"AVERAGE(OFFSET(E244,1,,-MIN(Bollinger_Band_Range_BB,COUNTA(E$32:E244)))+Standard_Deviation_BB*IFERROR(STDEV(OFFSET(E244,1,,-MIN(Bollinger_Band_Range_BB,COUNTA(E$32:E244)))),0))","v":258.26032328640656},{"$f":"IFERROR(AVERAGE(OFFSET(E244,1,,-MIN(Bollinger_Band_Range_BB,COUNTA(E$32:E244)))-Standard_Deviation_BB*IFERROR(STDEV(OFFSET(E244,1,,-MIN(Bollinger_Band_Range_BB,COUNTA(E$32:E244)))),0)),0)","v":204.62319881359346}]
[null,null,null,"2022-11-07",227.22962999999999,{"$f":"IF(Data_BB[[#This Row],[Adj Close]]<E247,TRUE,\"\")","v":true},{"$f":"IF(F245=Data_BB[[#This Row],[Up]],0,1)","v":0},{"$f":"SUM($G$33:G246)","v":104},104,{"$f":"AVERAGE(OFFSET(E245,1,,-MIN(Bollinger_Band_Range_BB,COUNTA(E$32:E245)))+Standard_Deviation_BB*IFERROR(STDEV(OFFSET(E245,1,,-MIN(Bollinger_Band_Range_BB,COUNTA(E$32:E245)))),0))","v":258.27620270400189},{"$f":"IFERROR(AVERAGE(OFFSET(E245,1,,-MIN(Bollinger_Band_Range_BB,COUNTA(E$32:E245)))-Standard_Deviation_BB*IFERROR(STDEV(OFFSET(E245,1,,-MIN(Bollinger_Band_Range_BB,COUNTA(E$32:E245)))),0)),0)","v":204.4697064959982}]
[null,null,null,"2022-11-08",228.226822,{"$f":"IF(Data_BB[[#This Row],[Adj Close]]<E248,TRUE,\"\")","v":""},{"$f":"IF(F246=Data_BB[[#This Row],[Up]],0,1)","v":1},{"$f":"SUM($G$33:G247)","v":105},104,{"$f":"AVERAGE(OFFSET(E246,1,,-MIN(Bollinger_Band_Range_BB,COUNTA(E$32:E246)))+Standard_Deviation_BB*IFERROR(STDEV(OFFSET(E246,1,,-MIN(Bollinger_Band_Range_BB,COUNTA(E$32:E246)))),0))","v":258.14584790937897},{"$f":"IFERROR(AVERAGE(OFFSET(E246,1,,-MIN(Bollinger_Band_Range_BB,COUNTA(E$32:E246)))-Standard_Deviation_BB*IFERROR(STDEV(OFFSET(E246,1,,-MIN(Bollinger_Band_Range_BB,COUNTA(E$32:E246)))),0)),0)","v":204.94508849062103}]
[null,null,null,"2022-11-09",223.879074,{"$f":"IF(Data_BB[[#This Row],[Adj Close]]<E249,TRUE,\"\")","v":true},{"$f":"IF(F247=Data_BB[[#This Row],[Up]],0,1)","v":1},{"$f":"SUM($G$33:G248)","v":106},105,{"$f":"AVERAGE(OFFSET(E247,1,,-MIN(Bollinger_Band_Range_BB,COUNTA(E$32:E247)))+Standard_Deviation_BB*IFERROR(STDEV(OFFSET(E247,1,,-MIN(Bollinger_Band_Range_BB,COUNTA(E$32:E247)))),0))","v":258.23808900924348},{"$f":"IFERROR(AVERAGE(OFFSET(E247,1,,-MIN(Bollinger_Band_Range_BB,COUNTA(E$32:E247)))-Standard_Deviation_BB*IFERROR(STDEV(OFFSET(E247,1,,-MIN(Bollinger_Band_Range_BB,COUNTA(E$32:E247)))),0)),0)","v":204.72919629075648}]
[null,null,null,"2022-11-10",242.29716500000001,{"$f":"IF(Data_BB[[#This Row],[Adj Close]]<E250,TRUE,\"\")","v":true},{"$f":"IF(F248=Data_BB[[#This Row],[Up]],0,1)","v":0},{"$f":"SUM($G$33:G249)","v":106},106,{"$f":"AVERAGE(OFFSET(E248,1,,-MIN(Bollinger_Band_Range_BB,COUNTA(E$32:E248)))+Standard_Deviation_BB*IFERROR(STDEV(OFFSET(E248,1,,-MIN(Bollinger_Band_Range_BB,COUNTA(E$32:E248)))),0))","v":259.61968789688427},{"$f":"IFERROR(AVERAGE(OFFSET(E248,1,,-MIN(Bollinger_Band_Range_BB,COUNTA(E$32:E248)))-Standard_Deviation_BB*IFERROR(STDEV(OFFSET(E248,1,,-MIN(Bollinger_Band_Range_BB,COUNTA(E$32:E248)))),0)),0)","v":204.2191398031157}]
[null,null,null,"2022-11-11",246.415558,{"$f":"IF(Data_BB[[#This Row],[Adj Close]]<E251,TRUE,\"\")","v":""},{"$f":"IF(F249=Data_BB[[#This Row],[Up]],0,1)","v":1},{"$f":"SUM($G$33:G250)","v":107},106,{"$f":"AVERAGE(OFFSET(E249,1,,-MIN(Bollinger_Band_Range_BB,COUNTA(E$32:E249)))+Standard_Deviation_BB*IFERROR(STDEV(OFFSET(E249,1,,-MIN(Bollinger_Band_Range_BB,COUNTA(E$32:E249)))),0))","v":262.01886466326221},{"$f":"IFERROR(AVERAGE(OFFSET(E249,1,,-MIN(Bollinger_Band_Range_BB,COUNTA(E$32:E249)))-Standard_Deviation_BB*IFERROR(STDEV(OFFSET(E249,1,,-MIN(Bollinger_Band_Range_BB,COUNTA(E$32:E249)))),0)),0)","v":203.66974943673785}]
[null,null,null,"2022-11-14",240.871185,{"$f":"IF(Data_BB[[#This Row],[Adj Close]]<E252,TRUE,\"\")","v":true},{"$f":"IF(F250=Data_BB[[#This Row],[Up]],0,1)","v":1},{"$f":"SUM($G$33:G251)","v":108},107,{"$f":"AVERAGE(OFFSET(E250,1,,-MIN(Bollinger_Band_Range_BB,COUNTA(E$32:E250)))+Standard_Deviation_BB*IFERROR(STDEV(OFFSET(E250,1,,-MIN(Bollinger_Band_Range_BB,COUNTA(E$32:E250)))),0))","v":262.6022460738177},{"$f":"IFERROR(AVERAGE(OFFSET(E250,1,,-MIN(Bollinger_Band_Range_BB,COUNTA(E$32:E250)))-Standard_Deviation_BB*IFERROR(STDEV(OFFSET(E250,1,,-MIN(Bollinger_Band_Range_BB,COUNTA(E$32:E250)))),0)),0)","v":203.48723772618234}]
[null,null,null,"2022-11-15",241.290009,{"$f":"IF(Data_BB[[#This Row],[Adj Close]]<E253,TRUE,\"\")","v":true},{"$f":"IF(F251=Data_BB[[#This Row],[Up]],0,1)","v":0},{"$f":"SUM($G$33:G252)","v":108},108,{"$f":"AVERAGE(OFFSET(E251,1,,-MIN(Bollinger_Band_Range_BB,COUNTA(E$32:E251)))+Standard_Deviation_BB*IFERROR(STDEV(OFFSET(E251,1,,-MIN(Bollinger_Band_Range_BB,COUNTA(E$32:E251)))),0))","v":263.12962452767908},{"$f":"IFERROR(AVERAGE(OFFSET(E251,1,,-MIN(Bollinger_Band_Range_BB,COUNTA(E$32:E251)))-Standard_Deviation_BB*IFERROR(STDEV(OFFSET(E251,1,,-MIN(Bollinger_Band_Range_BB,COUNTA(E$32:E251)))),0)),0)","v":203.30588437232092}]
[null,null,null,"2022-11-16",241.729996,{"$f":"IF(Data_BB[[#This Row],[Adj Close]]<E254,TRUE,\"\")","v":""},{"$f":"IF(F252=Data_BB[[#This Row],[Up]],0,1)","v":1},{"$f":"SUM($G$33:G253)","v":109},108,{"$f":"AVERAGE(OFFSET(E252,1,,-MIN(Bollinger_Band_Range_BB,COUNTA(E$32:E252)))+Standard_Deviation_BB*IFERROR(STDEV(OFFSET(E252,1,,-MIN(Bollinger_Band_Range_BB,COUNTA(E$32:E252)))),0))","v":263.92758141967141},{"$f":"IFERROR(AVERAGE(OFFSET(E252,1,,-MIN(Bollinger_Band_Range_BB,COUNTA(E$32:E252)))-Standard_Deviation_BB*IFERROR(STDEV(OFFSET(E252,1,,-MIN(Bollinger_Band_Range_BB,COUNTA(E$32:E252)))),0)),0)","v":203.09938408032855}]
[null,null,null,"2022-11-17",241.679993,{"$f":"IF(Data_BB[[#This Row],[Adj Close]]<E255,TRUE,\"\")","v":""},{"$f":"IF(F253=Data_BB[[#This Row],[Up]],0,1)","v":0},{"$f":"SUM($G$33:G254)","v":109},109,{"$f":"AVERAGE(OFFSET(E253,1,,-MIN(Bollinger_Band_Range_BB,COUNTA(E$32:E253)))+Standard_Deviation_BB*IFERROR(STDEV(OFFSET(E253,1,,-MIN(Bollinger_Band_Range_BB,COUNTA(E$32:E253)))),0))","v":264.70772446971387},{"$f":"IFERROR(AVERAGE(OFFSET(E253,1,,-MIN(Bollinger_Band_Range_BB,COUNTA(E$32:E253)))-Standard_Deviation_BB*IFERROR(STDEV(OFFSET(E253,1,,-MIN(Bollinger_Band_Range_BB,COUNTA(E$32:E253)))),0)),0)","v":202.93860443028615}]
[null,null,null,"2022-11-18",241.220001,{"$f":"IF(Data_BB[[#This Row],[Adj Close]]<E256,TRUE,\"\")","v":true},{"$f":"IF(F254=Data_BB[[#This Row],[Up]],0,1)","v":1},{"$f":"SUM($G$33:G255)","v":110},109,{"$f":"AVERAGE(OFFSET(E254,1,,-MIN(Bollinger_Band_Range_BB,COUNTA(E$32:E254)))+Standard_Deviation_BB*IFERROR(STDEV(OFFSET(E254,1,,-MIN(Bollinger_Band_Range_BB,COUNTA(E$32:E254)))),0))","v":264.67143714830553},{"$f":"IFERROR(AVERAGE(OFFSET(E254,1,,-MIN(Bollinger_Band_Range_BB,COUNTA(E$32:E254)))-Standard_Deviation_BB*IFERROR(STDEV(OFFSET(E254,1,,-MIN(Bollinger_Band_Range_BB,COUNTA(E$32:E254)))),0)),0)","v":202.95293435169449}]
[null,null,null,"2022-11-21",242.050003,{"$f":"IF(Data_BB[[#This Row],[Adj Close]]<E257,TRUE,\"\")","v":true},{"$f":"IF(F255=Data_BB[[#This Row],[Up]],0,1)","v":0},{"$f":"SUM($G$33:G256)","v":110},110,{"$f":"AVERAGE(OFFSET(E255,1,,-MIN(Bollinger_Band_Range_BB,COUNTA(E$32:E255)))+Standard_Deviation_BB*IFERROR(STDEV(OFFSET(E255,1,,-MIN(Bollinger_Band_Range_BB,COUNTA(E$32:E255)))),0))","v":263.70401577117059},{"$f":"IFERROR(AVERAGE(OFFSET(E255,1,,-MIN(Bollinger_Band_Range_BB,COUNTA(E$32:E255)))-Standard_Deviation_BB*IFERROR(STDEV(OFFSET(E255,1,,-MIN(Bollinger_Band_Range_BB,COUNTA(E$32:E255)))),0)),0)","v":203.46983842882943}]
[null,null,null,"2022-11-22",245.029999,{"$f":"IF(Data_BB[[#This Row],[Adj Close]]<E258,TRUE,\"\")","v":true},{"$f":"IF(F256=Data_BB[[#This Row],[Up]],0,1)","v":0},{"$f":"SUM($G$33:G257)","v":110},110,{"$f":"AVERAGE(OFFSET(E256,1,,-MIN(Bollinger_Band_Range_BB,COUNTA(E$32:E256)))+Standard_Deviation_BB*IFERROR(STDEV(OFFSET(E256,1,,-MIN(Bollinger_Band_Range_BB,COUNTA(E$32:E256)))),0))","v":262.35055844934925},{"$f":"IFERROR(AVERAGE(OFFSET(E256,1,,-MIN(Bollinger_Band_Range_BB,COUNTA(E$32:E256)))-Standard_Deviation_BB*IFERROR(STDEV(OFFSET(E256,1,,-MIN(Bollinger_Band_Range_BB,COUNTA(E$32:E256)))),0)),0)","v":204.33073745065067}]
[null,null,null,"2022-11-23",247.58000200000001,{"$f":"IF(Data_BB[[#This Row],[Adj Close]]<E259,TRUE,\"\")","v":""},{"$f":"IF(F257=Data_BB[[#This Row],[Up]],0,1)","v":1},{"$f":"SUM($G$33:G258)","v":111},110,{"$f":"AVERAGE(OFFSET(E257,1,,-MIN(Bollinger_Band_Range_BB,COUNTA(E$32:E257)))+Standard_Deviation_BB*IFERROR(STDEV(OFFSET(E257,1,,-MIN(Bollinger_Band_Range_BB,COUNTA(E$32:E257)))),0))","v":264.64050372207123},{"$f":"IFERROR(AVERAGE(OFFSET(E257,1,,-MIN(Bollinger_Band_Range_BB,COUNTA(E$32:E257)))-Standard_Deviation_BB*IFERROR(STDEV(OFFSET(E257,1,,-MIN(Bollinger_Band_Range_BB,COUNTA(E$32:E257)))),0)),0)","v":203.73179867792871}]
[null,null,null,"2022-11-25",247.490005,{"$f":"IF(Data_BB[[#This Row],[Adj Close]]<E260,TRUE,\"\")","v":""},{"$f":"IF(F258=Data_BB[[#This Row],[Up]],0,1)","v":0},{"$f":"SUM($G$33:G259)","v":111},111,{"$f":"AVERAGE(OFFSET(E258,1,,-MIN(Bollinger_Band_Range_BB,COUNTA(E$32:E258)))+Standard_Deviation_BB*IFERROR(STDEV(OFFSET(E258,1,,-MIN(Bollinger_Band_Range_BB,COUNTA(E$32:E258)))),0))","v":266.39354771970699},{"$f":"IFERROR(AVERAGE(OFFSET(E258,1,,-MIN(Bollinger_Band_Range_BB,COUNTA(E$32:E258)))-Standard_Deviation_BB*IFERROR(STDEV(OFFSET(E258,1,,-MIN(Bollinger_Band_Range_BB,COUNTA(E$32:E258)))),0)),0)","v":204.11647738029293}]
[null,null,null,"2022-11-28",241.759995,{"$f":"IF(Data_BB[[#This Row],[Adj Close]]<E261,TRUE,\"\")","v":""},{"$f":"IF(F259=Data_BB[[#This Row],[Up]],0,1)","v":0},{"$f":"SUM($G$33:G260)","v":111},111,{"$f":"AVERAGE(OFFSET(E259,1,,-MIN(Bollinger_Band_Range_BB,COUNTA(E$32:E259)))+Standard_Deviation_BB*IFERROR(STDEV(OFFSET(E259,1,,-MIN(Bollinger_Band_Range_BB,COUNTA(E$32:E259)))),0))","v":267.02520840453673},{"$f":"IFERROR(AVERAGE(OFFSET(E259,1,,-MIN(Bollinger_Band_Range_BB,COUNTA(E$32:E259)))-Standard_Deviation_BB*IFERROR(STDEV(OFFSET(E259,1,,-MIN(Bollinger_Band_Range_BB,COUNTA(E$32:E259)))),0)),0)","v":204.14010239546332}]
[null,null,null,"2022-11-29",240.33000200000001,{"$f":"IF(Data_BB[[#This Row],[Adj Close]]<E262,TRUE,\"\")","v":true},{"$f":"IF(F260=Data_BB[[#This Row],[Up]],0,1)","v":1},{"$f":"SUM($G$33:G261)","v":112},111,{"$f":"AVERAGE(OFFSET(E260,1,,-MIN(Bollinger_Band_Range_BB,COUNTA(E$32:E260)))+Standard_Deviation_BB*IFERROR(STDEV(OFFSET(E260,1,,-MIN(Bollinger_Band_Range_BB,COUNTA(E$32:E260)))),0))","v":267.48114108690004},{"$f":"IFERROR(AVERAGE(OFFSET(E260,1,,-MIN(Bollinger_Band_Range_BB,COUNTA(E$32:E260)))-Standard_Deviation_BB*IFERROR(STDEV(OFFSET(E260,1,,-MIN(Bollinger_Band_Range_BB,COUNTA(E$32:E260)))),0)),0)","v":204.56940381309997}]
[null,null,null,"2022-11-30",255.13999899999999,{"$f":"IF(Data_BB[[#This Row],[Adj Close]]<E263,TRUE,\"\")","v":""},{"$f":"IF(F261=Data_BB[[#This Row],[Up]],0,1)","v":1},{"$f":"SUM($G$33:G262)","v":113},112,{"$f":"AVERAGE(OFFSET(E261,1,,-MIN(Bollinger_Band_Range_BB,COUNTA(E$32:E261)))+Standard_Deviation_BB*IFERROR(STDEV(OFFSET(E261,1,,-MIN(Bollinger_Band_Range_BB,COUNTA(E$32:E261)))),0))","v":270.72686674318186},{"$f":"IFERROR(AVERAGE(OFFSET(E261,1,,-MIN(Bollinger_Band_Range_BB,COUNTA(E$32:E261)))-Standard_Deviation_BB*IFERROR(STDEV(OFFSET(E261,1,,-MIN(Bollinger_Band_Range_BB,COUNTA(E$32:E261)))),0)),0)","v":204.08479875681817}]
[null,null,null,"2022-12-01",254.69000199999999,{"$f":"IF(Data_BB[[#This Row],[Adj Close]]<E264,TRUE,\"\")","v":true},{"$f":"IF(F262=Data_BB[[#This Row],[Up]],0,1)","v":1},{"$f":"SUM($G$33:G263)","v":114},113,{"$f":"AVERAGE(OFFSET(E262,1,,-MIN(Bollinger_Band_Range_BB,COUNTA(E$32:E262)))+Standard_Deviation_BB*IFERROR(STDEV(OFFSET(E262,1,,-MIN(Bollinger_Band_Range_BB,COUNTA(E$32:E262)))),0))","v":271.88100396368452},{"$f":"IFERROR(AVERAGE(OFFSET(E262,1,,-MIN(Bollinger_Band_Range_BB,COUNTA(E$32:E262)))-Standard_Deviation_BB*IFERROR(STDEV(OFFSET(E262,1,,-MIN(Bollinger_Band_Range_BB,COUNTA(E$32:E262)))),0)),0)","v":206.45151413631547}]
[null,null,null,"2022-12-02",255.020004,{"$f":"IF(Data_BB[[#This Row],[Adj Close]]<E265,TRUE,\"\")","v":""},{"$f":"IF(F263=Data_BB[[#This Row],[Up]],0,1)","v":1},{"$f":"SUM($G$33:G264)","v":115},114,{"$f":"AVERAGE(OFFSET(E263,1,,-MIN(Bollinger_Band_Range_BB,COUNTA(E$32:E263)))+Standard_Deviation_BB*IFERROR(STDEV(OFFSET(E263,1,,-MIN(Bollinger_Band_Range_BB,COUNTA(E$32:E263)))),0))","v":270.22305219180168},{"$f":"IFERROR(AVERAGE(OFFSET(E263,1,,-MIN(Bollinger_Band_Range_BB,COUNTA(E$32:E263)))-Standard_Deviation_BB*IFERROR(STDEV(OFFSET(E263,1,,-MIN(Bollinger_Band_Range_BB,COUNTA(E$32:E263)))),0)),0)","v":212.24667600819831}]
[null,null,null,"2022-12-05",250.199997,{"$f":"IF(Data_BB[[#This Row],[Adj Close]]<E266,TRUE,\"\")","v":""},{"$f":"IF(F264=Data_BB[[#This Row],[Up]],0,1)","v":0},{"$f":"SUM($G$33:G265)","v":115},115,{"$f":"AVERAGE(OFFSET(E264,1,,-MIN(Bollinger_Band_Range_BB,COUNTA(E$32:E264)))+Standard_Deviation_BB*IFERROR(STDEV(OFFSET(E264,1,,-MIN(Bollinger_Band_Range_BB,COUNTA(E$32:E264)))),0))","v":268.38612054567443},{"$f":"IFERROR(AVERAGE(OFFSET(E264,1,,-MIN(Bollinger_Band_Range_BB,COUNTA(E$32:E264)))-Standard_Deviation_BB*IFERROR(STDEV(OFFSET(E264,1,,-MIN(Bollinger_Band_Range_BB,COUNTA(E$32:E264)))),0)),0)","v":217.02682355432557}]
[null,null,null,"2022-12-06",245.11999499999999,{"$f":"IF(Data_BB[[#This Row],[Adj Close]]<E267,TRUE,\"\")","v":""},{"$f":"IF(F265=Data_BB[[#This Row],[Up]],0,1)","v":0},{"$f":"SUM($G$33:G266)","v":115},115,{"$f":"AVERAGE(OFFSET(E265,1,,-MIN(Bollinger_Band_Range_BB,COUNTA(E$32:E265)))+Standard_Deviation_BB*IFERROR(STDEV(OFFSET(E265,1,,-MIN(Bollinger_Band_Range_BB,COUNTA(E$32:E265)))),0))","v":266.86384226249163},{"$f":"IFERROR(AVERAGE(OFFSET(E265,1,,-MIN(Bollinger_Band_Range_BB,COUNTA(E$32:E265)))-Standard_Deviation_BB*IFERROR(STDEV(OFFSET(E265,1,,-MIN(Bollinger_Band_Range_BB,COUNTA(E$32:E265)))),0)),0)","v":220.33813833750833}]
[null,null,null,"2022-12-07",244.36999499999999,{"$f":"IF(Data_BB[[#This Row],[Adj Close]]<E268,TRUE,\"\")","v":true},{"$f":"IF(F266=Data_BB[[#This Row],[Up]],0,1)","v":1},{"$f":"SUM($G$33:G267)","v":116},115,{"$f":"AVERAGE(OFFSET(E266,1,,-MIN(Bollinger_Band_Range_BB,COUNTA(E$32:E266)))+Standard_Deviation_BB*IFERROR(STDEV(OFFSET(E266,1,,-MIN(Bollinger_Band_Range_BB,COUNTA(E$32:E266)))),0))","v":264.98254705135241},{"$f":"IFERROR(AVERAGE(OFFSET(E266,1,,-MIN(Bollinger_Band_Range_BB,COUNTA(E$32:E266)))-Standard_Deviation_BB*IFERROR(STDEV(OFFSET(E266,1,,-MIN(Bollinger_Band_Range_BB,COUNTA(E$32:E266)))),0)),0)","v":223.83375084864755}]
[null,null,null,"2022-12-08",247.39999399999999,{"$f":"IF(Data_BB[[#This Row],[Adj Close]]<E269,TRUE,\"\")","v":""},{"$f":"IF(F267=Data_BB[[#This Row],[Up]],0,1)","v":1},{"$f":"SUM($G$33:G268)","v":117},116,{"$f":"AVERAGE(OFFSET(E267,1,,-MIN(Bollinger_Band_Range_BB,COUNTA(E$32:E267)))+Standard_Deviation_BB*IFERROR(STDEV(OFFSET(E267,1,,-MIN(Bollinger_Band_Range_BB,COUNTA(E$32:E267)))),0))","v":260.24066486854178},{"$f":"IFERROR(AVERAGE(OFFSET(E267,1,,-MIN(Bollinger_Band_Range_BB,COUNTA(E$32:E267)))-Standard_Deviation_BB*IFERROR(STDEV(OFFSET(E267,1,,-MIN(Bollinger_Band_Range_BB,COUNTA(E$32:E267)))),0)),0)","v":230.92772503145821}]
[null,null,null,"2022-12-09",245.41999799999999,{"$f":"IF(Data_BB[[#This Row],[Adj Close]]<E270,TRUE,\"\")","v":true},{"$f":"IF(F268=Data_BB[[#This Row],[Up]],0,1)","v":1},{"$f":"SUM($G$33:G269)","v":118},117,{"$f":"AVERAGE(OFFSET(E268,1,,-MIN(Bollinger_Band_Range_BB,COUNTA(E$32:E268)))+Standard_Deviation_BB*IFERROR(STDEV(OFFSET(E268,1,,-MIN(Bollinger_Band_Range_BB,COUNTA(E$32:E268)))),0))","v":260.2136209052465},{"$f":"IFERROR(AVERAGE(OFFSET(E268,1,,-MIN(Bollinger_Band_Range_BB,COUNTA(E$32:E268)))-Standard_Deviation_BB*IFERROR(STDEV(OFFSET(E268,1,,-MIN(Bollinger_Band_Range_BB,COUNTA(E$32:E268)))),0)),0)","v":231.26705229475351}]
[null,null,null,"2022-12-12",252.509995,{"$f":"IF(Data_BB[[#This Row],[Adj Close]]<E271,TRUE,\"\")","v":true},{"$f":"IF(F269=Data_BB[[#This Row],[Up]],0,1)","v":0},{"$f":"SUM($G$33:G270)","v":118},118,{"$f":"AVERAGE(OFFSET(E269,1,,-MIN(Bollinger_Band_Range_BB,COUNTA(E$32:E269)))+Standard_Deviation_BB*IFERROR(STDEV(OFFSET(E269,1,,-MIN(Bollinger_Band_Range_BB,COUNTA(E$32:E269)))),0))","v":261.213724904581},{"$f":"IFERROR(AVERAGE(OFFSET(E269,1,,-MIN(Bollinger_Band_Range_BB,COUNTA(E$32:E269)))-Standard_Deviation_BB*IFERROR(STDEV(OFFSET(E269,1,,-MIN(Bollinger_Band_Range_BB,COUNTA(E$32:E269)))),0)),0)","v":230.876391995419}]
[null,null,null,"2022-12-13",256.92001299999998,{"$f":"IF(Data_BB[[#This Row],[Adj Close]]<E272,TRUE,\"\")","v":true},{"$f":"IF(F270=Data_BB[[#This Row],[Up]],0,1)","v":0},{"$f":"SUM($G$33:G271)","v":118},118,{"$f":"AVERAGE(OFFSET(E270,1,,-MIN(Bollinger_Band_Range_BB,COUNTA(E$32:E270)))+Standard_Deviation_BB*IFERROR(STDEV(OFFSET(E270,1,,-MIN(Bollinger_Band_Range_BB,COUNTA(E$32:E270)))),0))","v":263.19767646583301},{"$f":"IFERROR(AVERAGE(OFFSET(E270,1,,-MIN(Bollinger_Band_Range_BB,COUNTA(E$32:E270)))-Standard_Deviation_BB*IFERROR(STDEV(OFFSET(E270,1,,-MIN(Bollinger_Band_Range_BB,COUNTA(E$32:E270)))),0)),0)","v":230.49732323416691}]
[null,null,null,"2022-12-14",257.22000100000002,{"$f":"IF(Data_BB[[#This Row],[Adj Close]]<E273,TRUE,\"\")","v":""},{"$f":"IF(F271=Data_BB[[#This Row],[Up]],0,1)","v":1},{"$f":"SUM($G$33:G272)","v":119},118,{"$f":"AVERAGE(OFFSET(E271,1,,-MIN(Bollinger_Band_Range_BB,COUNTA(E$32:E271)))+Standard_Deviation_BB*IFERROR(STDEV(OFFSET(E271,1,,-MIN(Bollinger_Band_Range_BB,COUNTA(E$32:E271)))),0))","v":264.89656725542659},{"$f":"IFERROR(AVERAGE(OFFSET(E271,1,,-MIN(Bollinger_Band_Range_BB,COUNTA(E$32:E271)))-Standard_Deviation_BB*IFERROR(STDEV(OFFSET(E271,1,,-MIN(Bollinger_Band_Range_BB,COUNTA(E$32:E271)))),0)),0)","v":230.39143164457346}]
[null,null,null,"2022-12-15",249.009995,{"$f":"IF(Data_BB[[#This Row],[Adj Close]]<E274,TRUE,\"\")","v":""},{"$f":"IF(F272=Data_BB[[#This Row],[Up]],0,1)","v":0},{"$f":"SUM($G$33:G273)","v":119},119,{"$f":"AVERAGE(OFFSET(E272,1,,-MIN(Bollinger_Band_Range_BB,COUNTA(E$32:E272)))+Standard_Deviation_BB*IFERROR(STDEV(OFFSET(E272,1,,-MIN(Bollinger_Band_Range_BB,COUNTA(E$32:E272)))),0))","v":264.76247423292006},{"$f":"IFERROR(AVERAGE(OFFSET(E272,1,,-MIN(Bollinger_Band_Range_BB,COUNTA(E$32:E272)))-Standard_Deviation_BB*IFERROR(STDEV(OFFSET(E272,1,,-MIN(Bollinger_Band_Range_BB,COUNTA(E$32:E272)))),0)),0)","v":231.25352456707998}]
[null,null,null,"2022-12-16",244.69000199999999,{"$f":"IF(Data_BB[[#This Row],[Adj Close]]<E275,TRUE,\"\")","v":""},{"$f":"IF(F273=Data_BB[[#This Row],[Up]],0,1)","v":0},{"$f":"SUM($G$33:G274)","v":119},119,{"$f":"AVERAGE(OFFSET(E273,1,,-MIN(Bollinger_Band_Range_BB,COUNTA(E$32:E273)))+Standard_Deviation_BB*IFERROR(STDEV(OFFSET(E273,1,,-MIN(Bollinger_Band_Range_BB,COUNTA(E$32:E273)))),0))","v":264.49081850120058},{"$f":"IFERROR(AVERAGE(OFFSET(E273,1,,-MIN(Bollinger_Band_Range_BB,COUNTA(E$32:E273)))-Standard_Deviation_BB*IFERROR(STDEV(OFFSET(E273,1,,-MIN(Bollinger_Band_Range_BB,COUNTA(E$32:E273)))),0)),0)","v":231.82618119879947}]
[null,null,null,"2022-12-19",240.449997,{"$f":"IF(Data_BB[[#This Row],[Adj Close]]<E276,TRUE,\"\")","v":true},{"$f":"IF(F274=Data_BB[[#This Row],[Up]],0,1)","v":1},{"$f":"SUM($G$33:G275)","v":120},119,{"$f":"AVERAGE(OFFSET(E274,1,,-MIN(Bollinger_Band_Range_BB,COUNTA(E$32:E274)))+Standard_Deviation_BB*IFERROR(STDEV(OFFSET(E274,1,,-MIN(Bollinger_Band_Range_BB,COUNTA(E$32:E274)))),0))","v":264.6146326834633},{"$f":"IFERROR(AVERAGE(OFFSET(E274,1,,-MIN(Bollinger_Band_Range_BB,COUNTA(E$32:E274)))-Standard_Deviation_BB*IFERROR(STDEV(OFFSET(E274,1,,-MIN(Bollinger_Band_Range_BB,COUNTA(E$32:E274)))),0)),0)","v":231.62536661653672}]
[null,null,null,"2022-12-20",241.800003,{"$f":"IF(Data_BB[[#This Row],[Adj Close]]<E277,TRUE,\"\")","v":true},{"$f":"IF(F275=Data_BB[[#This Row],[Up]],0,1)","v":0},{"$f":"SUM($G$33:G276)","v":120},120,{"$f":"AVERAGE(OFFSET(E275,1,,-MIN(Bollinger_Band_Range_BB,COUNTA(E$32:E275)))+Standard_Deviation_BB*IFERROR(STDEV(OFFSET(E275,1,,-MIN(Bollinger_Band_Range_BB,COUNTA(E$32:E275)))),0))","v":264.64650429641534},{"$f":"IFERROR(AVERAGE(OFFSET(E275,1,,-MIN(Bollinger_Band_Range_BB,COUNTA(E$32:E275)))-Standard_Deviation_BB*IFERROR(STDEV(OFFSET(E275,1,,-MIN(Bollinger_Band_Range_BB,COUNTA(E$32:E275)))),0)),0)","v":231.5684950035847}]
[null,null,null,"2022-12-21",244.429993,{"$f":"IF(Data_BB[[#This Row],[Adj Close]]<E278,TRUE,\"\")","v":""},{"$f":"IF(F276=Data_BB[[#This Row],[Up]],0,1)","v":1},{"$f":"SUM($G$33:G277)","v":121},120,{"$f":"AVERAGE(OFFSET(E276,1,,-MIN(Bollinger_Band_Range_BB,COUNTA(E$32:E276)))+Standard_Deviation_BB*IFERROR(STDEV(OFFSET(E276,1,,-MIN(Bollinger_Band_Range_BB,COUNTA(E$32:E276)))),0))","v":264.67418611532372},{"$f":"IFERROR(AVERAGE(OFFSET(E276,1,,-MIN(Bollinger_Band_Range_BB,COUNTA(E$32:E276)))-Standard_Deviation_BB*IFERROR(STDEV(OFFSET(E276,1,,-MIN(Bollinger_Band_Range_BB,COUNTA(E$32:E276)))),0)),0)","v":231.48081258467627}]
[null,null,null,"2022-12-22",238.19000199999999,{"$f":"IF(Data_BB[[#This Row],[Adj Close]]<E279,TRUE,\"\")","v":true},{"$f":"IF(F277=Data_BB[[#This Row],[Up]],0,1)","v":1},{"$f":"SUM($G$33:G278)","v":122},121,{"$f":"AVERAGE(OFFSET(E277,1,,-MIN(Bollinger_Band_Range_BB,COUNTA(E$32:E277)))+Standard_Deviation_BB*IFERROR(STDEV(OFFSET(E277,1,,-MIN(Bollinger_Band_Range_BB,COUNTA(E$32:E277)))),0))","v":265.4840472430771},{"$f":"IFERROR(AVERAGE(OFFSET(E277,1,,-MIN(Bollinger_Band_Range_BB,COUNTA(E$32:E277)))-Standard_Deviation_BB*IFERROR(STDEV(OFFSET(E277,1,,-MIN(Bollinger_Band_Range_BB,COUNTA(E$32:E277)))),0)),0)","v":229.73195145692284}]
[null,null,null,"2022-12-23",238.729996,{"$f":"IF(Data_BB[[#This Row],[Adj Close]]<E280,TRUE,\"\")","v":""},{"$f":"IF(F278=Data_BB[[#This Row],[Up]],0,1)","v":1},{"$f":"SUM($G$33:G279)","v":123},122,{"$f":"AVERAGE(OFFSET(E278,1,,-MIN(Bollinger_Band_Range_BB,COUNTA(E$32:E278)))+Standard_Deviation_BB*IFERROR(STDEV(OFFSET(E278,1,,-MIN(Bollinger_Band_Range_BB,COUNTA(E$32:E278)))),0))","v":266.01314909146481},{"$f":"IFERROR(AVERAGE(OFFSET(E278,1,,-MIN(Bollinger_Band_Range_BB,COUNTA(E$32:E278)))-Standard_Deviation_BB*IFERROR(STDEV(OFFSET(E278,1,,-MIN(Bollinger_Band_Range_BB,COUNTA(E$32:E278)))),0)),0)","v":228.32684870853518}]
[null,null,null,"2022-12-27",236.96000699999999,{"$f":"IF(Data_BB[[#This Row],[Adj Close]]<E281,TRUE,\"\")","v":""},{"$f":"IF(F279=Data_BB[[#This Row],[Up]],0,1)","v":0},{"$f":"SUM($G$33:G280)","v":123},123,{"$f":"AVERAGE(OFFSET(E279,1,,-MIN(Bollinger_Band_Range_BB,COUNTA(E$32:E279)))+Standard_Deviation_BB*IFERROR(STDEV(OFFSET(E279,1,,-MIN(Bollinger_Band_Range_BB,COUNTA(E$32:E279)))),0))","v":266.67926471892895},{"$f":"IFERROR(AVERAGE(OFFSET(E279,1,,-MIN(Bollinger_Band_Range_BB,COUNTA(E$32:E279)))-Standard_Deviation_BB*IFERROR(STDEV(OFFSET(E279,1,,-MIN(Bollinger_Band_Range_BB,COUNTA(E$32:E279)))),0)),0)","v":227.1807342810711}]
[null,null,null,"2022-12-28",234.529999,{"$f":"IF(Data_BB[[#This Row],[Adj Close]]<E282,TRUE,\"\")","v":true},{"$f":"IF(F280=Data_BB[[#This Row],[Up]],0,1)","v":1},{"$f":"SUM($G$33:G281)","v":124},123,{"$f":"AVERAGE(OFFSET(E280,1,,-MIN(Bollinger_Band_Range_BB,COUNTA(E$32:E280)))+Standard_Deviation_BB*IFERROR(STDEV(OFFSET(E280,1,,-MIN(Bollinger_Band_Range_BB,COUNTA(E$32:E280)))),0))","v":267.65039583665725},{"$f":"IFERROR(AVERAGE(OFFSET(E280,1,,-MIN(Bollinger_Band_Range_BB,COUNTA(E$32:E280)))-Standard_Deviation_BB*IFERROR(STDEV(OFFSET(E280,1,,-MIN(Bollinger_Band_Range_BB,COUNTA(E$32:E280)))),0)),0)","v":225.62960286334274}]
[null,null,null,"2022-12-29",241.009995,{"$f":"IF(Data_BB[[#This Row],[Adj Close]]<E283,TRUE,\"\")","v":""},{"$f":"IF(F281=Data_BB[[#This Row],[Up]],0,1)","v":1},{"$f":"SUM($G$33:G282)","v":125},124,{"$f":"AVERAGE(OFFSET(E281,1,,-MIN(Bollinger_Band_Range_BB,COUNTA(E$32:E281)))+Standard_Deviation_BB*IFERROR(STDEV(OFFSET(E281,1,,-MIN(Bollinger_Band_Range_BB,COUNTA(E$32:E281)))),0))","v":266.36628419410761},{"$f":"IFERROR(AVERAGE(OFFSET(E281,1,,-MIN(Bollinger_Band_Range_BB,COUNTA(E$32:E281)))-Standard_Deviation_BB*IFERROR(STDEV(OFFSET(E281,1,,-MIN(Bollinger_Band_Range_BB,COUNTA(E$32:E281)))),0)),0)","v":225.50071410589243}]
[null,null,null,"2022-12-30",239.820007,{"$f":"IF(Data_BB[[#This Row],[Adj Close]]<E284,TRUE,\"\")","v":""},{"$f":"IF(F282=Data_BB[[#This Row],[Up]],0,1)","v":0},{"$f":"SUM($G$33:G283)","v":125},125,{"$f":"AVERAGE(OFFSET(E282,1,,-MIN(Bollinger_Band_Range_BB,COUNTA(E$32:E282)))+Standard_Deviation_BB*IFERROR(STDEV(OFFSET(E282,1,,-MIN(Bollinger_Band_Range_BB,COUNTA(E$32:E282)))),0))","v":265.03049340831399},{"$f":"IFERROR(AVERAGE(OFFSET(E282,1,,-MIN(Bollinger_Band_Range_BB,COUNTA(E$32:E282)))-Standard_Deviation_BB*IFERROR(STDEV(OFFSET(E282,1,,-MIN(Bollinger_Band_Range_BB,COUNTA(E$32:E282)))),0)),0)","v":225.34950539168602}]
[null,null,null,"2023-01-03",239.58000200000001,{"$f":"IF(Data_BB[[#This Row],[Adj Close]]<E285,TRUE,\"\")","v":""},{"$f":"IF(F283=Data_BB[[#This Row],[Up]],0,1)","v":0},{"$f":"SUM($G$33:G284)","v":125},125,{"$f":"AVERAGE(OFFSET(E283,1,,-MIN(Bollinger_Band_Range_BB,COUNTA(E$32:E283)))+Standard_Deviation_BB*IFERROR(STDEV(OFFSET(E283,1,,-MIN(Bollinger_Band_Range_BB,COUNTA(E$32:E283)))),0))","v":263.3160212281233},{"$f":"IFERROR(AVERAGE(OFFSET(E283,1,,-MIN(Bollinger_Band_Range_BB,COUNTA(E$32:E283)))-Standard_Deviation_BB*IFERROR(STDEV(OFFSET(E283,1,,-MIN(Bollinger_Band_Range_BB,COUNTA(E$32:E283)))),0)),0)","v":225.51997737187671}]
[null,null,null,"2023-01-04",229.10000600000001,{"$f":"IF(Data_BB[[#This Row],[Adj Close]]<E286,TRUE,\"\")","v":""},{"$f":"IF(F284=Data_BB[[#This Row],[Up]],0,1)","v":0},{"$f":"SUM($G$33:G285)","v":125},125,{"$f":"AVERAGE(OFFSET(E284,1,,-MIN(Bollinger_Band_Range_BB,COUNTA(E$32:E284)))+Standard_Deviation_BB*IFERROR(STDEV(OFFSET(E284,1,,-MIN(Bollinger_Band_Range_BB,COUNTA(E$32:E284)))),0))","v":264.3844297755403},{"$f":"IFERROR(AVERAGE(OFFSET(E284,1,,-MIN(Bollinger_Band_Range_BB,COUNTA(E$32:E284)))-Standard_Deviation_BB*IFERROR(STDEV(OFFSET(E284,1,,-MIN(Bollinger_Band_Range_BB,COUNTA(E$32:E284)))),0)),0)","v":222.34156972445962}]
[null,null,null,"2023-01-05",222.30999800000001,{"$f":"IF(Data_BB[[#This Row],[Adj Close]]<E287,TRUE,\"\")","v":true},{"$f":"IF(F285=Data_BB[[#This Row],[Up]],0,1)","v":1},{"$f":"SUM($G$33:G286)","v":126},125,{"$f":"AVERAGE(OFFSET(E285,1,,-MIN(Bollinger_Band_Range_BB,COUNTA(E$32:E285)))+Standard_Deviation_BB*IFERROR(STDEV(OFFSET(E285,1,,-MIN(Bollinger_Band_Range_BB,COUNTA(E$32:E285)))),0))","v":267.48246755847288},{"$f":"IFERROR(AVERAGE(OFFSET(E285,1,,-MIN(Bollinger_Band_Range_BB,COUNTA(E$32:E285)))-Standard_Deviation_BB*IFERROR(STDEV(OFFSET(E285,1,,-MIN(Bollinger_Band_Range_BB,COUNTA(E$32:E285)))),0)),0)","v":216.96253224152707}]
[null,null,null,"2023-01-06",224.929993,{"$f":"IF(Data_BB[[#This Row],[Adj Close]]<E288,TRUE,\"\")","v":true},{"$f":"IF(F286=Data_BB[[#This Row],[Up]],0,1)","v":0},{"$f":"SUM($G$33:G287)","v":126},126,{"$f":"AVERAGE(OFFSET(E286,1,,-MIN(Bollinger_Band_Range_BB,COUNTA(E$32:E286)))+Standard_Deviation_BB*IFERROR(STDEV(OFFSET(E286,1,,-MIN(Bollinger_Band_Range_BB,COUNTA(E$32:E286)))),0))","v":268.97372181425442},{"$f":"IFERROR(AVERAGE(OFFSET(E286,1,,-MIN(Bollinger_Band_Range_BB,COUNTA(E$32:E286)))-Standard_Deviation_BB*IFERROR(STDEV(OFFSET(E286,1,,-MIN(Bollinger_Band_Range_BB,COUNTA(E$32:E286)))),0)),0)","v":213.52727778574564}]
[null,null,null,"2023-01-09",227.11999499999999,{"$f":"IF(Data_BB[[#This Row],[Adj Close]]<E289,TRUE,\"\")","v":true},{"$f":"IF(F287=Data_BB[[#This Row],[Up]],0,1)","v":0},{"$f":"SUM($G$33:G288)","v":126},126,{"$f":"AVERAGE(OFFSET(E287,1,,-MIN(Bollinger_Band_Range_BB,COUNTA(E$32:E287)))+Standard_Deviation_BB*IFERROR(STDEV(OFFSET(E287,1,,-MIN(Bollinger_Band_Range_BB,COUNTA(E$32:E287)))),0))","v":269.141591788342},{"$f":"IFERROR(AVERAGE(OFFSET(E287,1,,-MIN(Bollinger_Band_Range_BB,COUNTA(E$32:E287)))-Standard_Deviation_BB*IFERROR(STDEV(OFFSET(E287,1,,-MIN(Bollinger_Band_Range_BB,COUNTA(E$32:E287)))),0)),0)","v":211.33140791165806}]
[null,null,null,"2023-01-10",228.85000600000001,{"$f":"IF(Data_BB[[#This Row],[Adj Close]]<E290,TRUE,\"\")","v":true},{"$f":"IF(F288=Data_BB[[#This Row],[Up]],0,1)","v":0},{"$f":"SUM($G$33:G289)","v":126},{"$f":"N(H288)","v":126},{"$f":"AVERAGE(OFFSET(E288,1,,-MIN(Bollinger_Band_Range_BB,COUNTA(E$32:E288)))+Standard_Deviation_BB*IFERROR(STDEV(OFFSET(E288,1,,-MIN(Bollinger_Band_Range_BB,COUNTA(E$32:E288)))),0))","v":269.03380752369588},{"$f":"IFERROR(AVERAGE(OFFSET(E288,1,,-MIN(Bollinger_Band_Range_BB,COUNTA(E$32:E288)))-Standard_Deviation_BB*IFERROR(STDEV(OFFSET(E288,1,,-MIN(Bollinger_Band_Range_BB,COUNTA(E$32:E288)))),0)),0)","v":209.78219297630412}]
[null,null,null,"2023-01-11",235.770004,{"$f":"IF(Data_BB[[#This Row],[Adj Close]]<E291,TRUE,\"\")","v":true},{"$f":"IF(F289=Data_BB[[#This Row],[Up]],0,1)","v":0},{"$f":"SUM($G$33:G290)","v":126},126,{"$f":"AVERAGE(OFFSET(E289,1,,-MIN(Bollinger_Band_Range_BB,COUNTA(E$32:E289)))+Standard_Deviation_BB*IFERROR(STDEV(OFFSET(E289,1,,-MIN(Bollinger_Band_Range_BB,COUNTA(E$32:E289)))),0))","v":266.7845968475026},{"$f":"IFERROR(AVERAGE(OFFSET(E289,1,,-MIN(Bollinger_Band_Range_BB,COUNTA(E$32:E289)))-Standard_Deviation_BB*IFERROR(STDEV(OFFSET(E289,1,,-MIN(Bollinger_Band_Range_BB,COUNTA(E$32:E289)))),0)),0)","v":210.35740455249737}]
[null,null,null,"2023-01-12",238.509995,{"$f":"IF(Data_BB[[#This Row],[Adj Close]]<E292,TRUE,\"\")","v":true},{"$f":"IF(F290=Data_BB[[#This Row],[Up]],0,1)","v":0},{"$f":"SUM($G$33:G291)","v":126},126,{"$f":"AVERAGE(OFFSET(E290,1,,-MIN(Bollinger_Band_Range_BB,COUNTA(E$32:E290)))+Standard_Deviation_BB*IFERROR(STDEV(OFFSET(E290,1,,-MIN(Bollinger_Band_Range_BB,COUNTA(E$32:E290)))),0))","v":262.72037312747784},{"$f":"IFERROR(AVERAGE(OFFSET(E290,1,,-MIN(Bollinger_Band_Range_BB,COUNTA(E$32:E290)))-Standard_Deviation_BB*IFERROR(STDEV(OFFSET(E290,1,,-MIN(Bollinger_Band_Range_BB,COUNTA(E$32:E290)))),0)),0)","v":212.58062647252214}]
[null,null,null,"2023-01-13",239.229996,{"$f":"IF(Data_BB[[#This Row],[Adj Close]]<E293,TRUE,\"\")","v":true},{"$f":"IF(F291=Data_BB[[#This Row],[Up]],0,1)","v":0},{"$f":"SUM($G$33:G292)","v":126},126,{"$f":"AVERAGE(OFFSET(E291,1,,-MIN(Bollinger_Band_Range_BB,COUNTA(E$32:E291)))+Standard_Deviation_BB*IFERROR(STDEV(OFFSET(E291,1,,-MIN(Bollinger_Band_Range_BB,COUNTA(E$32:E291)))),0))","v":257.74172328788757},{"$f":"IFERROR(AVERAGE(OFFSET(E291,1,,-MIN(Bollinger_Band_Range_BB,COUNTA(E$32:E291)))-Standard_Deviation_BB*IFERROR(STDEV(OFFSET(E291,1,,-MIN(Bollinger_Band_Range_BB,COUNTA(E$32:E291)))),0)),0)","v":215.76027581211247}]
[null,null,null,"2023-01-17",240.35000600000001,{"$f":"IF(Data_BB[[#This Row],[Adj Close]]<E294,TRUE,\"\")","v":""},{"$f":"IF(F292=Data_BB[[#This Row],[Up]],0,1)","v":1},{"$f":"SUM($G$33:G293)","v":127},126,{"$f":"AVERAGE(OFFSET(E292,1,,-MIN(Bollinger_Band_Range_BB,COUNTA(E$32:E292)))+Standard_Deviation_BB*IFERROR(STDEV(OFFSET(E292,1,,-MIN(Bollinger_Band_Range_BB,COUNTA(E$32:E292)))),0))","v":255.65147277164027},{"$f":"IFERROR(AVERAGE(OFFSET(E292,1,,-MIN(Bollinger_Band_Range_BB,COUNTA(E$32:E292)))-Standard_Deviation_BB*IFERROR(STDEV(OFFSET(E292,1,,-MIN(Bollinger_Band_Range_BB,COUNTA(E$32:E292)))),0)),0)","v":216.98452742835974}]
[null,null,null,"2023-01-18",235.80999800000001,{"$f":"IF(Data_BB[[#This Row],[Adj Close]]<E295,TRUE,\"\")","v":""},{"$f":"IF(F293=Data_BB[[#This Row],[Up]],0,1)","v":0},{"$f":"SUM($G$33:G294)","v":127},127,{"$f":"AVERAGE(OFFSET(E293,1,,-MIN(Bollinger_Band_Range_BB,COUNTA(E$32:E293)))+Standard_Deviation_BB*IFERROR(STDEV(OFFSET(E293,1,,-MIN(Bollinger_Band_Range_BB,COUNTA(E$32:E293)))),0))","v":254.28152765971396},{"$f":"IFERROR(AVERAGE(OFFSET(E293,1,,-MIN(Bollinger_Band_Range_BB,COUNTA(E$32:E293)))-Standard_Deviation_BB*IFERROR(STDEV(OFFSET(E293,1,,-MIN(Bollinger_Band_Range_BB,COUNTA(E$32:E293)))),0)),0)","v":217.46647214028604}]
[null,null,null,"2023-01-19",231.929993,{"$f":"IF(Data_BB[[#This Row],[Adj Close]]<E296,TRUE,\"\")","v":true},{"$f":"IF(F294=Data_BB[[#This Row],[Up]],0,1)","v":1},{"$f":"SUM($G$33:G295)","v":128},127,{"$f":"AVERAGE(OFFSET(E294,1,,-MIN(Bollinger_Band_Range_BB,COUNTA(E$32:E294)))+Standard_Deviation_BB*IFERROR(STDEV(OFFSET(E294,1,,-MIN(Bollinger_Band_Range_BB,COUNTA(E$32:E294)))),0))","v":253.73917926011717},{"$f":"IFERROR(AVERAGE(OFFSET(E294,1,,-MIN(Bollinger_Band_Range_BB,COUNTA(E$32:E294)))-Standard_Deviation_BB*IFERROR(STDEV(OFFSET(E294,1,,-MIN(Bollinger_Band_Range_BB,COUNTA(E$32:E294)))),0)),0)","v":217.15682013988288}]
[null,null,null,"2023-01-20",240.220001,{"$f":"IF(Data_BB[[#This Row],[Adj Close]]<E297,TRUE,\"\")","v":true},{"$f":"IF(F295=Data_BB[[#This Row],[Up]],0,1)","v":0},{"$f":"SUM($G$33:G296)","v":128},128,{"$f":"AVERAGE(OFFSET(E295,1,,-MIN(Bollinger_Band_Range_BB,COUNTA(E$32:E295)))+Standard_Deviation_BB*IFERROR(STDEV(OFFSET(E295,1,,-MIN(Bollinger_Band_Range_BB,COUNTA(E$32:E295)))),0))","v":253.42952767967873},{"$f":"IFERROR(AVERAGE(OFFSET(E295,1,,-MIN(Bollinger_Band_Range_BB,COUNTA(E$32:E295)))-Standard_Deviation_BB*IFERROR(STDEV(OFFSET(E295,1,,-MIN(Bollinger_Band_Range_BB,COUNTA(E$32:E295)))),0)),0)","v":217.30847152032129}]
[null,null,null,"2023-01-23",242.58000200000001,{"$f":"IF(Data_BB[[#This Row],[Adj Close]]<E298,TRUE,\"\")","v":""},{"$f":"IF(F296=Data_BB[[#This Row],[Up]],0,1)","v":1},{"$f":"SUM($G$33:G297)","v":129},128,{"$f":"AVERAGE(OFFSET(E296,1,,-MIN(Bollinger_Band_Range_BB,COUNTA(E$32:E296)))+Standard_Deviation_BB*IFERROR(STDEV(OFFSET(E296,1,,-MIN(Bollinger_Band_Range_BB,COUNTA(E$32:E296)))),0))","v":252.93555661085051},{"$f":"IFERROR(AVERAGE(OFFSET(E296,1,,-MIN(Bollinger_Band_Range_BB,COUNTA(E$32:E296)))-Standard_Deviation_BB*IFERROR(STDEV(OFFSET(E296,1,,-MIN(Bollinger_Band_Range_BB,COUNTA(E$32:E296)))),0)),0)","v":217.61744348914945}]
[null,null,null,"2023-01-24",242.03999300000001,{"$f":"IF(Data_BB[[#This Row],[Adj Close]]<E299,TRUE,\"\")","v":""},{"$f":"IF(F297=Data_BB[[#This Row],[Up]],0,1)","v":0},{"$f":"SUM($G$33:G298)","v":129},129,{"$f":"AVERAGE(OFFSET(E297,1,,-MIN(Bollinger_Band_Range_BB,COUNTA(E$32:E297)))+Standard_Deviation_BB*IFERROR(STDEV(OFFSET(E297,1,,-MIN(Bollinger_Band_Range_BB,COUNTA(E$32:E297)))),0))","v":253.61118697087736},{"$f":"IFERROR(AVERAGE(OFFSET(E297,1,,-MIN(Bollinger_Band_Range_BB,COUNTA(E$32:E297)))-Standard_Deviation_BB*IFERROR(STDEV(OFFSET(E297,1,,-MIN(Bollinger_Band_Range_BB,COUNTA(E$32:E297)))),0)),0)","v":217.32681222912265}]
[null,null,null,"2023-01-25",240.61000100000001,{"$f":"IF(Data_BB[[#This Row],[Adj Close]]<E300,TRUE,\"\")","v":true},{"$f":"IF(F298=Data_BB[[#This Row],[Up]],0,1)","v":1},{"$f":"SUM($G$33:G299)","v":130},129,{"$f":"AVERAGE(OFFSET(E298,1,,-MIN(Bollinger_Band_Range_BB,COUNTA(E$32:E298)))+Standard_Deviation_BB*IFERROR(STDEV(OFFSET(E298,1,,-MIN(Bollinger_Band_Range_BB,COUNTA(E$32:E298)))),0))","v":253.90795754214659},{"$f":"IFERROR(AVERAGE(OFFSET(E298,1,,-MIN(Bollinger_Band_Range_BB,COUNTA(E$32:E298)))-Standard_Deviation_BB*IFERROR(STDEV(OFFSET(E298,1,,-MIN(Bollinger_Band_Range_BB,COUNTA(E$32:E298)))),0)),0)","v":217.2180421578534}]
[null,null,null,"2023-01-26",248,{"$f":"IF(Data_BB[[#This Row],[Adj Close]]<E301,TRUE,\"\")","v":true},{"$f":"IF(F299=Data_BB[[#This Row],[Up]],0,1)","v":0},{"$f":"SUM($G$33:G300)","v":130},130,{"$f":"AVERAGE(OFFSET(E299,1,,-MIN(Bollinger_Band_Range_BB,COUNTA(E$32:E299)))+Standard_Deviation_BB*IFERROR(STDEV(OFFSET(E299,1,,-MIN(Bollinger_Band_Range_BB,COUNTA(E$32:E299)))),0))","v":256.26432549779616},{"$f":"IFERROR(AVERAGE(OFFSET(E299,1,,-MIN(Bollinger_Band_Range_BB,COUNTA(E$32:E299)))-Standard_Deviation_BB*IFERROR(STDEV(OFFSET(E299,1,,-MIN(Bollinger_Band_Range_BB,COUNTA(E$32:E299)))),0)),0)","v":215.9656735022038}]
[null,null,null,"2023-01-27",248.16000399999999,{"$f":"IF(Data_BB[[#This Row],[Adj Close]]<E302,TRUE,\"\")","v":""},{"$f":"IF(F300=Data_BB[[#This Row],[Up]],0,1)","v":1},{"$f":"SUM($G$33:G301)","v":131},130,{"$f":"AVERAGE(OFFSET(E300,1,,-MIN(Bollinger_Band_Range_BB,COUNTA(E$32:E300)))+Standard_Deviation_BB*IFERROR(STDEV(OFFSET(E300,1,,-MIN(Bollinger_Band_Range_BB,COUNTA(E$32:E300)))),0))","v":258.45587345940419},{"$f":"IFERROR(AVERAGE(OFFSET(E300,1,,-MIN(Bollinger_Band_Range_BB,COUNTA(E$32:E300)))-Standard_Deviation_BB*IFERROR(STDEV(OFFSET(E300,1,,-MIN(Bollinger_Band_Range_BB,COUNTA(E$32:E300)))),0)),0)","v":215.13712604059575}]

{"sheet":"PnF_BB","index":8,"n_rows":41,"n_cols":136,"rows_kept":41,"cut":false,"hidden":false,"merged":[[2,0,2,4]]}
[{"$f":"IF(ISERROR(RIGHT(CELL(\"filename\",A1),LEN(CELL(\"filename\",A1))-FIND(\"]\",CELL(\"filename\",A1)))),\n\"\",\nRIGHT(CELL(\"filename\",A1),LEN(CELL(\"filename\",A1))-FIND(\"]\",CELL(\"filename\",A1))))","v":"PnF_BB"}]
[{"$f":"Model_Name","v":"SP Point and Figure Chart - Complete.xlsm"}]
["Navigator"]
[null,"Error Checks:",null,null,null,{"$f":"Overall_Error_Check","v":0}]
[]
[null,{"$f":"MAX($B$5:$B5)+1","v":1},{"$f":"A1","v":"PnF_BB"}]
[]
[null,null,null,null,null,null,"Date"]
[null,null,null,null,null,null,{"$f":"_xlfn.SEQUENCE(,MAX(Transform_Data_BB[Unique Index]))","v":1},2,3,4,5,6,7,8,9,10,11,12,13,14,15,16,17,18,19,20,21,22,23,24,25,26,27,28,29,30,31,32,33,34,35,36,37,38,39,40,41,42,43,44,45,46,47,48,49,50,51,52,53,54,55,56,57,58,59,60,61,62,63,64,65,66,67,68,69,70,71,72,73,74,75,76,77,78,79,80,81,82,83,84,85,86,87,88,89,90,91,92,93,94,95,96,97,98,99,100,101,102,103,104,105,106,107,108,109,110,111,112,113,114,115,116,117,118,119,120,121,122,123,124,125,126,127,128,129,130]
[null,null,null,null,"Lower Bin","Upper Bin",{"$f":"TRANSPOSE(Transform_Data_BB[Date])","v":"2022-01-03"},"2022-01-06","2022-01-12","2022-01-13","2022-01-14","2022-01-18","2022-01-19","2022-01-21","2022-01-24","2022-01-25","2022-01-31","2022-02-01","2022-02-02","2022-02-03","2022-02-04","2022-02-07","2022-02-09","2022-02-14","2022-02-15","2022-02-23","2022-02-28","2022-03-01","2022-03-02","2022-03-08","2022-03-09","2022-03-14","2022-03-18","2022-03-21","2022-03-22","2022-03-23","2022-03-24","2022-03-25","2022-03-29","2022-03-31","2022-04-04","2022-04-06","2022-04-07","2022-04-12","2022-04-13","2022-04-14","2022-04-20","2022-04-22","2022-04-25","2022-04-26","2022-04-28","2022-04-29","2022-05-02","2022-05-03","2022-05-04","2022-05-09","2022-05-10","2022-05-12","2022-05-17","2022-05-20","2022-05-23","2022-05-24","2022-05-27","2022-05-31","2022-06-02","2022-06-06","2022-06-07","2022-06-13","2022-06-15","2022-06-16","2022-06-21","2022-06-22","2022-06-24","2022-06-28","2022-06-29","2022-06-30","2022-07-07","2022-07-13","2022-07-15","2022-07-18","2022-07-21","2022-07-26","2022-07-29","2022-08-02","2022-08-04","2022-08-08","2022-08-10","2022-08-11","2022-08-15","2022-08-24","2022-08-25","2022-09-06","2022-09-12","2022-09-13","2022-09-14","2022-09-21","2022-09-22","2022-09-27","2022-09-28","2022-09-30","2022-10-05","2022-10-11","2022-10-13","2022-10-14","2022-10-18","2022-10-20","2022-10-25","2022-10-27","2022-10-28","2022-11-03","2022-11-08","2022-11-09","2022-11-11","2022-11-14","2022-11-16","2022-11-18","2022-11-23","2022-11-29","2022-11-30","2022-12-01","2022-12-02","2022-12-07","2022-12-08","2022-12-09","2022-12-14","2022-12-19","2022-12-21","2022-12-22","2022-12-23","2022-12-28","2022-12-29","2023-01-05","2023-01-17","2023-01-19","2023-01-23","2023-01-25"]
[null,null,null,"$",{"$f":"_xlfn.SEQUENCE(Number_of_Bins_BB+1,,Max_BB-Width_BB,-Width_BB)","v":345.66333109263007},{"$f":"_xlfn.SEQUENCE(Number_of_Bins_BB+1,,Max_BB,-Width_BB)","v":350.58437925611059},{"$f":"\nIF((_xlfn.ANCHORARRAY($F11)>=TRANSPOSE(Transform_Data_BB[Min Stock]))\n  *(_xlfn.ANCHORARRAY($E11)<=TRANSPOSE(Transform_Data_BB[Max Stock])),\n\n_xlfn.IFS(Starting_Symbol_BB=Up_Symbol_BB,IF(MOD(_xlfn.ANCHORARRAY(G9),2)=1,Up_Symbol_BB,Down_Symbol_BB),\n      Starting_Symbol_BB=Down_Symbol_BB,IF(MOD(_xlfn.ANCHORARRAY(G9),2)=1,Down_Symbol_BB,Up_Symbol_BB)),\n\n_xlfn.IFS((_xlfn.ANCHORARRAY($F11)>=TRANSPOSE(Transform_Data_BB[Min Upper Band]))\n    *(_xlfn.ANCHORARRAY($E11)<=TRANSPOSE(Transform_Data_BB[Max Upper Band])),\nBollinger_Band_Symbol_BB,\n\n       (_xlfn.ANCHORARRAY($F11)>=TRANSPOSE(Transform_Data_BB[Min Lower Band]))\n     *(_xlfn.ANCHORARRAY($E11)<=TRANSPOSE(Transform_Data_BB[Max Lower Band])),\nBollinger_Band_Symbol_BB,\n\nTRUE,\"\"))","v":"+++"},"+++","","","","","","","","","","","","","","","","","","","","","","","","","","","","","","","","","","","","","","","","","","","","","","","","","","","","","","","","","","","","","","","","","","","","","","","","","","","","","","","","","","","","","","","","","","","","","","","","","","","","","","","","","","","","","","","","","","","","","","","","","","","","","","","",""]
[null,null,null,null,340.74228292914955,345.66333109263007,"+++","+++","+++","+++","","","","+++","+++","+++","","","","","","","","","","","","","","","","","","","","","","","","","","","","","","","","","","","","","","","","","","","","","","","","","","","","","","","","","","","","","","","","","","","","","","","","","","","","","","","","","","","","","","","","","","","","","","","","","","","","","","","","","","","","","","","","","","","","","","","",""]
[null,null,null,null,335.82123476566903,340.74228292914955,"+++","+++","+++","+++","+++","+++","+++","+++","","+++","+++","","","","","","","","","","","","","","","","","","","","","","","","","","","","","","+++","+++","","","","","","","","","","","","","","","","","","","","","","","","","","","","","","","","","","","","","","","","","","","","","","","","","","","","","","","","","","","","","","","","","","","","","","","","","","","","","","","","","","","","","","","",""]
[null,null,null,null,330.90018660218851,335.82123476566903,"O","","","","","","","","","","+++","+++","","","","","","","","","","","","","","","","","","","","","","+++","+++","+++","+++","","+++","+++","+++","+++","+++","+++","","","","","","","","","","","","","","","","","","","","","","","","","","","","","","","","","","","","","","","","","","","","","","","","","","","","","","","","","","","","","","","","","","","","","","","","","","","","","","","","","","","","","",""]
[null,null,null,null,325.97913843870799,330.90018660218851,"O","","","","","","","","","","","+++","+++","+++","","","","","","","","","","","","","","","","","","","+++","+++","","","+++","+++","+++","","","","","+++","+++","","","","","","","","","","","","","","","","","","","","","","","","","","","","","","","","","","","","","","","","","","","","","","","","","","","","","","","","","","","","","","","","","","","","","","","","","","","","","","","","","","","","",""]
[null,null,null,null,321.05809027522747,325.97913843870799,"O","","","","","","","","","","","","","+++","+++","+++","+++","","+++","+++","+++","","","","","","","","","","","+++","+++","","","","","","","","","","","","+++","+++","","","","","","","","","","","","","","","","","","","","","","","","","","","","","","","","","","","","","","","","","","","","","","","","","","","","","","","","","","","","","","","","","","","","","","","","","","","","","","","","","","","",""]
[null,null,null,null,316.13704211174695,321.05809027522747,"O","","","","","","","","","","","","","","","","+++","+++","+++","","+++","+++","+++","+++","","","","","","+++","+++","+++","","","","","","","","","","","","","","+++","+++","","","","","","","","","","","","","","","","","","","","","","","","","","","","","","","","","","","","","","","+++","","","","","","","","","","","","","","","","","","","","","","","","","","","","","","","","","","","","","","","","","","","",""]
[null,null,null,null,311.21599394826643,316.13704211174695,"O","X","O","","","","","","","","","","","","","","","","","","","","+++","+++","+++","+++","+++","+++","+++","+++","","X","O","X","O","","","","","","","","","","","","+++","+++","","","","","","","","","","","","","","","","","","","","","","","","","","","","","","","","","","","+++","","+++","+++","","","","","","","","","","","","","","","","","","","","","","","","","","","","","","","","","","","","","","","","","","","",""]
[null,null,null,null,306.29494578478591,311.21599394826643,"O","X","O","X","O","","","","","X","O","X","O","","","X","O","","","","","","","","+++","+++","+++","","","","","X","O","X","O","","","","","","","","","","","","","+++","","","","","","","","","","","","","","","","","","","","","","","","","","","","","","","","","+++","+++","+++","","+++","+++","+++","+++","","","","","","","","","","","","","","","","","","","","","","","","","","","","","","","","","","","","","","","","","",""]
[null,null,null,null,301.37389762130539,306.29494578478591,"+++","","O","X","O","","","","","X","O","X","O","X","O","X","O","","","","","","","","","","","X","O","X","O","X","O","X","O","","","","","","","","","","","","","+++","+++","","+++","+++","+++","+++","+++","+++","","","","","","","","","","","","","","","","","","","","","","","","+++","+++","","+++","","+++","","","+++","+++","","","","","","","","","","","","","","","","","","","","","","","","","","","","","","","","","","","","","","","","",""]
[null,null,null,null,296.45284945782487,301.37389762130539,"+++","","","","O","X","O","","","X","","","O","X","O","X","O","X","O","X","O","X","O","","","X","O","X","O","X","","","","","O","X","O","","","","","","","","","","","","+++","+++","+++","","","","","+++","","","","","","","","","","","","","","","","","","","","","","","+++","+++","","","+++","+++","+++","","","","+++","","","","","","","","","","","","","","","","","","","","","","","","","","","","","","","","","","","","","","","","",""]
[null,null,null,null,291.53180129434435,296.45284945782487,"+++","+++","+++","","","","O","X","O","X","","","","","","","O","X","O","X","O","X","O","","","X","","","","","","","","","","","O","","","","","","","","","","","","","","","","","","","+++","+++","+++","","","","","+++","+++","+++","+++","+++","","","","","","","","","","","+++","+++","","","X","O","","","","","","+++","","","","","","","","","","","","","","","","","","","","","","","","","","","","","","","","","","","","","","","","",""]
[null,null,null,null,286.61075313086383,291.53180129434435,"+++","+++","+++","+++","+++","","","","O","X","","","","","","","","","O","X","","","O","","","X","","","","","","","","","","","O","","","","","","","X","O","","","X","O","","","","","","","","","+++","","","+++","+++","+++","","","","+++","+++","+++","+++","","","","","","","+++","+++","","X","O","X","O","","","","","","+++","+++","+++","","","","","","","","","","","","","","","","","","","","","","","","","","","","","","","","","","","","","","",""]
[null,null,null,null,281.68970496738331,286.61075313086383,"","","","","+++","+++","+++","","O","X","","","","","","","+++","","O","X","","","O","X","O","X","","","","","","","","","","","O","X","O","X","O","","","X","O","X","O","X","O","","","","","","","","","+++","+++","+++","+++","","","","","","","","","+++","","","","","","+++","+++","X","O","X","O","X","O","","","","","","","","+++","","","","","","","","","","","","","","","","","","","","","","","","","","","","","","","","","","","","","","",""]
[null,null,null,null,276.76865680390279,281.68970496738331,"","","","","","","+++","+++","","","","+++","+++","+++","+++","+++","+++","+++","O","X","","","O","X","O","X","","","","","","","","","","","O","X","O","X","O","X","O","X","O","X","O","X","O","","","","","","","","","","","","","","","","","","","","","+++","+++","+++","+++","","","X","O","X","O","X","","","O","X","O","","","","","","+++","+++","+++","","","","","","","","","","","","","","","","","","","","","","","","","","","","","","","","","","","","",""]
[null,null,null,null,271.84760864042227,276.76865680390279,"","","","","","","","+++","+++","+++","+++","+++","","","","","","","+++","","+++","+++","O","X","O","X","","","","","","","","","","","+++","+++","","","O","X","O","X","O","X","","","O","","","","","","","X","O","X","O","","","","","","","","","","","","","","+++","+++","+++","X","O","X","","","","","O","X","O","","","","","","","","+++","+++","+++","","","","","","","","","","","","","","","","","","+++","+++","","","","","","","","","","","","","","","",""]
[null,null,null,null,266.92656047694175,271.84760864042227,"","","","","","","","","+++","+++","","","","","","","","","+++","+++","+++","","+++","","+++","","","","","","","","","","","+++","+++","+++","+++","+++","","","O","X","","","","","O","X","O","","","","","X","O","X","O","X","O","","","","","","","","","X","O","","","","","X","","","","","","","","","O","","","","","","","","","","+++","","","","","","","","","","","","","","","","+++","+++","+++","+++","+++","","","","","","","","+++","+++","+++","+++","","","",""]
[null,null,null,null,262.00551231346122,266.92656047694175,"","","","","","","","","","","","","","","","","","","","","","","+++","+++","+++","+++","+++","+++","+++","+++","+++","+++","","","+++","+++","","","","+++","","","","","","","","","O","X","O","X","O","","","X","","","","","O","","","","","X","O","","","X","O","","","X","O","X","","","","","","","+++","+++","O","X","O","","","","","","","","+++","","","","","","","","","","","+++","+++","+++","+++","+++","+++","","","","+++","+++","","+++","+++","+++","+++","+++","+++","+++","+++","+++","","","",""]
[null,null,null,null,257.0844641499807,262.00551231346122,"","","","","","","","","","","","","","","","","","","","","","","","","","","","","","","","+++","+++","+++","+++","","","","","+++","+++","","","","","","","+++","+++","+++","O","X","O","X","O","X","","","","","O","","","","","X","O","X","O","X","O","","","X","O","X","","","","","","","+++","","O","X","O","","","","","","","","+++","+++","+++","+++","","+++","+++","+++","+++","+++","+++","+++","","","","","","","","","","+++","+++","X","O","","","","","","","+++","","","","+++"]
[null,null,null,null,252.16341598650015,257.0844641499807,"","","","","","","","","","","","","","","","","","","","","","","","","","","","","","","","","+++","+++","","","","","","","+++","+++","","","","","+++","+++","","","O","X","O","X","","","","","","","O","","","X","O","X","O","X","O","X","O","X","O","X","O","X","","","","","","","+++","","O","X","O","","","","","","","","","","","+++","+++","+++","","","","","","","","","","","","X","O","X","O","","","X","O","","","","","","","+++","+++","+++","+++","+++"]
[null,null,null,null,247.24236782301961,252.16341598650015,"","","","","","","","","","","","","","","","","","","","","","","","","","","","","","","","","","","","","","","","","","+++","+++","+++","+++","+++","+++","","","","+++","+++","O","X","","","","","","","O","X","O","X","O","X","","","","","O","X","","","O","X","","","","","","","+++","","+++","","O","X","O","","","","","X","O","","","","","X","O","","","","","","","","","X","O","X","","","O","X","O","X","O","","","","","","","","","","","X"]
[null,null,null,null,242.32131965953906,247.24236782301961,"","","","","","","","","","","","","","","","","","","","","","","","","","","","","","","","","","","","","","","","","","","+++","+++","","","","","","","","+++","","","","","","","","","O","X","O","X","","","","","","","","","","+++","+++","+++","","","","","","","+++","","+++","","","","O","","","","","X","O","","","","","X","O","","","","","X","O","","","X","O","X","","","O","X","O","X","O","X","O","","","","","","","X","O","X"]
[null,null,null,null,237.40027149605851,242.32131965953906,"","","","","","","","","","","","","","","","","","","","","","","","","","","","","","","","","","","","","","","","","","","","","","","","","","","","+++","+++","","","","","+++","+++","+++","O","X","","","","","","","","","","","+++","+++","","+++","+++","","","","","+++","+++","","+++","","","","O","X","O","X","O","X","O","","","X","O","X","O","","","","","X","O","X","O","X","O","X","","","","","","","O","X","O","X","O","X","O","X","O","X","O","X"]
[null,null,null,null,232.47922333257796,237.40027149605851,"","","","","","","","","","","","","","","","","","","","","","","","","","","","","","","","","","","","","","","","","","","","","","","","","","","","","+++","","","+++","+++","+++","","","+++","+++","","","","","","","","","+++","+++","+++","","","","+++","+++","","+++","+++","+++","","","+++","+++","","","","","O","X","O","X","O","X","O","X","O","X","O","X","O","","","X","","","","","","","","","","","","","","","","","O","X","O","X","O","X","",""]
[null,null,null,null,227.55817516909741,232.47922333257796,"","","","","","","","","","","","","","","","","","","","","","","","","","","","","","","","","","","","","","","","","","","","","","","","","","","","","+++","+++","+++","+++","","","","","","+++","+++","+++","","","","","+++","+++","+++","","","","","","","+++","+++","+++","","","","","","+++","+++","+++","+++","","","","O","X","O","X","O","X","","","O","X","O","X","O","X","","","","","","","","","","+++","+++","+++","+++","+++","+++","+++","+++","","O","X","O","X","",""]
[null,null,null,null,222.63712700561686,227.55817516909741,"","","","","","","","","","","","","","","","","","","","","","","","","","","","","","","","","","","","","","","","","","","","","","","","","","","","","","","","","","","","","","","","+++","+++","+++","+++","+++","+++","","","","","","","","","","","","","","","","","","","","+++","+++","+++","","","","O","X","","","","","O","X","O","X","O","X","","","","","","","","","+++","+++","","","","","","","+++","+++","O","X","","","",""]
[null,null,null,null,217.71607884213631,222.63712700561686,"","","","","","","","","","","","","","","","","","","","","","","","","","","","","","","","","","","","","","","","","","","","","","","","","","","","","","","","","","","","","","","","","","","","","","","","","","","","","","","","","","","","","","","","","","","+++","+++","+++","","+++","+++","","","","","","","O","X","","","","","","","","","","","+++","","","","","","","","","","O","X","","","",""]
[null,null,null,null,212.79503067865576,217.71607884213631,"","","","","","","","","","","","","","","","","","","","","","","","","","","","","","","","","","","","","","","","","","","","","","","","","","","","","","","","","","","","","","","","","","","","","","","","","","","","","","","","","","","","","","","","","","","","","+++","+++","+++","+++","+++","+++","+++","+++","+++","","O","X","","","","","","","","","","","+++","","","","","","","","","","+++","+++","+++","+++","+++","+++"]
[null,null,null,null,207.87398251517521,212.79503067865576,"","","","","","","","","","","","","","","","","","","","","","","","","","","","","","","","","","","","","","","","","","","","","","","","","","","","","","","","","","","","","","","","","","","","","","","","","","","","","","","","","","","","","","","","","","","","","","","","","","","","","+++","+++","+++","","","","","","","","","","","+++","+++","","","","","","","","","","","+++","","","",""]
[null,null,null,null,202.95293435169467,207.87398251517521,"","","","","","","","","","","","","","","","","","","","","","","","","","","","","","","","","","","","","","","","","","","","","","","","","","","","","","","","","","","","","","","","","","","","","","","","","","","","","","","","","","","","","","","","","","","","","","","","","","","","","","","+++","+++","+++","+++","+++","+++","+++","+++","+++","+++","+++","+++","","","","","","","","","","","","","","","",""]
[null,null,null,null,198.03188618821412,202.95293435169467,"","","","","","","","","","","","","","","","","","","","","","","","","","","","","","","","","","","","","","","","","","","","","","","","","","","","","","","","","","","","","","","","","","","","","","","","","","","","","","","","","","","","","","","","","","","","","","","","","","","","","","","","","","","","","+++","+++","","","","","","","","","","","","","","","","","","","",""]

{"sheet":"Error Checks","index":9,"n_rows":17,"n_cols":9,"rows_kept":17,"cut":false,"hidden":false,"merged":[[2,0,2,4]]}
[{"$f":"IF(ISERROR(RIGHT(CELL(\"filename\",A1),LEN(CELL(\"filename\",A1))-FIND(\"]\",CELL(\"filename\",A1)))),\n\"\",\nRIGHT(CELL(\"filename\",A1),LEN(CELL(\"filename\",A1))-FIND(\"]\",CELL(\"filename\",A1))))","v":"Error Checks"}]
[{"$f":"Model_Name","v":"SP Point and Figure Chart - Complete.xlsm"}]
["Navigator"]
[null,"Error Checks:",null,null,null,{"$f":"Overall_Error_Check","v":0}]
[]
[null,{"$f":"MAX($B$5:$B5)+1","v":1},"Error Checks"]
[]
[null,null,"Summary of Errors"]
[]
[null,null,null,"Assumptions"]
[]
[null,null,null,null,"Example"]
[]
[]
[]
[]
[null,null,null,null,{"$f":"C8","v":"Summary of Errors"},null,null,null,{"$f":"MIN(1,SUM(I11:I15))","v":0}]