{"text_format":"1","workbook":"xlsx","n_sheets":7,"sheets":["Cover","Navigator","Style Guide","Model Parameters","Simple Waffle Chart","Stacked Waffle Chart","Error Checks"],"not_rendered":{"charts":0,"images":1,"macros":1,"external_links":0,"defined_names":27,"comments":0,"pivot_tables":0},"unopened":[],"bounds":{"document_bytes":16777216,"sheet_cells":100000,"rows_first":2000,"rows_last":500,"rows_between":2000,"halvings":0,"cell_chars":16384,"cell_head_chars":4096},"cells_cut":0,"cells_raw":0,"read":"whole","date_system":"1900"}

{"sheet":"Cover","index":0,"n_rows":22,"n_cols":7,"rows_kept":22,"cut":false,"hidden":false,"merged":[[16,2,16,9],[17,2,17,9],[20,6,20,8],[21,6,21,8]]}
[]
[]
["Navigator"]
[]
[null,null,{"$f":"Client_Name","v":"SumProduct Pty Limited"}]
[null,null,{"$f":"Model_Name","v":"SP Waffle Chart.xlsm"}]
[]
[]
[]
[]
[]
[]
[]
[null,null,"Primary Developer:  Sam Ngo"]
[]
[null,null,"General Cover Notes:"]
[null,null,"Waffle Chart illustrations."]
[]
[]
[]
[null,null,"Any queries, please e-mail:",null,null,null,"sam.ngo@sumproduct.com"]
[null,null,"Website:",null,null,null,"www.sumproduct.com"]

{"sheet":"Navigator","index":1,"n_rows":14,"n_cols":7,"rows_kept":14,"cut":false,"hidden":false,"merged":[]}
["Navigator"]
[{"$f":"Model_Name","v":"SP Waffle Chart.xlsm"}]
["Navigator"]
[null,null,null,null,"Error Checks:",null,{"$f":"Overall_Error_Check","v":0}]
[]
[]
[null,1,"Table of Contents"]
[]
[null,null,null,null,null,"Cover"]
[null,null,null,null,null,"Style Guide"]
[null,null,null,null,null,"Model Parameters"]
[null,null,null,null,null,"Simple Waffle Chart"]
[null,null,null,null,null,"Stacked Waffle Chart"]
[null,null,null,null,null,"Error Checks"]

{"sheet":"Style Guide","index":2,"n_rows":74,"n_cols":11,"rows_kept":74,"cut":false,"hidden":false,"merged":[[80,2,80,6],[74,2,74,6],[75,2,75,6],[76,2,76,6],[77,2,77,6],[78,2,78,6],[79,2,79,6],[73,2,73,6],[62,2,62,6],[63,2,63,6],[64,2,64,6],[65,2,65,6],[66,2,66,6],[67,2,67,6],[68,2,68,6],[69,2,69,6],[70,2,70,6],[71,2,71,6],[72,2,72,6],[61,2,61,6],[47,2,47,6],[48,2,48,6],[49,2,49,6],[50,2,50,6],[51,2,51,6],[52,2,52,6],[53,2,53,6],[54,2,54,6],[57,2,57,6],[59,2,59,6],[60,2,60,6],[46,2,46,6],[35,2,35,6],[36,2,36,6],[37,2,37,6],[38,2,38,6],[39,2,39,6],[40,2,40,6],[41,2,41,6],[42,2,42,6],[43,2,43,6],[44,2,44,6],[45,2,45,6],[34,2,34,6],[17,2,17,6],[18,2,18,6],[19,2,19,6],[24,2,24,6],[25,2,25,6],[26,2,26,6],[27,2,27,6],[28,2,28,6],[29,2,29,6],[30,2,30,6],[31,2,31,6],[16,2,16,6],[2,0,2,4],[7,2,7,6],[8,2,8,6],[9,2,9,6],[10,2,10,6],[11,2,11,6],[12,2,12,6],[13,2,13,6],[14,2,14,6],[15,2,15,6]]}
[{"$f":"IF(ISERROR(RIGHT(CELL(\"filename\",A1),LEN(CELL(\"filename\",A1))-FIND(\"]\",CELL(\"filename\",A1)))),\n\"\",\nRIGHT(CELL(\"filename\",A1),LEN(CELL(\"filename\",A1))-FIND(\"]\",CELL(\"filename\",A1))))","v":"Style Guide"}]
[{"$f":"Model_Name","v":"SP Waffle Chart.xlsm"}]
["Navigator"]
[null,null,null,null,"Error Checks:",null,null,null,{"$f":"Overall_Error_Check","v":0}]
[]
[null,{"$f":"MAX($B$5:$B5)+1","v":1},"Formatting of Headers / Dividers"]
[]
[null,null,"Description",null,null,null,null,null,"Display",null,"Style Name"]
[]
[null,null,"Sheet Title",null,null,null,null,null,{"$f":"C10","v":"Sheet Title"},null,"Sheet Title"]
[null,null,"Model Name",null,null,null,null,null,{"$f":"C11","v":"Model Name"},null,"Model Name"]
[]
[null,null,"Header 1",null,null,null,null,null,{"$f":"C13","v":"Header 1"},null,"Header 1"]
[null,null,"Header 2",null,null,null,null,null,{"$f":"C14","v":"Header 2"},null,"Header 2"]
[null,null,"Header 3",null,null,null,null,null,{"$f":"C15","v":"Header 3"},null,"Header 3"]
[null,null,"Header 4",null,null,null,null,null,{"$f":"C16","v":"Header 4"},null,"Header 4"]
[]
[null,null,"Notes",null,null,null,null,null,{"$f":"C18","v":"Notes"},null,"Notes"]
[]
[null,null,"Table Heading",null,null,null,null,null,{"$f":"C20","v":"Table Heading"},null,"Table Heading"]
[]
[]
[null,{"$f":"MAX($B$5:$B22)+1","v":2},"Individual Cell Styles"]
[]
[null,null,"Description",null,null,null,null,null,"Display",null,"Style Name"]
[]
[null,null,"Assumption",null,null,null,null,null,"Assumption",null,{"$f":"C27","v":"Assumption"}]
[]
[null,null,"Constraint",null,null,null,null,null,{"$f":"C29","v":"Constraint"},null,{"$f":"C29","v":"Constraint"}]
[]
[null,null,"Empty",null,null,null,null,null,null,null,{"$f":"C31","v":"Empty"}]
[]
[null,null,"Error Check",null,null,null,null,null,0,null,{"$f":"C33","v":"Error Check"}]
[]
[null,null,"Hyperlink",null,null,null,null,null,"Hyperlink",null,{"$f":"C35","v":"Hyperlink"}]
[]
[null,null,"Internal Reference",null,null,null,null,null,{"$f":"'Error Checks'!E12","v":"Example"},null,{"$f":"C37","v":"Internal Reference"}]
[]
[null,null,"Line Calculation",null,null,null,null,null,77,null,"Line Calc"]
[]
[null,null,"Line Total",null,null,null,null,null,{"$f":"I39","v":77},null,{"$f":"C41","v":"Line Total"}]
[]
[null,null,"Parameter",null,null,null,null,null,365,null,{"$f":"C43","v":"Parameter"}]
[]
[null,null,"Range Name Description",null,null,null,null,null,"Not_Named",null,{"$f":"C45","v":"Range Name Description"}]
[]
[null,null,"Row Reference",null,null,null,null,null,{"$f":"ROW(C47)","v":47},null,"Row Ref"]
[]
[null,null,"Row Summary",null,null,null,null,null,{"$f":"I41","v":77},null,{"$f":"C49","v":"Row Summary"}]
[]
[null,null,"Units",null,null,null,null,null,"A$",null,{"$f":"C51","v":"Units"}]
[]
[null,null,"WIP",null,null,null,null,null,null,null,{"$f":"C53","v":"WIP"}]
[]
[]
[null,{"$f":"MAX($B$5:$B55)+1","v":3},"Numerical Styles"]
[]
[null,null,"Description",null,null,null,null,null,"Display",null,"Style Name"]
[]
[null,null,"Comma",null,null,null,null,null,123456.789,null,{"$f":"C60","v":"Comma"}]
[]
[null,null,"Comma [0]",null,null,null,null,null,-123456.789,null,"Comma [0]"]
[]
[null,null,"Currency",null,null,null,null,null,123456.789,null,"Currency"]
[]
[null,null,"Currency [0]",null,null,null,null,null,123456.789,null,"Currency [0]"]
[]
[null,null,"Date",null,null,null,null,null,{"$f":"TODAY()","v":"2023-01-23"},null,{"$f":"C68","v":"Date"}]
[]
[null,null,"Date Heading",null,null,null,null,null,{"$f":"TODAY()","v":"2023-01-23"},null,{"$f":"C70","v":"Date Heading"}]
[]
[null,null,"Numbers 0",null,null,null,null,null,-123456.789,null,{"$f":"C72","v":"Numbers 0"}]
[]
[null,null,"Percent",null,null,null,null,null,0.5,null,{"$f":"C74","v":"Percent"}]

{"sheet":"Model Parameters","index":3,"n_rows":31,"n_cols":9,"rows_kept":31,"cut":false,"hidden":false,"merged":[[0,9,0,10],[2,0,2,4],[10,6,10,13],[11,6,11,13]]}
[{"$f":"IF(ISERROR(RIGHT(CELL(\"filename\",A1),LEN(CELL(\"filename\",A1))-FIND(\"]\",CELL(\"filename\",A1)))),\n\"\",\nRIGHT(CELL(\"filename\",A1),LEN(CELL(\"filename\",A1))-FIND(\"]\",CELL(\"filename\",A1))))","v":"Model Parameters"}]
[{"$f":"Model_Name","v":"SP Waffle Chart.xlsm"}]
["Navigator"]
[null,null,null,null,"Error Checks:",null,null,null,{"$f":"Overall_Error_Check","v":0}]
[]
[null,{"$f":"MAX($B$5:$B5)+1","v":1},"General"]
[]
[null,null,"Key Inputs"]
[]
[null,null,null,null,"General"]
[null,null,null,null,"Model Name",null,{"$f":"IF(ISERROR(OR(FIND(\"[\",CELL(\"filename\",A1)),FIND(\"]\",CELL(\"filename\",A1)))),\"\",MID(CELL(\"filename\",A1),FIND(\"[\",CELL(\"filename\",A1))+1,FIND(\"]\",CELL(\"filename\",A1))-FIND(\"[\",CELL(\"filename\",A1))-1))","v":"SP Waffle Chart.xlsm"}]
[null,null,null,null,"Client Name",null,"SumProduct Pty Limited"]
[]
[]
[null,{"$f":"MAX($B$5:$B14)+1","v":2},"General Range Names"]
[]
[null,null,"Technical Assumptions"]
[]
[null,null,null,null,"Days in Year",null,365]
[null,null,null,null,"Months in Month",null,1]
[null,null,null,null,"Months in Quarter",null,3]
[null,null,null,null,"Months in Half Yr",null,6]
[null,null,null,null,"Months in Year",null,12]
[null,null,null,null,"Quarters in Year",null,4]
[]
[null,null,null,null,"Rounding Accuracy",null,5]
[]
[null,null,null,null,"Very Large Number",null,9.9999999999999997E+98]
[null,null,null,null,"Very Small Number",null,1E-8]
[]
[null,null,null,null,"Thousand",null,1000]

{"sheet":"Simple Waffle Chart","index":4,"n_rows":41,"n_cols":16,"rows_kept":41,"cut":false,"hidden":false,"merged":[[2,0,2,4],[41,6,41,15],[27,6,27,15]]}
[{"$f":"IF(ISERROR(RIGHT(CELL(\"filename\",A1),LEN(CELL(\"filename\",A1))-FIND(\"]\",CELL(\"filename\",A1)))),\n\"\",\nRIGHT(CELL(\"filename\",A1),LEN(CELL(\"filename\",A1))-FIND(\"]\",CELL(\"filename\",A1))))","v":"Simple Waffle Chart"}]
[{"$f":"Model_Name","v":"SP Waffle Chart.xlsm"}]
["Navigator"]
[null,"Error Checks:",null,null,null,{"$f":"Overall_Error_Check","v":0}]
[]
[null,{"$f":"MAX($B$5:$B5)+1","v":1},{"$f":"A1","v":"Simple Waffle Chart"}]
[]
[null,null,"Data"]
[]
[null,null,null,"Value"]
[null,null,null,0.23]
[]
[]
[null,null,"Chart"]
[]
[null,null,null,"Style 1"]
[]
[null,null,null,null,null,null,{"$f":"_xlfn.SEQUENCE(10,10,0.01,0.01)","v":0.01},0.02,0.03,0.04,0.05,6.0000000000000005E-2,7.0000000000000007E-2,0.08,0.09,9.9999999999999992E-2]
[null,null,null,null,null,null,0.10999999999999999,0.11999999999999998,0.12999999999999998,0.13999999999999999,0.15,0.16,0.17,0.18000000000000002,0.19000000000000003,0.20000000000000004]
[null,null,null,null,null,null,0.21000000000000005,0.22000000000000006,0.23000000000000007,0.24000000000000007,0.25000000000000006,0.26000000000000006,0.27000000000000007,0.28000000000000008,0.29000000000000009,0.3000000000000001]
[null,null,null,null,null,null,0.31000000000000011,0.32000000000000012,0.33000000000000013,0.34000000000000014,0.35000000000000014,0.36000000000000015,0.37000000000000016,0.38000000000000017,0.39000000000000018,0.40000000000000019]
[null,null,null,null,null,null,0.4100000000000002,0.42000000000000021,0.43000000000000022,0.44000000000000022,0.45000000000000023,0.46000000000000024,0.47000000000000025,0.48000000000000026,0.49000000000000027,0.50000000000000022]
[null,null,null,null,null,null,0.51000000000000023,0.52000000000000024,0.53000000000000025,0.54000000000000026,0.55000000000000027,0.56000000000000028,0.57000000000000028,0.58000000000000029,0.5900000000000003,0.60000000000000031]
[null,null,null,null,null,null,0.61000000000000032,0.62000000000000033,0.63000000000000034,0.64000000000000035,0.65000000000000036,0.66000000000000036,0.67000000000000037,0.68000000000000038,0.69000000000000039,0.7000000000000004]
[null,null,null,null,null,null,0.71000000000000041,0.72000000000000042,0.73000000000000043,0.74000000000000044,0.75000000000000044,0.76000000000000045,0.77000000000000046,0.78000000000000047,0.79000000000000048,0.80000000000000049]
[null,null,null,null,null,null,0.8100000000000005,0.82000000000000051,0.83000000000000052,0.84000000000000052,0.85000000000000053,0.86000000000000054,0.87000000000000055,0.88000000000000056,0.89000000000000057,0.90000000000000058]
[null,null,null,null,null,null,0.91000000000000059,0.9200000000000006,0.9300000000000006,0.94000000000000061,0.95000000000000062,0.96000000000000063,0.97000000000000064,0.98000000000000065,0.99000000000000066,1.0000000000000007]
[]
[]
[null,null,null,"Style 2"]
[]
[null,null,null,null,null,null,{"$f":"_xlfn.SEQUENCE(10,10,1,-0.01)","v":1},0.99,0.98,0.97,0.96,0.95,0.94,0.92999999999999994,0.91999999999999993,0.90999999999999992]
[null,null,null,null,null,null,0.89999999999999991,0.8899999999999999,0.87999999999999989,0.86999999999999988,0.85999999999999988,0.84999999999999987,0.83999999999999986,0.82999999999999985,0.81999999999999984,0.80999999999999983]
[null,null,null,null,null,null,0.79999999999999982,0.78999999999999981,0.7799999999999998,0.7699999999999998,0.75999999999999979,0.74999999999999978,0.73999999999999977,0.72999999999999976,0.71999999999999975,0.70999999999999974]
[null,null,null,null,null,null,0.69999999999999973,0.68999999999999972,0.67999999999999972,0.66999999999999971,0.6599999999999997,0.64999999999999969,0.63999999999999968,0.62999999999999967,0.61999999999999966,0.60999999999999965]
[null,null,null,null,null,null,0.59999999999999964,0.58999999999999964,0.57999999999999963,0.56999999999999962,0.55999999999999961,0.5499999999999996,0.53999999999999959,0.52999999999999958,0.51999999999999957,0.50999999999999956]
[null,null,null,null,null,null,0.49999999999999956,0.48999999999999955,0.47999999999999954,0.46999999999999953,0.45999999999999952,0.44999999999999951,0.4399999999999995,0.42999999999999949,0.41999999999999948,0.40999999999999948]
[null,null,null,null,null,null,0.39999999999999947,0.38999999999999946,0.37999999999999945,0.36999999999999944,0.35999999999999943,0.34999999999999942,0.33999999999999941,0.3299999999999994,0.3199999999999994,0.30999999999999939]
[null,null,null,null,null,null,0.29999999999999938,0.28999999999999937,0.27999999999999936,0.26999999999999935,0.25999999999999934,0.24999999999999933,0.23999999999999932,0.22999999999999932,0.21999999999999931,0.2099999999999993]
[null,null,null,null,null,null,0.19999999999999929,0.18999999999999928,0.17999999999999927,0.16999999999999926,0.15999999999999925,0.14999999999999925,0.13999999999999924,0.12999999999999923,0.11999999999999923,0.10999999999999924]
[null,null,null,null,null,null,9.9999999999999242E-2,8.9999999999999247E-2,7.9999999999999252E-2,6.9999999999999257E-2,5.9999999999999255E-2,4.9999999999999253E-2,3.9999999999999251E-2,2.9999999999999249E-2,1.9999999999999248E-2,9.9999999999992473E-3]

{"sheet":"Stacked Waffle Chart","index":5,"n_rows":43,"n_cols":16,"rows_kept":43,"cut":false,"hidden":false,"merged":[[2,0,2,4]]}
[{"$f":"IF(ISERROR(RIGHT(CELL(\"filename\",A1),LEN(CELL(\"filename\",A1))-FIND(\"]\",CELL(\"filename\",A1)))),\n\"\",\nRIGHT(CELL(\"filename\",A1),LEN(CELL(\"filename\",A1))-FIND(\"]\",CELL(\"filename\",A1))))","v":"Stacked Waffle Chart"}]
[{"$f":"Model_Name","v":"SP Waffle Chart.xlsm"}]
["Navigator"]
[null,"Error Checks:",null,null,null,{"$f":"Overall_Error_Check","v":0}]
[]
[null,{"$f":"MAX($B$5:$B5)+1","v":1},{"$f":"A1","v":"Stacked Waffle Chart"}]
[]
[null,null,"Data"]
[]
[null,null,null,"Value"]
[null,null,"A",0.44]
[null,null,"B",0.33]
[null,null,"C",{"$f":"1-SUM(D11:D12)","v":0.22999999999999998}]
[]
[]
[null,null,"Chart"]
[]
[null,null,null,"Style 1"]
[]
[null,null,null,null,null,null,{"$f":"_xlfn.SEQUENCE(10,10,0.01,0.01)","v":0.01},0.02,0.03,0.04,0.05,6.0000000000000005E-2,7.0000000000000007E-2,0.08,0.09,9.9999999999999992E-2]
[null,null,null,null,null,null,0.10999999999999999,0.11999999999999998,0.12999999999999998,0.13999999999999999,0.15,0.16,0.17,0.18000000000000002,0.19000000000000003,0.20000000000000004]
[null,null,null,null,null,null,0.21000000000000005,0.22000000000000006,0.23000000000000007,0.24000000000000007,0.25000000000000006,0.26000000000000006,0.27000000000000007,0.28000000000000008,0.29000000000000009,0.3000000000000001]
[null,null,null,null,null,null,0.31000000000000011,0.32000000000000012,0.33000000000000013,0.34000000000000014,0.35000000000000014,0.36000000000000015,0.37000000000000016,0.38000000000000017,0.39000000000000018,0.40000000000000019]
[null,null,null,null,null,null,0.4100000000000002,0.42000000000000021,0.43000000000000022,0.44000000000000022,0.45000000000000023,0.46000000000000024,0.47000000000000025,0.48000000000000026,0.49000000000000027,0.50000000000000022]
[null,null,null,null,null,null,0.51000000000000023,0.52000000000000024,0.53000000000000025,0.54000000000000026,0.55000000000000027,0.56000000000000028,0.57000000000000028,0.58000000000000029,0.5900000000000003,0.60000000000000031]
[null,null,null,null,null,null,0.61000000000000032,0.62000000000000033,0.63000000000000034,0.64000000000000035,0.65000000000000036,0.66000000000000036,0.67000000000000037,0.68000000000000038,0.69000000000000039,0.7000000000000004]
[null,null,null,null,null,null,0.71000000000000041,0.72000000000000042,0.73000000000000043,0.74000000000000044,0.75000000000000044,0.76000000000000045,0.77000000000000046,0.78000000000000047,0.79000000000000048,0.80000000000000049]
[null,null,null,null,null,null,0.8100000000000005,0.82000000000000051,0.83000000000000052,0.84000000000000052,0.85000000000000053,0.86000000000000054,0.87000000000000055,0.88000000000000056,0.89000000000000057,0.90000000000000058]
[null,null,null,null,null,null,0.91000000000000059,0.9200000000000006,0.9300000000000006,0.94000000000000061,0.95000000000000062,0.96000000000000063,0.97000000000000064,0.98000000000000065,0.99000000000000066,1.0000000000000007]
[]
[]
[null,null,null,"Style 2"]
[]
[null,null,null,null,null,null,{"$f":"_xlfn.SEQUENCE(10,10,1,-0.01)","v":1},0.99,0.98,0.97,0.96,0.95,0.94,0.92999999999999994,0.91999999999999993,0.90999999999999992]
[null,null,null,null,null,null,0.89999999999999991,0.8899999999999999,0.87999999999999989,0.86999999999999988,0.85999999999999988,0.84999999999999987,0.83999999999999986,0.82999999999999985,0.81999999999999984,0.80999999999999983]
[null,null,null,null,null,null,0.79999999999999982,0.78999999999999981,0.7799999999999998,0.7699999999999998,0.75999999999999979,0.74999999999999978,0.73999999999999977,0.72999999999999976,0.71999999999999975,0.70999999999999974]
[null,null,null,null,null,null,0.69999999999999973,0.68999999999999972,0.67999999999999972,0.66999999999999971,0.6599999999999997,0.64999999999999969,0.63999999999999968,0.62999999999999967,0.61999999999999966,0.60999999999999965]
[null,null,null,null,null,null,0.59999999999999964,0.58999999999999964,0.57999999999999963,0.56999999999999962,0.55999999999999961,0.5499999999999996,0.53999999999999959,0.52999999999999958,0.51999999999999957,0.50999999999999956]
[null,null,null,null,null,null,0.49999999999999956,0.48999999999999955,0.47999999999999954,0.46999999999999953,0.45999999999999952,0.44999999999999951,0.4399999999999995,0.42999999999999949,0.41999999999999948,0.40999999999999948]
[null,null,null,null,null,null,0.39999999999999947,0.38999999999999946,0.37999999999999945,0.36999999999999944,0.35999999999999943,0.34999999999999942,0.33999999999999941,0.3299999999999994,0.3199999999999994,0.30999999999999939]
[null,null,null,null,null,null,0.29999999999999938,0.28999999999999937,0.27999999999999936,0.26999999999999935,0.25999999999999934,0.24999999999999933,0.23999999999999932,0.22999999999999932,0.21999999999999931,0.2099999999999993]
[null,null,null,null,null,null,0.19999999999999929,0.18999999999999928,0.17999999999999927,0.16999999999999926,0.15999999999999925,0.14999999999999925,0.13999999999999924,0.12999999999999923,0.11999999999999923,0.10999999999999924]
[null,null,null,null,null,null,9.9999999999999242E-2,8.9999999999999247E-2,7.9999999999999252E-2,6.9999999999999257E-2,5.9999999999999255E-2,4.9999999999999253E-2,3.9999999999999251E-2,2.9999999999999249E-2,1.9999999999999248E-2,9.9999999999992473E-3]

{"sheet":"Error Checks","index":6,"n_rows":17,"n_cols":9,"rows_kept":17,"cut":false,"hidden":false,"merged":[[2,0,2,4]]}
[{"$f":"IF(ISERROR(RIGHT(CELL(\"filename\",A1),LEN(CELL(\"filename\",A1))-FIND(\"]\",CELL(\"filename\",A1)))),\n\"\",\nRIGHT(CELL(\"filename\",A1),LEN(CELL(\"filename\",A1))-FIND(\"]\",CELL(\"filename\",A1))))","v":"Error Checks"}]
[{"$f":"Model_Name","v":"SP Waffle Chart.xlsm"}]
["Navigator"]
[null,"Error Checks:",null,null,null,{"$f":"Overall_Error_Check","v":0}]
[]
[null,{"$f":"MAX($B$5:$B5)+1","v":1},"Error Checks"]
[]
[null,null,"Summary of Errors"]
[]
[null,null,null,"Assumptions"]
[]
[null,null,null,null,"Example"]
[]
[]
[]
[]
[null,null,null,null,{"$f":"C8","v":"Summary of Errors"},null,null,null,{"$f":"MIN(1,SUM(I11:I15))","v":0}]