{"text_format":"1","workbook":"xlsx","n_sheets":6,"sheets":["Cover","Navigator","Style Guide","Model Parameters","Sales Data","Error Checks"],"not_rendered":{"charts":0,"images":1,"macros":1,"external_links":0,"defined_names":25,"comments":0,"pivot_tables":0},"unopened":[],"bounds":{"document_bytes":16777216,"sheet_cells":100000,"rows_first":2000,"rows_last":500,"rows_between":2000,"halvings":0,"cell_chars":16384,"cell_head_chars":4096},"cells_cut":0,"cells_raw":0,"read":"whole","date_system":"1900"}

{"sheet":"Cover","index":0,"n_rows":22,"n_cols":7,"rows_kept":22,"cut":false,"hidden":false,"merged":[[16,2,16,9],[17,2,17,9],[20,6,20,8],[21,6,21,8]]}
[]
[]
["Navigator"]
[]
[null,null,{"$f":"Client_Name","v":"SumProduct Pty Limited"}]
[null,null,{"$f":"Model_Name","v":"SP Final Friday Monthly Reporting Starter File.xlsm"}]
[]
[]
[]
[]
[]
[]
[]
[null,null,"Primary Developer:  Liam Bastick"]
[]
[null,null,"General Cover Notes:"]
[null,null,"Simple example to demonstrate how to report monthly - with months"]
[null,null,"ending on the final Friday."]
[]
[]
[null,null,"Any queries, please e-mail:",null,null,null,"liam.bastick@sumproduct.com"]
[null,null,"Website:",null,null,null,"www.sumproduct.com"]

{"sheet":"Navigator","index":1,"n_rows":13,"n_cols":7,"rows_kept":13,"cut":false,"hidden":false,"merged":[]}
["Navigator"]
[{"$f":"Model_Name","v":"SP Final Friday Monthly Reporting Starter File.xlsm"}]
["Navigator"]
[null,null,null,null,"Error Checks:",null,{"$f":"Overall_Error_Check","v":0}]
[]
[]
[null,1,"Table of Contents"]
[]
[null,null,null,null,null,"Cover"]
[null,null,null,null,null,"Style Guide"]
[null,null,null,null,null,"Model Parameters"]
[null,null,null,null,null,"Sales Data"]
[null,null,null,null,null,"Error Checks"]

{"sheet":"Style Guide","index":2,"n_rows":74,"n_cols":11,"rows_kept":74,"cut":false,"hidden":false,"merged":[[16,2,16,6],[2,0,2,4],[7,2,7,6],[8,2,8,6],[9,2,9,6],[10,2,10,6],[11,2,11,6],[12,2,12,6],[13,2,13,6],[14,2,14,6],[15,2,15,6],[34,2,34,6],[17,2,17,6],[18,2,18,6],[19,2,19,6],[24,2,24,6],[25,2,25,6],[26,2,26,6],[27,2,27,6],[28,2,28,6],[29,2,29,6],[30,2,30,6],[31,2,31,6],[46,2,46,6],[35,2,35,6],[36,2,36,6],[37,2,37,6],[38,2,38,6],[39,2,39,6],[40,2,40,6],[41,2,41,6],[42,2,42,6],[43,2,43,6],[44,2,44,6],[45,2,45,6],[61,2,61,6],[47,2,47,6],[48,2,48,6],[49,2,49,6],[50,2,50,6],[51,2,51,6],[52,2,52,6],[53,2,53,6],[54,2,54,6],[57,2,57,6],[59,2,59,6],[60,2,60,6],[73,2,73,6],[62,2,62,6],[63,2,63,6],[64,2,64,6],[65,2,65,6],[66,2,66,6],[67,2,67,6],[68,2,68,6],[69,2,69,6],[70,2,70,6],[71,2,71,6],[72,2,72,6],[80,2,80,6],[74,2,74,6],[75,2,75,6],[76,2,76,6],[77,2,77,6],[78,2,78,6],[79,2,79,6]]}
[{"$f":"IF(ISERROR(RIGHT(CELL(\"filename\",A1),LEN(CELL(\"filename\",A1))-FIND(\"]\",CELL(\"filename\",A1)))),\n\"\",\nRIGHT(CELL(\"filename\",A1),LEN(CELL(\"filename\",A1))-FIND(\"]\",CELL(\"filename\",A1))))","v":"Style Guide"}]
[{"$f":"Model_Name","v":"SP Final Friday Monthly Reporting Starter File.xlsm"}]
["Navigator"]
[null,null,null,null,"Error Checks:",null,null,null,{"$f":"Overall_Error_Check","v":0}]
[]
[null,{"$f":"MAX($B$5:$B5)+1","v":1},"Formatting of Headers / Dividers"]
[]
[null,null,"Description",null,null,null,null,null,"Display",null,"Style Name"]
[]
[null,null,"Sheet Title",null,null,null,null,null,{"$f":"C10","v":"Sheet Title"},null,"Sheet Title"]
[null,null,"Model Name",null,null,null,null,null,{"$f":"C11","v":"Model Name"},null,"Model Name"]
[]
[null,null,"Header 1",null,null,null,null,null,{"$f":"C13","v":"Header 1"},null,"Header 1"]
[null,null,"Header 2",null,null,null,null,null,{"$f":"C14","v":"Header 2"},null,"Header 2"]
[null,null,"Header 3",null,null,null,null,null,{"$f":"C15","v":"Header 3"},null,"Header 3"]
[null,null,"Header 4",null,null,null,null,null,{"$f":"C16","v":"Header 4"},null,"Header 4"]
[]
[null,null,"Notes",null,null,null,null,null,{"$f":"C18","v":"Notes"},null,"Notes"]
[]
[null,null,"Table Heading",null,null,null,null,null,{"$f":"C20","v":"Table Heading"},null,"Table Heading"]
[]
[]
[null,{"$f":"MAX($B$5:$B22)+1","v":2},"Individual Cell Styles"]
[]
[null,null,"Description",null,null,null,null,null,"Display",null,"Style Name"]
[]
[null,null,"Assumption",null,null,null,null,null,"Assumption",null,{"$f":"C27","v":"Assumption"}]
[]
[null,null,"Constraint",null,null,null,null,null,{"$f":"C29","v":"Constraint"},null,{"$f":"C29","v":"Constraint"}]
[]
[null,null,"Empty",null,null,null,null,null,null,null,{"$f":"C31","v":"Empty"}]
[]
[null,null,"Error Check",null,null,null,null,null,0,null,{"$f":"C33","v":"Error Check"}]
[]
[null,null,"Hyperlink",null,null,null,null,null,"Hyperlink",null,{"$f":"C35","v":"Hyperlink"}]
[]
[null,null,"Internal Reference",null,null,null,null,null,{"$f":"'Error Checks'!E12","v":"Example"},null,{"$f":"C37","v":"Internal Reference"}]
[]
[null,null,"Line Calculation",null,null,null,null,null,77,null,"Line Calc"]
[]
[null,null,"Line Total",null,null,null,null,null,{"$f":"I39","v":77},null,{"$f":"C41","v":"Line Total"}]
[]
[null,null,"Parameter",null,null,null,null,null,365,null,{"$f":"C43","v":"Parameter"}]
[]
[null,null,"Range Name Description",null,null,null,null,null,"Not_Named",null,{"$f":"C45","v":"Range Name Description"}]
[]
[null,null,"Row Reference",null,null,null,null,null,{"$f":"ROW(C47)","v":47},null,"Row Ref"]
[]
[null,null,"Row Summary",null,null,null,null,null,{"$f":"I41","v":77},null,{"$f":"C49","v":"Row Summary"}]
[]
[null,null,"Units",null,null,null,null,null,"A$",null,{"$f":"C51","v":"Units"}]
[]
[null,null,"WIP",null,null,null,null,null,null,null,{"$f":"C53","v":"WIP"}]
[]
[]
[null,{"$f":"MAX($B$5:$B55)+1","v":3},"Numerical Styles"]
[]
[null,null,"Description",null,null,null,null,null,"Display",null,"Style Name"]
[]
[null,null,"Comma",null,null,null,null,null,123456.789,null,{"$f":"C60","v":"Comma"}]
[]
[null,null,"Comma [0]",null,null,null,null,null,-123456.789,null,"Comma [0]"]
[]
[null,null,"Currency",null,null,null,null,null,123456.789,null,"Currency"]
[]
[null,null,"Currency [0]",null,null,null,null,null,123456.789,null,"Currency [0]"]
[]
[null,null,"Date",null,null,null,null,null,{"$f":"TODAY()","v":"2020-04-19"},null,{"$f":"C68","v":"Date"}]
[]
[null,null,"Date Heading",null,null,null,null,null,{"$f":"TODAY()","v":"2020-04-19"},null,{"$f":"C70","v":"Date Heading"}]
[]
[null,null,"Numbers 0",null,null,null,null,null,-123456.789,null,{"$f":"C72","v":"Numbers 0"}]
[]
[null,null,"Percent",null,null,null,null,null,0.5,null,{"$f":"C74","v":"Percent"}]

{"sheet":"Model Parameters","index":3,"n_rows":31,"n_cols":9,"rows_kept":31,"cut":false,"hidden":false,"merged":[[0,9,0,10],[2,0,2,4],[10,6,10,13],[11,6,11,13]]}
[{"$f":"IF(ISERROR(RIGHT(CELL(\"filename\",A1),LEN(CELL(\"filename\",A1))-FIND(\"]\",CELL(\"filename\",A1)))),\n\"\",\nRIGHT(CELL(\"filename\",A1),LEN(CELL(\"filename\",A1))-FIND(\"]\",CELL(\"filename\",A1))))","v":"Model Parameters"}]
[{"$f":"Model_Name","v":"SP Final Friday Monthly Reporting Starter File.xlsm"}]
["Navigator"]
[null,null,null,null,"Error Checks:",null,null,null,{"$f":"Overall_Error_Check","v":0}]
[]
[null,{"$f":"MAX($B$5:$B5)+1","v":1},"General"]
[]
[null,null,"Key Inputs"]
[]
[null,null,null,null,"General"]
[null,null,null,null,"Model Name",null,{"$f":"IF(ISERROR(OR(FIND(\"[\",CELL(\"filename\",A1)),FIND(\"]\",CELL(\"filename\",A1)))),\"\",MID(CELL(\"filename\",A1),FIND(\"[\",CELL(\"filename\",A1))+1,FIND(\"]\",CELL(\"filename\",A1))-FIND(\"[\",CELL(\"filename\",A1))-1))","v":"SP Final Friday Monthly Reporting Starter File.xlsm"}]
[null,null,null,null,"Client Name",null,"SumProduct Pty Limited"]
[]
[]
[null,{"$f":"MAX($B$5:$B14)+1","v":2},"General Range Names"]
[]
[null,null,"Technical Assumptions"]
[]
[null,null,null,null,"Days in Year",null,365]
[null,null,null,null,"Months in Month",null,1]
[null,null,null,null,"Months in Quarter",null,3]
[null,null,null,null,"Months in Half Yr",null,6]
[null,null,null,null,"Months in Year",null,12]
[null,null,null,null,"Quarters in Year",null,4]
[]
[null,null,null,null,"Rounding Accuracy",null,5]
[]
[null,null,null,null,"Very Large Number",null,9.9999999999999997E+98]
[null,null,null,null,"Very Small Number",null,1E-8]
[]
[null,null,null,null,"Thousand",null,1000]

{"sheet":"Sales Data","index":4,"n_rows":1473,"n_cols":9,"rows_kept":1473,"cut":false,"hidden":false,"merged":[[2,0,2,4]]}
[{"$f":"IF(ISERROR(RIGHT(CELL(\"filename\",A1),LEN(CELL(\"filename\",A1))-FIND(\"]\",CELL(\"filename\",A1)))),\n\"\",\nRIGHT(CELL(\"filename\",A1),LEN(CELL(\"filename\",A1))-FIND(\"]\",CELL(\"filename\",A1))))","v":"Sales Data"}]
[{"$f":"Model_Name","v":"SP Final Friday Monthly Reporting Starter File.xlsm"}]
["Navigator"]
[null,null,null,null,"Error Checks:",null,null,null,{"$f":"Overall_Error_Check","v":0}]
[]
[null,{"$f":"MAX($B$5:$B5)+1","v":1},"Assumptions"]
[]
[null,null,"Data"]
[]
[null,null,null,"Daily Sales"]
[]
[null,null,null,null,null,"Date","Sales"]
[null,null,null,null,null,{"$f":"DATE(YEAR(TODAY())-3,1,1)","v":"2017-01-01"},9332]
[null,null,null,null,null,{"$f":"F13+1","v":"2017-01-02"},5139]
[null,null,null,null,null,{"$f":"F14+1","v":"2017-01-03"},4553]
[null,null,null,null,null,"2017-01-04",4439]
[null,null,null,null,null,"2017-01-05",9724]
[null,null,null,null,null,"2017-01-06",1516]
[null,null,null,null,null,"2017-01-07",1031]
[null,null,null,null,null,"2017-01-08",7851]
[null,null,null,null,null,"2017-01-09",4359]
[null,null,null,null,null,"2017-01-10",6694]
[null,null,null,null,null,"2017-01-11",7160]
[null,null,null,null,null,"2017-01-12",5766]
[null,null,null,null,null,"2017-01-13",7608]
[null,null,null,null,null,"2017-01-14",3495]
[null,null,null,null,null,"2017-01-15",2903]
[null,null,null,null,null,"2017-01-16",6807]
[null,null,null,null,null,"2017-01-17",7318]
[null,null,null,null,null,"2017-01-18",6371]
[null,null,null,null,null,"2017-01-19",6453]
[null,null,null,null,null,"2017-01-20",2008]
[null,null,null,null,null,"2017-01-21",5250]
[null,null,null,null,null,"2017-01-22",3746]
[null,null,null,null,null,"2017-01-23",5582]
[null,null,null,null,null,"2017-01-24",7310]
[null,null,null,null,null,"2017-01-25",9974]
[null,null,null,null,null,"2017-01-26",5257]
[null,null,null,null,null,"2017-01-27",4001]
[null,null,null,null,null,"2017-01-28",9528]
[null,null,null,null,null,"2017-01-29",7012]
[null,null,null,null,null,"2017-01-30",7109]
[null,null,null,null,null,"2017-01-31",2870]
[null,null,null,null,null,"2017-02-01",2606]
[null,null,null,null,null,"2017-02-02",3595]
[null,null,null,null,null,"2017-02-03",8784]
[null,null,null,null,null,"2017-02-04",5281]
[null,null,null,null,null,"2017-02-05",7680]
[null,null,null,null,null,"2017-02-06",3342]
[null,null,null,null,null,"2017-02-07",1101]
[null,null,null,null,null,"2017-02-08",2236]
[null,null,null,null,null,"2017-02-09",8771]
[null,null,null,null,null,"2017-02-10",8646]
[null,null,null,null,null,"2017-02-11",6937]
[null,null,null,null,null,"2017-02-12",1645]
[null,null,null,null,null,"2017-02-13",3531]
[null,null,null,null,null,"2017-02-14",8462]
[null,null,null,null,null,"2017-02-15",1147]
[null,null,null,null,null,"2017-02-16",6441]
[null,null,null,null,null,"2017-02-17",8899]
[null,null,null,null,null,"2017-02-18",9485]
[null,null,null,null,null,"2017-02-19",4991]
[null,null,null,null,null,"2017-02-20",1411]
[null,null,null,null,null,"2017-02-21",7709]
[null,null,null,null,null,"2017-02-22",5075]
[null,null,null,null,null,"2017-02-23",2357]
[null,null,null,null,null,"2017-02-24",5947]
[null,null,null,null,null,"2017-02-25",8097]
[null,null,null,null,null,"2017-02-26",1156]
[null,null,null,null,null,"2017-02-27",1722]
[null,null,null,null,null,"2017-02-28",9433]
[null,null,null,null,null,"2017-03-01",7583]
[null,null,null,null,null,"2017-03-02",8380]
[null,null,null,null,null,"2017-03-03",8036]
[null,null,null,null,null,"2017-03-04",8990]
[null,null,null,null,null,"2017-03-05",9787]
[null,null,null,null,null,"2017-03-06",4458]
[null,null,null,null,null,"2017-03-07",6291]
[null,null,null,null,null,{"$f":"F78+1","v":"2017-03-08"},5897]
[null,null,null,null,null,"2017-03-09",9767]
[null,null,null,null,null,"2017-03-10",2091]
[null,null,null,null,null,"2017-03-11",6350]
[null,null,null,null,null,"2017-03-12",5122]
[null,null,null,null,null,"2017-03-13",6295]
[null,null,null,null,null,"2017-03-14",6767]
[null,null,null,null,null,"2017-03-15",9299]
[null,null,null,null,null,"2017-03-16",1751]
[null,null,null,null,null,"2017-03-17",2000]
[null,null,null,null,null,"2017-03-18",8884]
[null,null,null,null,null,"2017-03-19",1294]
[null,null,null,null,null,"2017-03-20",8707]
[null,null,null,null,null,"2017-03-21",4735]
[null,null,null,null,null,"2017-03-22",8227]
[null,null,null,null,null,"2017-03-23",8162]
[null,null,null,null,null,"2017-03-24",1753]
[null,null,null,null,null,"2017-03-25",9500]
[null,null,null,null,null,"2017-03-26",9462]
[null,null,null,null,null,"2017-03-27",3302]
[null,null,null,null,null,"2017-03-28",4422]
[null,null,null,null,null,"2017-03-29",6966]
[null,null,null,null,null,"2017-03-30",2326]
[null,null,null,null,null,"2017-03-31",2261]
[null,null,null,null,null,"2017-04-01",6527]
[null,null,null,null,null,"2017-04-02",9436]
[null,null,null,null,null,"2017-04-03",1872]
[null,null,null,null,null,"2017-04-04",6743]
[null,null,null,null,null,"2017-04-05",4035]
[null,null,null,null,null,"2017-04-06",4037]
[null,null,null,null,null,"2017-04-07",6261]
[null,null,null,null,null,"2017-04-08",9718]
[null,null,null,null,null,"2017-04-09",6034]
[null,null,null,null,null,"2017-04-10",4222]
[null,null,null,null,null,"2017-04-11",3231]
[null,null,null,null,null,"2017-04-12",7691]
[null,null,null,null,null,"2017-04-13",7788]
[null,null,null,null,null,"2017-04-14",1071]
[null,null,null,null,null,"2017-04-15",7225]
[null,null,null,null,null,"2017-04-16",2232]
[null,null,null,null,null,"2017-04-17",9573]
[null,null,null,null,null,"2017-04-18",4940]
[null,null,null,null,null,"2017-04-19",7183]
[null,null,null,null,null,"2017-04-20",4305]
[null,null,null,null,null,"2017-04-21",5724]
[null,null,null,null,null,"2017-04-22",4409]
[null,null,null,null,null,"2017-04-23",5694]
[null,null,null,null,null,"2017-04-24",6431]
[null,null,null,null,null,"2017-04-25",3512]
[null,null,null,null,null,"2017-04-26",6886]
[null,null,null,null,null,"2017-04-27",1985]
[null,null,null,null,null,"2017-04-28",7698]
[null,null,null,null,null,"2017-04-29",5916]
[null,null,null,null,null,"2017-04-30",7004]
[null,null,null,null,null,"2017-05-01",3007]
[null,null,null,null,null,"2017-05-02",3637]
[null,null,null,null,null,"2017-05-03",9601]
[null,null,null,null,null,"2017-05-04",2793]
[null,null,null,null,null,"2017-05-05",7758]
[null,null,null,null,null,"2017-05-06",4990]
[null,null,null,null,null,"2017-05-07",6782]
[null,null,null,null,null,"2017-05-08",7756]
[null,null,null,null,null,"2017-05-09",3493]
[null,null,null,null,null,"2017-05-10",1912]
[null,null,null,null,null,{"$f":"F142+1","v":"2017-05-11"},4989]
[null,null,null,null,null,"2017-05-12",9441]
[null,null,null,null,null,"2017-05-13",4863]
[null,null,null,null,null,"2017-05-14",8160]
[null,null,null,null,null,"2017-05-15",6830]
[null,null,null,null,null,"2017-05-16",6327]
[null,null,null,null,null,"2017-05-17",9775]
[null,null,null,null,null,"2017-05-18",1134]
[null,null,null,null,null,"2017-05-19",7897]
[null,null,null,null,null,"2017-05-20",6929]
[null,null,null,null,null,"2017-05-21",8079]
[null,null,null,null,null,"2017-05-22",9741]
[null,null,null,null,null,"2017-05-23",6422]
[null,null,null,null,null,"2017-05-24",7667]
[null,null,null,null,null,"2017-05-25",3077]
[null,null,null,null,null,"2017-05-26",6039]
[null,null,null,null,null,"2017-05-27",6296]
[null,null,null,null,null,"2017-05-28",9197]
[null,null,null,null,null,"2017-05-29",1319]
[null,null,null,null,null,"2017-05-30",4085]
[null,null,null,null,null,"2017-05-31",4158]
[null,null,null,null,null,"2017-06-01",6890]
[null,null,null,null,null,"2017-06-02",6081]
[null,null,null,null,null,"2017-06-03",6479]
[null,null,null,null,null,"2017-06-04",3758]
[null,null,null,null,null,"2017-06-05",9093]
[null,null,null,null,null,"2017-06-06",8774]
[null,null,null,null,null,"2017-06-07",3585]
[null,null,null,null,null,"2017-06-08",3857]
[null,null,null,null,null,"2017-06-09",2366]
[null,null,null,null,null,"2017-06-10",8930]
[null,null,null,null,null,"2017-06-11",6156]
[null,null,null,null,null,"2017-06-12",8328]
[null,null,null,null,null,"2017-06-13",9646]
[null,null,null,null,null,"2017-06-14",9759]
[null,null,null,null,null,"2017-06-15",3831]
[null,null,null,null,null,"2017-06-16",2460]
[null,null,null,null,null,"2017-06-17",1520]
[null,null,null,null,null,"2017-06-18",6851]
[null,null,null,null,null,"2017-06-19",3795]
[null,null,null,null,null,"2017-06-20",6162]
[null,null,null,null,null,"2017-06-21",5823]
[null,null,null,null,null,"2017-06-22",9337]
[null,null,null,null,null,"2017-06-23",9104]
[null,null,null,null,null,"2017-06-24",8420]
[null,null,null,null,null,"2017-06-25",4278]
[null,null,null,null,null,"2017-06-26",2230]
[null,null,null,null,null,"2017-06-27",1119]
[null,null,null,null,null,"2017-06-28",6695]
[null,null,null,null,null,"2017-06-29",9616]
[null,null,null,null,null,"2017-06-30",7489]
[null,null,null,null,null,"2017-07-01",6709]
[null,null,null,null,null,"2017-07-02",9406]
[null,null,null,null,null,"2017-07-03",3867]
[null,null,null,null,null,"2017-07-04",5250]
[null,null,null,null,null,"2017-07-05",6798]
[null,null,null,null,null,"2017-07-06",5472]
[null,null,null,null,null,"2017-07-07",7853]
[null,null,null,null,null,"2017-07-08",8317]
[null,null,null,null,null,"2017-07-09",2294]
[null,null,null,null,null,"2017-07-10",8536]
[null,null,null,null,null,"2017-07-11",9418]
[null,null,null,null,null,"2017-07-12",6122]
[null,null,null,null,null,"2017-07-13",2490]
[null,null,null,null,null,{"$f":"F206+1","v":"2017-07-14"},5866]
[null,null,null,null,null,"2017-07-15",8572]
[null,null,null,null,null,"2017-07-16",5371]
[null,null,null,null,null,"2017-07-17",6129]
[null,null,null,null,null,"2017-07-18",5651]
[null,null,null,null,null,"2017-07-19",2024]
[null,null,null,null,null,"2017-07-20",8104]
[null,null,null,null,null,"2017-07-21",8529]
[null,null,null,null,null,"2017-07-22",1489]
[null,null,null,null,null,"2017-07-23",8245]
[null,null,null,null,null,"2017-07-24",9833]
[null,null,null,null,null,"2017-07-25",8156]
[null,null,null,null,null,"2017-07-26",4723]
[null,null,null,null,null,"2017-07-27",7926]
[null,null,null,null,null,"2017-07-28",9634]
[null,null,null,null,null,"2017-07-29",9640]
[null,null,null,null,null,"2017-07-30",7247]
[null,null,null,null,null,"2017-07-31",8700]
[null,null,null,null,null,"2017-08-01",4506]
[null,null,null,null,null,"2017-08-02",5224]
[null,null,null,null,null,"2017-08-03",9933]
[null,null,null,null,null,"2017-08-04",9022]
[null,null,null,null,null,"2017-08-05",5606]
[null,null,null,null,null,"2017-08-06",5400]
[null,null,null,null,null,"2017-08-07",2627]
[null,null,null,null,null,"2017-08-08",4802]
[null,null,null,null,null,"2017-08-09",5362]
[null,null,null,null,null,"2017-08-10",8354]
[null,null,null,null,null,"2017-08-11",8607]
[null,null,null,null,null,"2017-08-12",9114]
[null,null,null,null,null,"2017-08-13",1839]
[null,null,null,null,null,"2017-08-14",6187]
[null,null,null,null,null,"2017-08-15",9283]
[null,null,null,null,null,"2017-08-16",3924]
[null,null,null,null,null,"2017-08-17",4434]
[null,null,null,null,null,"2017-08-18",3067]
[null,null,null,null,null,"2017-08-19",6803]
[null,null,null,null,null,"2017-08-20",9601]
[null,null,null,null,null,"2017-08-21",3959]
[null,null,null,null,null,"2017-08-22",8334]
[null,null,null,null,null,"2017-08-23",2751]
[null,null,null,null,null,"2017-08-24",6675]
[null,null,null,null,null,"2017-08-25",4877]
[null,null,null,null,null,"2017-08-26",8135]
[null,null,null,null,null,"2017-08-27",5933]
[null,null,null,null,null,"2017-08-28",1143]
[null,null,null,null,null,"2017-08-29",4692]
[null,null,null,null,null,"2017-08-30",7400]
[null,null,null,null,null,"2017-08-31",4289]
[null,null,null,null,null,"2017-09-01",4533]
[null,null,null,null,null,"2017-09-02",1132]
[null,null,null,null,null,"2017-09-03",8632]
[null,null,null,null,null,"2017-09-04",7153]
[null,null,null,null,null,"2017-09-05",4933]
[null,null,null,null,null,"2017-09-06",7420]
[null,null,null,null,null,"2017-09-07",2496]
[null,null,null,null,null,"2017-09-08",7789]
[null,null,null,null,null,"2017-09-09",9761]
[null,null,null,null,null,"2017-09-10",2789]
[null,null,null,null,null,"2017-09-11",1703]
[null,null,null,null,null,"2017-09-12",1808]
[null,null,null,null,null,"2017-09-13",3731]
[null,null,null,null,null,"2017-09-14",3696]
[null,null,null,null,null,"2017-09-15",9623]
[null,null,null,null,null,{"$f":"F270+1","v":"2017-09-16"},3810]
[null,null,null,null,null,"2017-09-17",3808]
[null,null,null,null,null,"2017-09-18",6023]
[null,null,null,null,null,"2017-09-19",6667]
[null,null,null,null,null,"2017-09-20",3584]
[null,null,null,null,null,"2017-09-21",7756]
[null,null,null,null,null,"2017-09-22",3288]
[null,null,null,null,null,"2017-09-23",5704]
[null,null,null,null,null,"2017-09-24",3776]
[null,null,null,null,null,"2017-09-25",3463]
[null,null,null,null,null,"2017-09-26",5325]
[null,null,null,null,null,"2017-09-27",1664]
[null,null,null,null,null,"2017-09-28",6207]
[null,null,null,null,null,"2017-09-29",5320]
[null,null,null,null,null,"2017-09-30",4696]
[null,null,null,null,null,"2017-10-01",7267]
[null,null,null,null,null,"2017-10-02",6146]
[null,null,null,null,null,"2017-10-03",5512]
[null,null,null,null,null,"2017-10-04",6408]
[null,null,null,null,null,"2017-10-05",9920]
[null,null,null,null,null,"2017-10-06",3903]
[null,null,null,null,null,"2017-10-07",6676]
[null,null,null,null,null,"2017-10-08",3745]
[null,null,null,null,null,"2017-10-09",3406]
[null,null,null,null,null,"2017-10-10",3605]
[null,null,null,null,null,"2017-10-11",8726]
[null,null,null,null,null,"2017-10-12",5194]
[null,null,null,null,null,"2017-10-13",2191]
[null,null,null,null,null,"2017-10-14",4855]
[null,null,null,null,null,"2017-10-15",1497]
[null,null,null,null,null,"2017-10-16",5407]
[null,null,null,null,null,"2017-10-17",1305]
[null,null,null,null,null,"2017-10-18",6560]
[null,null,null,null,null,"2017-10-19",5812]
[null,null,null,null,null,"2017-10-20",8588]
[null,null,null,null,null,"2017-10-21",2956]
[null,null,null,null,null,"2017-10-22",5928]
[null,null,null,null,null,"2017-10-23",1117]
[null,null,null,null,null,"2017-10-24",8707]
[null,null,null,null,null,"2017-10-25",1289]
[null,null,null,null,null,"2017-10-26",1873]
[null,null,null,null,null,"2017-10-27",5669]
[null,null,null,null,null,"2017-10-28",8151]
[null,null,null,null,null,"2017-10-29",4918]
[null,null,null,null,null,"2017-10-30",5637]
[null,null,null,null,null,"2017-10-31",7832]
[null,null,null,null,null,"2017-11-01",5817]
[null,null,null,null,null,"2017-11-02",4630]
[null,null,null,null,null,"2017-11-03",7948]
[null,null,null,null,null,"2017-11-04",4398]
[null,null,null,null,null,"2017-11-05",5817]
[null,null,null,null,null,"2017-11-06",9594]
[null,null,null,null,null,"2017-11-07",4443]
[null,null,null,null,null,"2017-11-08",2199]
[null,null,null,null,null,"2017-11-09",2610]
[null,null,null,null,null,"2017-11-10",1420]
[null,null,null,null,null,"2017-11-11",2916]
[null,null,null,null,null,"2017-11-12",7448]
[null,null,null,null,null,"2017-11-13",5579]
[null,null,null,null,null,"2017-11-14",3126]
[null,null,null,null,null,"2017-11-15",5754]
[null,null,null,null,null,"2017-11-16",3501]
[null,null,null,null,null,"2017-11-17",2713]
[null,null,null,null,null,"2017-11-18",3817]
[null,null,null,null,null,{"$f":"F334+1","v":"2017-11-19"},4422]
[null,null,null,null,null,"2017-11-20",2885]
[null,null,null,null,null,"2017-11-21",4891]
[null,null,null,null,null,"2017-11-22",8354]
[null,null,null,null,null,"2017-11-23",2006]
[null,null,null,null,null,"2017-11-24",4608]
[null,null,null,null,null,"2017-11-25",9041]
[null,null,null,null,null,"2017-11-26",8632]
[null,null,null,null,null,"2017-11-27",7825]
[null,null,null,null,null,"2017-11-28",3130]
[null,null,null,null,null,"2017-11-29",6544]
[null,null,null,null,null,"2017-11-30",9557]
[null,null,null,null,null,"2017-12-01",8152]
[null,null,null,null,null,"2017-12-02",6767]
[null,null,null,null,null,"2017-12-03",5220]
[null,null,null,null,null,"2017-12-04",9906]
[null,null,null,null,null,"2017-12-05",8528]
[null,null,null,null,null,"2017-12-06",6130]
[null,null,null,null,null,"2017-12-07",9131]
[null,null,null,null,null,"2017-12-08",8011]
[null,null,null,null,null,"2017-12-09",6330]
[null,null,null,null,null,"2017-12-10",5569]
[null,null,null,null,null,"2017-12-11",5067]
[null,null,null,null,null,"2017-12-12",1254]
[null,null,null,null,null,"2017-12-13",6519]
[null,null,null,null,null,"2017-12-14",2869]
[null,null,null,null,null,"2017-12-15",3282]
[null,null,null,null,null,"2017-12-16",5374]
[null,null,null,null,null,"2017-12-17",7454]
[null,null,null,null,null,"2017-12-18",5806]
[null,null,null,null,null,"2017-12-19",4321]
[null,null,null,null,null,"2017-12-20",5785]
[null,null,null,null,null,"2017-12-21",6302]
[null,null,null,null,null,"2017-12-22",9296]
[null,null,null,null,null,"2017-12-23",9377]
[null,null,null,null,null,"2017-12-24",9685]
[null,null,null,null,null,"2017-12-25",2023]
[null,null,null,null,null,"2017-12-26",1696]
[null,null,null,null,null,"2017-12-27",6194]
[null,null,null,null,null,"2017-12-28",4486]
[null,null,null,null,null,"2017-12-29",4367]
[null,null,null,null,null,"2017-12-30",8794]
[null,null,null,null,null,"2017-12-31",7771]
[null,null,null,null,null,"2018-01-01",2237]
[null,null,null,null,null,"2018-01-02",7793]
[null,null,null,null,null,"2018-01-03",5574]
[null,null,null,null,null,"2018-01-04",2923]
[null,null,null,null,null,"2018-01-05",6087]
[null,null,null,null,null,"2018-01-06",7724]
[null,null,null,null,null,"2018-01-07",5913]
[null,null,null,null,null,"2018-01-08",4241]
[null,null,null,null,null,"2018-01-09",4326]
[null,null,null,null,null,"2018-01-10",2186]
[null,null,null,null,null,"2018-01-11",5220]
[null,null,null,null,null,"2018-01-12",1628]
[null,null,null,null,null,"2018-01-13",3030]
[null,null,null,null,null,"2018-01-14",8165]
[null,null,null,null,null,"2018-01-15",8535]
[null,null,null,null,null,"2018-01-16",1730]
[null,null,null,null,null,"2018-01-17",9488]
[null,null,null,null,null,"2018-01-18",8650]
[null,null,null,null,null,"2018-01-19",6615]
[null,null,null,null,null,"2018-01-20",8152]
[null,null,null,null,null,"2018-01-21",1517]
[null,null,null,null,null,{"$f":"F398+1","v":"2018-01-22"},1477]
[null,null,null,null,null,"2018-01-23",9019]
[null,null,null,null,null,"2018-01-24",7194]
[null,null,null,null,null,"2018-01-25",4871]
[null,null,null,null,null,"2018-01-26",4912]
[null,null,null,null,null,"2018-01-27",2301]
[null,null,null,null,null,"2018-01-28",2953]
[null,null,null,null,null,"2018-01-29",6270]
[null,null,null,null,null,"2018-01-30",3246]
[null,null,null,null,null,"2018-01-31",8886]
[null,null,null,null,null,"2018-02-01",2944]
[null,null,null,null,null,"2018-02-02",5574]
[null,null,null,null,null,"2018-02-03",9302]
[null,null,null,null,null,"2018-02-04",6003]
[null,null,null,null,null,"2018-02-05",5003]
[null,null,null,null,null,"2018-02-06",6538]
[null,null,null,null,null,"2018-02-07",5845]
[null,null,null,null,null,"2018-02-08",2841]
[null,null,null,null,null,"2018-02-09",2098]
[null,null,null,null,null,"2018-02-10",3258]
[null,null,null,null,null,"2018-02-11",9661]
[null,null,null,null,null,"2018-02-12",3566]
[null,null,null,null,null,"2018-02-13",2805]
[null,null,null,null,null,"2018-02-14",4585]
[null,null,null,null,null,"2018-02-15",6449]
[null,null,null,null,null,"2018-02-16",4706]
[null,null,null,null,null,"2018-02-17",3190]
[null,null,null,null,null,"2018-02-18",3822]
[null,null,null,null,null,"2018-02-19",4269]
[null,null,null,null,null,"2018-02-20",3678]
[null,null,null,null,null,"2018-02-21",2449]
[null,null,null,null,null,"2018-02-22",8661]
[null,null,null,null,null,"2018-02-23",6506]
[null,null,null,null,null,"2018-02-24",3305]
[null,null,null,null,null,"2018-02-25",3893]
[null,null,null,null,null,"2018-02-26",8977]
[null,null,null,null,null,"2018-02-27",2923]
[null,null,null,null,null,"2018-02-28",8098]
[null,null,null,null,null,"2018-03-01",4368]
[null,null,null,null,null,"2018-03-02",1022]
[null,null,null,null,null,"2018-03-03",3540]
[null,null,null,null,null,"2018-03-04",3927]
[null,null,null,null,null,"2018-03-05",3642]
[null,null,null,null,null,"2018-03-06",2195]
[null,null,null,null,null,"2018-03-07",1234]
[null,null,null,null,null,"2018-03-08",1094]
[null,null,null,null,null,"2018-03-09",5405]
[null,null,null,null,null,"2018-03-10",4376]
[null,null,null,null,null,"2018-03-11",3578]
[null,null,null,null,null,"2018-03-12",6316]
[null,null,null,null,null,"2018-03-13",5697]
[null,null,null,null,null,"2018-03-14",2122]
[null,null,null,null,null,"2018-03-15",6802]
[null,null,null,null,null,"2018-03-16",7671]
[null,null,null,null,null,"2018-03-17",2171]
[null,null,null,null,null,"2018-03-18",6223]
[null,null,null,null,null,"2018-03-19",6968]
[null,null,null,null,null,"2018-03-20",3854]
[null,null,null,null,null,"2018-03-21",1823]
[null,null,null,null,null,"2018-03-22",3300]
[null,null,null,null,null,"2018-03-23",8970]
[null,null,null,null,null,"2018-03-24",2661]
[null,null,null,null,null,"2018-03-25",9576]
[null,null,null,null,null,"2018-03-26",3677]
[null,null,null,null,null,{"$f":"F462+1","v":"2018-03-27"},6760]
[null,null,null,null,null,"2018-03-28",9765]
[null,null,null,null,null,"2018-03-29",3435]
[null,null,null,null,null,"2018-03-30",3866]
[null,null,null,null,null,"2018-03-31",6187]
[null,null,null,null,null,"2018-04-01",2355]
[null,null,null,null,null,"2018-04-02",9463]
[null,null,null,null,null,"2018-04-03",9479]
[null,null,null,null,null,"2018-04-04",1386]
[null,null,null,null,null,"2018-04-05",2864]
[null,null,null,null,null,"2018-04-06",6553]
[null,null,null,null,null,"2018-04-07",3726]
[null,null,null,null,null,"2018-04-08",5509]
[null,null,null,null,null,"2018-04-09",2535]
[null,null,null,null,null,"2018-04-10",5164]
[null,null,null,null,null,"2018-04-11",3728]
[null,null,null,null,null,"2018-04-12",2279]
[null,null,null,null,null,"2018-04-13",2302]
[null,null,null,null,null,"2018-04-14",5249]
[null,null,null,null,null,"2018-04-15",8338]
[null,null,null,null,null,"2018-04-16",2101]
[null,null,null,null,null,"2018-04-17",2453]
[null,null,null,null,null,"2018-04-18",4393]
[null,null,null,null,null,"2018-04-19",5896]
[null,null,null,null,null,"2018-04-20",6987]
[null,null,null,null,null,"2018-04-21",1386]
[null,null,null,null,null,"2018-04-22",2277]
[null,null,null,null,null,"2018-04-23",5812]
[null,null,null,null,null,"2018-04-24",2292]
[null,null,null,null,null,"2018-04-25",2480]
[null,null,null,null,null,"2018-04-26",9651]
[null,null,null,null,null,"2018-04-27",7323]
[null,null,null,null,null,"2018-04-28",7679]
[null,null,null,null,null,"2018-04-29",1919]
[null,null,null,null,null,"2018-04-30",4399]
[null,null,null,null,null,"2018-05-01",5560]
[null,null,null,null,null,"2018-05-02",7959]
[null,null,null,null,null,"2018-05-03",9565]
[null,null,null,null,null,"2018-05-04",6844]
[null,null,null,null,null,"2018-05-05",9226]
[null,null,null,null,null,"2018-05-06",4430]
[null,null,null,null,null,"2018-05-07",9193]
[null,null,null,null,null,"2018-05-08",9903]
[null,null,null,null,null,"2018-05-09",8724]
[null,null,null,null,null,"2018-05-10",1473]
[null,null,null,null,null,"2018-05-11",6887]
[null,null,null,null,null,"2018-05-12",5847]
[null,null,null,null,null,"2018-05-13",3851]
[null,null,null,null,null,"2018-05-14",8253]
[null,null,null,null,null,"2018-05-15",7105]
[null,null,null,null,null,"2018-05-16",9769]
[null,null,null,null,null,"2018-05-17",2450]
[null,null,null,null,null,"2018-05-18",2338]
[null,null,null,null,null,"2018-05-19",5249]
[null,null,null,null,null,"2018-05-20",4381]
[null,null,null,null,null,"2018-05-21",1530]
[null,null,null,null,null,"2018-05-22",6390]
[null,null,null,null,null,"2018-05-23",2344]
[null,null,null,null,null,"2018-05-24",8726]
[null,null,null,null,null,"2018-05-25",7813]
[null,null,null,null,null,"2018-05-26",3578]
[null,null,null,null,null,"2018-05-27",7100]
[null,null,null,null,null,"2018-05-28",8859]
[null,null,null,null,null,"2018-05-29",7682]
[null,null,null,null,null,{"$f":"F526+1","v":"2018-05-30"},1090]
[null,null,null,null,null,"2018-05-31",3320]
[null,null,null,null,null,"2018-06-01",1922]
[null,null,null,null,null,"2018-06-02",9448]
[null,null,null,null,null,"2018-06-03",4720]
[null,null,null,null,null,"2018-06-04",7459]
[null,null,null,null,null,"2018-06-05",4303]
[null,null,null,null,null,"2018-06-06",6437]
[null,null,null,null,null,"2018-06-07",5261]
[null,null,null,null,null,"2018-06-08",1072]
[null,null,null,null,null,"2018-06-09",9643]
[null,null,null,null,null,"2018-06-10",5200]
[null,null,null,null,null,"2018-06-11",5165]
[null,null,null,null,null,"2018-06-12",7319]
[null,null,null,null,null,"2018-06-13",4616]
[null,null,null,null,null,"2018-06-14",7143]
[null,null,null,null,null,"2018-06-15",7706]
[null,null,null,null,null,"2018-06-16",1925]
[null,null,null,null,null,"2018-06-17",1257]
[null,null,null,null,null,"2018-06-18",1522]
[null,null,null,null,null,"2018-06-19",2202]
[null,null,null,null,null,"2018-06-20",9040]
[null,null,null,null,null,"2018-06-21",7385]
[null,null,null,null,null,"2018-06-22",1941]
[null,null,null,null,null,"2018-06-23",3043]
[null,null,null,null,null,"2018-06-24",6637]
[null,null,null,null,null,"2018-06-25",1856]
[null,null,null,null,null,"2018-06-26",6208]
[null,null,null,null,null,"2018-06-27",1559]
[null,null,null,null,null,"2018-06-28",6300]
[null,null,null,null,null,"2018-06-29",8169]
[null,null,null,null,null,"2018-06-30",1225]
[null,null,null,null,null,"2018-07-01",6078]
[null,null,null,null,null,"2018-07-02",7650]
[null,null,null,null,null,"2018-07-03",3869]
[null,null,null,null,null,"2018-07-04",3612]
[null,null,null,null,null,"2018-07-05",1961]
[null,null,null,null,null,"2018-07-06",1016]
[null,null,null,null,null,"2018-07-07",1739]
[null,null,null,null,null,"2018-07-08",9830]
[null,null,null,null,null,"2018-07-09",8157]
[null,null,null,null,null,"2018-07-10",1260]
[null,null,null,null,null,"2018-07-11",3621]
[null,null,null,null,null,"2018-07-12",5605]
[null,null,null,null,null,"2018-07-13",1269]
[null,null,null,null,null,"2018-07-14",6419]
[null,null,null,null,null,"2018-07-15",5165]
[null,null,null,null,null,"2018-07-16",4411]
[null,null,null,null,null,"2018-07-17",8363]
[null,null,null,null,null,"2018-07-18",7229]
[null,null,null,null,null,"2018-07-19",2729]
[null,null,null,null,null,"2018-07-20",6444]
[null,null,null,null,null,"2018-07-21",1111]
[null,null,null,null,null,"2018-07-22",7355]
[null,null,null,null,null,"2018-07-23",5307]
[null,null,null,null,null,"2018-07-24",6668]
[null,null,null,null,null,"2018-07-25",2826]
[null,null,null,null,null,"2018-07-26",7463]
[null,null,null,null,null,"2018-07-27",6130]
[null,null,null,null,null,"2018-07-28",1392]
[null,null,null,null,null,"2018-07-29",9652]
[null,null,null,null,null,"2018-07-30",1412]
[null,null,null,null,null,"2018-07-31",2064]
[null,null,null,null,null,"2018-08-01",8929]
[null,null,null,null,null,{"$f":"F590+1","v":"2018-08-02"},4569]
[null,null,null,null,null,"2018-08-03",2009]
[null,null,null,null,null,"2018-08-04",7471]
[null,null,null,null,null,"2018-08-05",7015]
[null,null,null,null,null,"2018-08-06",3276]
[null,null,null,null,null,"2018-08-07",6839]
[null,null,null,null,null,"2018-08-08",7728]
[null,null,null,null,null,"2018-08-09",6740]
[null,null,null,null,null,"2018-08-10",7334]
[null,null,null,null,null,"2018-08-11",3742]
[null,null,null,null,null,"2018-08-12",8364]
[null,null,null,null,null,"2018-08-13",1686]
[null,null,null,null,null,"2018-08-14",9994]
[null,null,null,null,null,"2018-08-15",9051]
[null,null,null,null,null,"2018-08-16",5401]
[null,null,null,null,null,"2018-08-17",2523]
[null,null,null,null,null,"2018-08-18",5120]
[null,null,null,null,null,"2018-08-19",5126]
[null,null,null,null,null,"2018-08-20",9408]
[null,null,null,null,null,"2018-08-21",1879]
[null,null,null,null,null,"2018-08-22",9597]
[null,null,null,null,null,"2018-08-23",5150]
[null,null,null,null,null,"2018-08-24",2176]
[null,null,null,null,null,"2018-08-25",6076]
[null,null,null,null,null,"2018-08-26",7625]
[null,null,null,null,null,"2018-08-27",2905]
[null,null,null,null,null,"2018-08-28",4335]
[null,null,null,null,null,"2018-08-29",8046]
[null,null,null,null,null,"2018-08-30",1297]
[null,null,null,null,null,"2018-08-31",3971]
[null,null,null,null,null,"2018-09-01",6193]
[null,null,null,null,null,"2018-09-02",2964]
[null,null,null,null,null,"2018-09-03",9190]
[null,null,null,null,null,"2018-09-04",2530]
[null,null,null,null,null,"2018-09-05",3082]
[null,null,null,null,null,"2018-09-06",4112]
[null,null,null,null,null,"2018-09-07",7217]
[null,null,null,null,null,"2018-09-08",7263]
[null,null,null,null,null,"2018-09-09",8330]
[null,null,null,null,null,"2018-09-10",1151]
[null,null,null,null,null,"2018-09-11",6325]
[null,null,null,null,null,"2018-09-12",1929]
[null,null,null,null,null,"2018-09-13",5662]
[null,null,null,null,null,"2018-09-14",9529]
[null,null,null,null,null,"2018-09-15",2802]
[null,null,null,null,null,"2018-09-16",1126]
[null,null,null,null,null,"2018-09-17",6029]
[null,null,null,null,null,"2018-09-18",8238]
[null,null,null,null,null,"2018-09-19",2117]
[null,null,null,null,null,"2018-09-20",8115]
[null,null,null,null,null,"2018-09-21",5418]
[null,null,null,null,null,"2018-09-22",9946]
[null,null,null,null,null,"2018-09-23",1099]
[null,null,null,null,null,"2018-09-24",9434]
[null,null,null,null,null,"2018-09-25",8704]
[null,null,null,null,null,"2018-09-26",4415]
[null,null,null,null,null,"2018-09-27",8292]
[null,null,null,null,null,"2018-09-28",6961]
[null,null,null,null,null,"2018-09-29",3619]
[null,null,null,null,null,"2018-09-30",2818]
[null,null,null,null,null,"2018-10-01",2314]
[null,null,null,null,null,"2018-10-02",5778]
[null,null,null,null,null,"2018-10-03",7901]
[null,null,null,null,null,"2018-10-04",2442]
[null,null,null,null,null,{"$f":"F654+1","v":"2018-10-05"},3707]
[null,null,null,null,null,"2018-10-06",4096]
[null,null,null,null,null,"2018-10-07",4276]
[null,null,null,null,null,"2018-10-08",4713]
[null,null,null,null,null,"2018-10-09",2993]
[null,null,null,null,null,"2018-10-10",5644]
[null,null,null,null,null,"2018-10-11",2563]
[null,null,null,null,null,"2018-10-12",6853]
[null,null,null,null,null,"2018-10-13",6022]
[null,null,null,null,null,"2018-10-14",3568]
[null,null,null,null,null,"2018-10-15",5478]
[null,null,null,null,null,"2018-10-16",9623]
[null,null,null,null,null,"2018-10-17",9794]
[null,null,null,null,null,"2018-10-18",2351]
[null,null,null,null,null,"2018-10-19",6034]
[null,null,null,null,null,"2018-10-20",5316]
[null,null,null,null,null,"2018-10-21",9892]
[null,null,null,null,null,"2018-10-22",1726]
[null,null,null,null,null,"2018-10-23",9261]
[null,null,null,null,null,"2018-10-24",4655]
[null,null,null,null,null,"2018-10-25",6249]
[null,null,null,null,null,"2018-10-26",1806]
[null,null,null,null,null,"2018-10-27",5459]
[null,null,null,null,null,"2018-10-28",1770]
[null,null,null,null,null,"2018-10-29",6709]
[null,null,null,null,null,"2018-10-30",8538]
[null,null,null,null,null,"2018-10-31",6297]
[null,null,null,null,null,"2018-11-01",1671]
[null,null,null,null,null,"2018-11-02",3403]
[null,null,null,null,null,"2018-11-03",3722]
[null,null,null,null,null,"2018-11-04",1834]
[null,null,null,null,null,"2018-11-05",4055]
[null,null,null,null,null,"2018-11-06",1760]
[null,null,null,null,null,"2018-11-07",2046]
[null,null,null,null,null,"2018-11-08",6015]
[null,null,null,null,null,"2018-11-09",1468]
[null,null,null,null,null,"2018-11-10",1008]
[null,null,null,null,null,"2018-11-11",4906]
[null,null,null,null,null,"2018-11-12",7619]
[null,null,null,null,null,"2018-11-13",7705]
[null,null,null,null,null,"2018-11-14",3001]
[null,null,null,null,null,"2018-11-15",2603]
[null,null,null,null,null,"2018-11-16",4817]
[null,null,null,null,null,"2018-11-17",3963]
[null,null,null,null,null,"2018-11-18",2838]
[null,null,null,null,null,"2018-11-19",7078]
[null,null,null,null,null,"2018-11-20",1833]
[null,null,null,null,null,"2018-11-21",4621]
[null,null,null,null,null,"2018-11-22",7943]
[null,null,null,null,null,"2018-11-23",5975]
[null,null,null,null,null,"2018-11-24",7068]
[null,null,null,null,null,"2018-11-25",7900]
[null,null,null,null,null,"2018-11-26",6555]
[null,null,null,null,null,"2018-11-27",1562]
[null,null,null,null,null,"2018-11-28",6222]
[null,null,null,null,null,"2018-11-29",6342]
[null,null,null,null,null,"2018-11-30",9155]
[null,null,null,null,null,"2018-12-01",9119]
[null,null,null,null,null,"2018-12-02",2071]
[null,null,null,null,null,"2018-12-03",6661]
[null,null,null,null,null,"2018-12-04",4900]
[null,null,null,null,null,"2018-12-05",7321]
[null,null,null,null,null,"2018-12-06",7943]
[null,null,null,null,null,"2018-12-07",8907]
[null,null,null,null,null,{"$f":"F718+1","v":"2018-12-08"},1923]
[null,null,null,null,null,"2018-12-09",9044]
[null,null,null,null,null,"2018-12-10",5138]
[null,null,null,null,null,"2018-12-11",1156]
[null,null,null,null,null,"2018-12-12",2016]
[null,null,null,null,null,"2018-12-13",3170]
[null,null,null,null,null,"2018-12-14",1677]
[null,null,null,null,null,"2018-12-15",1656]
[null,null,null,null,null,"2018-12-16",8673]
[null,null,null,null,null,"2018-12-17",6296]
[null,null,null,null,null,"2018-12-18",8484]
[null,null,null,null,null,"2018-12-19",8384]
[null,null,null,null,null,"2018-12-20",5894]
[null,null,null,null,null,"2018-12-21",9061]
[null,null,null,null,null,"2018-12-22",5827]
[null,null,null,null,null,"2018-12-23",7036]
[null,null,null,null,null,"2018-12-24",9637]
[null,null,null,null,null,"2018-12-25",1553]
[null,null,null,null,null,"2018-12-26",3768]
[null,null,null,null,null,"2018-12-27",5943]
[null,null,null,null,null,"2018-12-28",8792]
[null,null,null,null,null,"2018-12-29",6443]
[null,null,null,null,null,"2018-12-30",1045]
[null,null,null,null,null,"2018-12-31",3825]
[null,null,null,null,null,"2019-01-01",4400]
[null,null,null,null,null,"2019-01-02",6072]
[null,null,null,null,null,"2019-01-03",8358]
[null,null,null,null,null,"2019-01-04",7435]
[null,null,null,null,null,"2019-01-05",6786]
[null,null,null,null,null,"2019-01-06",4278]
[null,null,null,null,null,"2019-01-07",9309]
[null,null,null,null,null,"2019-01-08",3869]
[null,null,null,null,null,"2019-01-09",5889]
[null,null,null,null,null,"2019-01-10",5134]
[null,null,null,null,null,"2019-01-11",1499]
[null,null,null,null,null,"2019-01-12",2045]
[null,null,null,null,null,"2019-01-13",5356]
[null,null,null,null,null,"2019-01-14",8627]
[null,null,null,null,null,"2019-01-15",5044]
[null,null,null,null,null,"2019-01-16",6888]
[null,null,null,null,null,"2019-01-17",2439]
[null,null,null,null,null,"2019-01-18",4722]
[null,null,null,null,null,"2019-01-19",5206]
[null,null,null,null,null,"2019-01-20",3741]
[null,null,null,null,null,"2019-01-21",6503]
[null,null,null,null,null,"2019-01-22",7279]
[null,null,null,null,null,"2019-01-23",6494]
[null,null,null,null,null,"2019-01-24",1422]
[null,null,null,null,null,"2019-01-25",6913]
[null,null,null,null,null,"2019-01-26",9965]
[null,null,null,null,null,"2019-01-27",7451]
[null,null,null,null,null,"2019-01-28",9719]
[null,null,null,null,null,"2019-01-29",3974]
[null,null,null,null,null,"2019-01-30",2961]
[null,null,null,null,null,"2019-01-31",3768]
[null,null,null,null,null,"2019-02-01",9265]
[null,null,null,null,null,"2019-02-02",2571]
[null,null,null,null,null,"2019-02-03",6118]
[null,null,null,null,null,"2019-02-04",9943]
[null,null,null,null,null,"2019-02-05",7572]
[null,null,null,null,null,"2019-02-06",9229]
[null,null,null,null,null,"2019-02-07",2734]
[null,null,null,null,null,"2019-02-08",9832]
[null,null,null,null,null,"2019-02-09",5093]
[null,null,null,null,null,{"$f":"F782+1","v":"2019-02-10"},4992]
[null,null,null,null,null,"2019-02-11",6093]
[null,null,null,null,null,"2019-02-12",2047]
[null,null,null,null,null,"2019-02-13",6337]
[null,null,null,null,null,"2019-02-14",4684]
[null,null,null,null,null,"2019-02-15",1991]
[null,null,null,null,null,"2019-02-16",7156]
[null,null,null,null,null,"2019-02-17",7513]
[null,null,null,null,null,"2019-02-18",5548]
[null,null,null,null,null,"2019-02-19",2262]
[null,null,null,null,null,"2019-02-20",9158]
[null,null,null,null,null,"2019-02-21",6336]
[null,null,null,null,null,"2019-02-22",3061]
[null,null,null,null,null,"2019-02-23",3294]
[null,null,null,null,null,"2019-02-24",8010]
[null,null,null,null,null,"2019-02-25",2337]
[null,null,null,null,null,"2019-02-26",7511]
[null,null,null,null,null,"2019-02-27",9665]
[null,null,null,null,null,"2019-02-28",2715]
[null,null,null,null,null,"2019-03-01",7784]
[null,null,null,null,null,"2019-03-02",8727]
[null,null,null,null,null,"2019-03-03",4738]
[null,null,null,null,null,"2019-03-04",8167]
[null,null,null,null,null,"2019-03-05",4190]
[null,null,null,null,null,"2019-03-06",8734]
[null,null,null,null,null,"2019-03-07",3848]
[null,null,null,null,null,"2019-03-08",9082]
[null,null,null,null,null,"2019-03-09",1752]
[null,null,null,null,null,"2019-03-10",8841]
[null,null,null,null,null,"2019-03-11",4836]
[null,null,null,null,null,"2019-03-12",2405]
[null,null,null,null,null,"2019-03-13",8880]
[null,null,null,null,null,"2019-03-14",8650]
[null,null,null,null,null,"2019-03-15",8707]
[null,null,null,null,null,"2019-03-16",1086]
[null,null,null,null,null,"2019-03-17",6271]
[null,null,null,null,null,"2019-03-18",7763]
[null,null,null,null,null,"2019-03-19",8982]
[null,null,null,null,null,"2019-03-20",3585]
[null,null,null,null,null,"2019-03-21",5666]
[null,null,null,null,null,"2019-03-22",2613]
[null,null,null,null,null,"2019-03-23",8464]
[null,null,null,null,null,"2019-03-24",2019]
[null,null,null,null,null,"2019-03-25",8532]
[null,null,null,null,null,"2019-03-26",7486]
[null,null,null,null,null,"2019-03-27",3824]
[null,null,null,null,null,"2019-03-28",5238]
[null,null,null,null,null,"2019-03-29",6558]
[null,null,null,null,null,"2019-03-30",6620]
[null,null,null,null,null,"2019-03-31",7861]
[null,null,null,null,null,"2019-04-01",9021]
[null,null,null,null,null,"2019-04-02",6624]
[null,null,null,null,null,"2019-04-03",7715]
[null,null,null,null,null,"2019-04-04",5050]
[null,null,null,null,null,"2019-04-05",5862]
[null,null,null,null,null,"2019-04-06",5391]
[null,null,null,null,null,"2019-04-07",6943]
[null,null,null,null,null,"2019-04-08",6637]
[null,null,null,null,null,"2019-04-09",9778]
[null,null,null,null,null,"2019-04-10",8101]
[null,null,null,null,null,"2019-04-11",4884]
[null,null,null,null,null,"2019-04-12",6693]
[null,null,null,null,null,"2019-04-13",7642]
[null,null,null,null,null,"2019-04-14",4536]
[null,null,null,null,null,{"$f":"F846+1","v":"2019-04-15"},5093]
[null,null,null,null,null,"2019-04-16",1113]
[null,null,null,null,null,"2019-04-17",5317]
[null,null,null,null,null,"2019-04-18",9508]
[null,null,null,null,null,"2019-04-19",6156]
[null,null,null,null,null,"2019-04-20",6607]
[null,null,null,null,null,"2019-04-21",2965]
[null,null,null,null,null,"2019-04-22",1703]
[null,null,null,null,null,"2019-04-23",2314]
[null,null,null,null,null,"2019-04-24",4591]
[null,null,null,null,null,"2019-04-25",3443]
[null,null,null,null,null,"2019-04-26",5343]
[null,null,null,null,null,"2019-04-27",2020]
[null,null,null,null,null,"2019-04-28",3228]
[null,null,null,null,null,"2019-04-29",4774]
[null,null,null,null,null,"2019-04-30",1501]
[null,null,null,null,null,"2019-05-01",5663]
[null,null,null,null,null,"2019-05-02",4654]
[null,null,null,null,null,"2019-05-03",9271]
[null,null,null,null,null,"2019-05-04",8542]
[null,null,null,null,null,"2019-05-05",2954]
[null,null,null,null,null,"2019-05-06",1656]
[null,null,null,null,null,"2019-05-07",7320]
[null,null,null,null,null,"2019-05-08",8402]
[null,null,null,null,null,"2019-05-09",6725]
[null,null,null,null,null,"2019-05-10",1576]
[null,null,null,null,null,"2019-05-11",5406]
[null,null,null,null,null,"2019-05-12",2374]
[null,null,null,null,null,"2019-05-13",8959]
[null,null,null,null,null,"2019-05-14",6718]
[null,null,null,null,null,"2019-05-15",6789]
[null,null,null,null,null,"2019-05-16",5245]
[null,null,null,null,null,"2019-05-17",9723]
[null,null,null,null,null,"2019-05-18",6081]
[null,null,null,null,null,"2019-05-19",5545]
[null,null,null,null,null,"2019-05-20",1605]
[null,null,null,null,null,"2019-05-21",3301]
[null,null,null,null,null,"2019-05-22",8392]
[null,null,null,null,null,"2019-05-23",3104]
[null,null,null,null,null,"2019-05-24",7440]
[null,null,null,null,null,"2019-05-25",5842]
[null,null,null,null,null,"2019-05-26",7538]
[null,null,null,null,null,"2019-05-27",7137]
[null,null,null,null,null,"2019-05-28",6800]
[null,null,null,null,null,"2019-05-29",2059]
[null,null,null,null,null,"2019-05-30",5279]
[null,null,null,null,null,"2019-05-31",7978]
[null,null,null,null,null,"2019-06-01",8211]
[null,null,null,null,null,"2019-06-02",9394]
[null,null,null,null,null,"2019-06-03",1157]
[null,null,null,null,null,"2019-06-04",1949]
[null,null,null,null,null,"2019-06-05",8839]
[null,null,null,null,null,"2019-06-06",2985]
[null,null,null,null,null,"2019-06-07",7199]
[null,null,null,null,null,"2019-06-08",8632]
[null,null,null,null,null,"2019-06-09",2678]
[null,null,null,null,null,"2019-06-10",9649]
[null,null,null,null,null,"2019-06-11",6481]
[null,null,null,null,null,"2019-06-12",3261]
[null,null,null,null,null,"2019-06-13",3833]
[null,null,null,null,null,"2019-06-14",2147]
[null,null,null,null,null,"2019-06-15",4850]
[null,null,null,null,null,"2019-06-16",3471]
[null,null,null,null,null,"2019-06-17",4952]
[null,null,null,null,null,{"$f":"F910+1","v":"2019-06-18"},8927]
[null,null,null,null,null,"2019-06-19",2436]
[null,null,null,null,null,"2019-06-20",6139]
[null,null,null,null,null,"2019-06-21",7315]
[null,null,null,null,null,"2019-06-22",3722]
[null,null,null,null,null,"2019-06-23",3711]
[null,null,null,null,null,"2019-06-24",4401]
[null,null,null,null,null,"2019-06-25",9724]
[null,null,null,null,null,"2019-06-26",1503]
[null,null,null,null,null,"2019-06-27",7363]
[null,null,null,null,null,"2019-06-28",6650]
[null,null,null,null,null,"2019-06-29",7427]
[null,null,null,null,null,"2019-06-30",6536]
[null,null,null,null,null,"2019-07-01",3464]
[null,null,null,null,null,"2019-07-02",8512]
[null,null,null,null,null,"2019-07-03",5769]
[null,null,null,null,null,"2019-07-04",5680]
[null,null,null,null,null,"2019-07-05",3156]
[null,null,null,null,null,"2019-07-06",5550]
[null,null,null,null,null,"2019-07-07",6880]
[null,null,null,null,null,"2019-07-08",2322]
[null,null,null,null,null,"2019-07-09",1398]
[null,null,null,null,null,"2019-07-10",5602]
[null,null,null,null,null,"2019-07-11",8834]
[null,null,null,null,null,"2019-07-12",4831]
[null,null,null,null,null,"2019-07-13",5617]
[null,null,null,null,null,"2019-07-14",1796]
[null,null,null,null,null,"2019-07-15",7531]
[null,null,null,null,null,"2019-07-16",1037]
[null,null,null,null,null,"2019-07-17",8350]
[null,null,null,null,null,"2019-07-18",9223]
[null,null,null,null,null,"2019-07-19",1719]
[null,null,null,null,null,"2019-07-20",8560]
[null,null,null,null,null,"2019-07-21",7503]
[null,null,null,null,null,"2019-07-22",7591]
[null,null,null,null,null,"2019-07-23",4103]
[null,null,null,null,null,"2019-07-24",3429]
[null,null,null,null,null,"2019-07-25",8678]
[null,null,null,null,null,"2019-07-26",5133]
[null,null,null,null,null,"2019-07-27",4669]
[null,null,null,null,null,"2019-07-28",7925]
[null,null,null,null,null,"2019-07-29",5335]
[null,null,null,null,null,"2019-07-30",2379]
[null,null,null,null,null,"2019-07-31",2575]
[null,null,null,null,null,"2019-08-01",6333]
[null,null,null,null,null,"2019-08-02",9472]
[null,null,null,null,null,"2019-08-03",2375]
[null,null,null,null,null,"2019-08-04",1631]
[null,null,null,null,null,"2019-08-05",3856]
[null,null,null,null,null,"2019-08-06",6381]
[null,null,null,null,null,"2019-08-07",9655]
[null,null,null,null,null,"2019-08-08",1587]
[null,null,null,null,null,"2019-08-09",3283]
[null,null,null,null,null,"2019-08-10",5086]
[null,null,null,null,null,"2019-08-11",5509]
[null,null,null,null,null,"2019-08-12",1663]
[null,null,null,null,null,"2019-08-13",2656]
[null,null,null,null,null,"2019-08-14",5199]
[null,null,null,null,null,"2019-08-15",8185]
[null,null,null,null,null,"2019-08-16",6352]
[null,null,null,null,null,"2019-08-17",1564]
[null,null,null,null,null,"2019-08-18",9366]
[null,null,null,null,null,"2019-08-19",3822]
[null,null,null,null,null,"2019-08-20",9751]
[null,null,null,null,null,{"$f":"F974+1","v":"2019-08-21"},9321]
[null,null,null,null,null,"2019-08-22",2393]
[null,null,null,null,null,"2019-08-23",6866]
[null,null,null,null,null,"2019-08-24",1066]
[null,null,null,null,null,"2019-08-25",7247]
[null,null,null,null,null,"2019-08-26",6421]
[null,null,null,null,null,"2019-08-27",1319]
[null,null,null,null,null,"2019-08-28",8011]
[null,null,null,null,null,"2019-08-29",3810]
[null,null,null,null,null,"2019-08-30",3841]
[null,null,null,null,null,"2019-08-31",7024]
[null,null,null,null,null,"2019-09-01",3494]
[null,null,null,null,null,"2019-09-02",1810]
[null,null,null,null,null,"2019-09-03",3364]
[null,null,null,null,null,"2019-09-04",8266]
[null,null,null,null,null,"2019-09-05",4631]
[null,null,null,null,null,"2019-09-06",2991]
[null,null,null,null,null,"2019-09-07",2778]
[null,null,null,null,null,"2019-09-08",8762]
[null,null,null,null,null,"2019-09-09",1014]
[null,null,null,null,null,"2019-09-10",6115]
[null,null,null,null,null,"2019-09-11",1321]
[null,null,null,null,null,"2019-09-12",3793]
[null,null,null,null,null,"2019-09-13",4201]
[null,null,null,null,null,"2019-09-14",3951]
[null,null,null,null,null,"2019-09-15",7527]
[null,null,null,null,null,"2019-09-16",5585]
[null,null,null,null,null,"2019-09-17",8648]
[null,null,null,null,null,"2019-09-18",6009]
[null,null,null,null,null,"2019-09-19",5088]
[null,null,null,null,null,"2019-09-20",9705]
[null,null,null,null,null,"2019-09-21",7820]
[null,null,null,null,null,"2019-09-22",9703]
[null,null,null,null,null,"2019-09-23",9756]
[null,null,null,null,null,"2019-09-24",6824]
[null,null,null,null,null,"2019-09-25",7690]
[null,null,null,null,null,"2019-09-26",5931]
[null,null,null,null,null,"2019-09-27",3242]
[null,null,null,null,null,"2019-09-28",9587]
[null,null,null,null,null,"2019-09-29",9615]
[null,null,null,null,null,"2019-09-30",8509]
[null,null,null,null,null,"2019-10-01",8511]
[null,null,null,null,null,"2019-10-02",2990]
[null,null,null,null,null,"2019-10-03",2375]
[null,null,null,null,null,"2019-10-04",2735]
[null,null,null,null,null,"2019-10-05",6435]
[null,null,null,null,null,"2019-10-06",7252]
[null,null,null,null,null,"2019-10-07",1306]
[null,null,null,null,null,"2019-10-08",2128]
[null,null,null,null,null,"2019-10-09",3416]
[null,null,null,null,null,"2019-10-10",9417]
[null,null,null,null,null,"2019-10-11",6413]
[null,null,null,null,null,"2019-10-12",2286]
[null,null,null,null,null,"2019-10-13",4940]
[null,null,null,null,null,"2019-10-14",8726]
[null,null,null,null,null,"2019-10-15",3791]
[null,null,null,null,null,"2019-10-16",7368]
[null,null,null,null,null,"2019-10-17",2085]
[null,null,null,null,null,"2019-10-18",2789]
[null,null,null,null,null,"2019-10-19",7737]
[null,null,null,null,null,"2019-10-20",8566]
[null,null,null,null,null,"2019-10-21",5731]
[null,null,null,null,null,"2019-10-22",5967]
[null,null,null,null,null,"2019-10-23",4976]
[null,null,null,null,null,{"$f":"F1038+1","v":"2019-10-24"},1821]
[null,null,null,null,null,"2019-10-25",8552]
[null,null,null,null,null,"2019-10-26",9916]
[null,null,null,null,null,"2019-10-27",4228]
[null,null,null,null,null,"2019-10-28",5711]
[null,null,null,null,null,"2019-10-29",9354]
[null,null,null,null,null,"2019-10-30",3166]
[null,null,null,null,null,"2019-10-31",9840]
[null,null,null,null,null,"2019-11-01",6581]
[null,null,null,null,null,"2019-11-02",1948]
[null,null,null,null,null,"2019-11-03",3588]
[null,null,null,null,null,"2019-11-04",8271]
[null,null,null,null,null,"2019-11-05",5335]
[null,null,null,null,null,"2019-11-06",5402]
[null,null,null,null,null,"2019-11-07",8010]
[null,null,null,null,null,"2019-11-08",3975]
[null,null,null,null,null,"2019-11-09",6034]
[null,null,null,null,null,"2019-11-10",2063]
[null,null,null,null,null,"2019-11-11",2326]
[null,null,null,null,null,"2019-11-12",1647]
[null,null,null,null,null,"2019-11-13",6229]
[null,null,null,null,null,"2019-11-14",2914]
[null,null,null,null,null,"2019-11-15",6420]
[null,null,null,null,null,"2019-11-16",8622]
[null,null,null,null,null,"2019-11-17",8100]
[null,null,null,null,null,"2019-11-18",6971]
[null,null,null,null,null,"2019-11-19",3545]
[null,null,null,null,null,"2019-11-20",9774]
[null,null,null,null,null,"2019-11-21",4974]
[null,null,null,null,null,"2019-11-22",4953]
[null,null,null,null,null,"2019-11-23",4185]
[null,null,null,null,null,"2019-11-24",5046]
[null,null,null,null,null,"2019-11-25",5811]
[null,null,null,null,null,"2019-11-26",4791]
[null,null,null,null,null,"2019-11-27",4565]
[null,null,null,null,null,"2019-11-28",2856]
[null,null,null,null,null,"2019-11-29",5891]
[null,null,null,null,null,"2019-11-30",4729]
[null,null,null,null,null,"2019-12-01",8337]
[null,null,null,null,null,"2019-12-02",6142]
[null,null,null,null,null,"2019-12-03",3269]
[null,null,null,null,null,"2019-12-04",9497]
[null,null,null,null,null,"2019-12-05",3777]
[null,null,null,null,null,"2019-12-06",9136]
[null,null,null,null,null,"2019-12-07",6182]
[null,null,null,null,null,"2019-12-08",5858]
[null,null,null,null,null,"2019-12-09",7029]
[null,null,null,null,null,"2019-12-10",2741]
[null,null,null,null,null,"2019-12-11",4258]
[null,null,null,null,null,"2019-12-12",9214]
[null,null,null,null,null,"2019-12-13",1451]
[null,null,null,null,null,"2019-12-14",1411]
[null,null,null,null,null,"2019-12-15",9424]
[null,null,null,null,null,"2019-12-16",1235]
[null,null,null,null,null,"2019-12-17",9640]
[null,null,null,null,null,"2019-12-18",8864]
[null,null,null,null,null,"2019-12-19",8804]
[null,null,null,null,null,"2019-12-20",6536]
[null,null,null,null,null,"2019-12-21",2653]
[null,null,null,null,null,"2019-12-22",4126]
[null,null,null,null,null,"2019-12-23",3836]
[null,null,null,null,null,"2019-12-24",2280]
[null,null,null,null,null,"2019-12-25",9528]
[null,null,null,null,null,"2019-12-26",2031]
[null,null,null,null,null,{"$f":"F1102+1","v":"2019-12-27"},2681]
[null,null,null,null,null,"2019-12-28",9205]
[null,null,null,null,null,"2019-12-29",7255]
[null,null,null,null,null,"2019-12-30",2039]
[null,null,null,null,null,"2019-12-31",1886]
[null,null,null,null,null,"2020-01-01",4388]
[null,null,null,null,null,"2020-01-02",6882]
[null,null,null,null,null,"2020-01-03",2267]
[null,null,null,null,null,"2020-01-04",3038]
[null,null,null,null,null,"2020-01-05",3891]
[null,null,null,null,null,"2020-01-06",5412]
[null,null,null,null,null,"2020-01-07",4981]
[null,null,null,null,null,"2020-01-08",4275]
[null,null,null,null,null,"2020-01-09",5955]
[null,null,null,null,null,"2020-01-10",1517]
[null,null,null,null,null,"2020-01-11",2079]
[null,null,null,null,null,"2020-01-12",1640]
[null,null,null,null,null,"2020-01-13",5944]
[null,null,null,null,null,"2020-01-14",2469]
[null,null,null,null,null,"2020-01-15",2414]
[null,null,null,null,null,"2020-01-16",8332]
[null,null,null,null,null,"2020-01-17",7190]
[null,null,null,null,null,"2020-01-18",4327]
[null,null,null,null,null,"2020-01-19",8584]
[null,null,null,null,null,"2020-01-20",5795]
[null,null,null,null,null,"2020-01-21",6701]
[null,null,null,null,null,"2020-01-22",9114]
[null,null,null,null,null,"2020-01-23",6302]
[null,null,null,null,null,"2020-01-24",4861]
[null,null,null,null,null,"2020-01-25",2768]
[null,null,null,null,null,"2020-01-26",6804]
[null,null,null,null,null,"2020-01-27",7363]
[null,null,null,null,null,"2020-01-28",9943]
[null,null,null,null,null,"2020-01-29",6088]
[null,null,null,null,null,"2020-01-30",2040]
[null,null,null,null,null,"2020-01-31",8298]
[null,null,null,null,null,"2020-02-01",8182]
[null,null,null,null,null,"2020-02-02",7544]
[null,null,null,null,null,"2020-02-03",1778]
[null,null,null,null,null,"2020-02-04",1170]
[null,null,null,null,null,"2020-02-05",1397]
[null,null,null,null,null,"2020-02-06",7354]
[null,null,null,null,null,"2020-02-07",6946]
[null,null,null,null,null,"2020-02-08",6036]
[null,null,null,null,null,"2020-02-09",4859]
[null,null,null,null,null,"2020-02-10",8826]
[null,null,null,null,null,"2020-02-11",3388]
[null,null,null,null,null,"2020-02-12",5246]
[null,null,null,null,null,"2020-02-13",6020]
[null,null,null,null,null,"2020-02-14",2304]
[null,null,null,null,null,"2020-02-15",7914]
[null,null,null,null,null,"2020-02-16",6325]
[null,null,null,null,null,"2020-02-17",4074]
[null,null,null,null,null,"2020-02-18",1916]
[null,null,null,null,null,"2020-02-19",9637]
[null,null,null,null,null,"2020-02-20",3161]
[null,null,null,null,null,"2020-02-21",2012]
[null,null,null,null,null,"2020-02-22",3217]
[null,null,null,null,null,"2020-02-23",9487]
[null,null,null,null,null,"2020-02-24",8596]
[null,null,null,null,null,"2020-02-25",3128]
[null,null,null,null,null,"2020-02-26",8097]
[null,null,null,null,null,"2020-02-27",5564]
[null,null,null,null,null,"2020-02-28",6179]
[null,null,null,null,null,{"$f":"F1166+1","v":"2020-02-29"},6258]
[null,null,null,null,null,"2020-03-01",4227]
[null,null,null,null,null,"2020-03-02",8563]
[null,null,null,null,null,"2020-03-03",6391]
[null,null,null,null,null,"2020-03-04",4543]
[null,null,null,null,null,"2020-03-05",8668]
[null,null,null,null,null,"2020-03-06",7776]
[null,null,null,null,null,"2020-03-07",7584]
[null,null,null,null,null,"2020-03-08",2476]
[null,null,null,null,null,"2020-03-09",4777]
[null,null,null,null,null,"2020-03-10",7222]
[null,null,null,null,null,"2020-03-11",7484]
[null,null,null,null,null,"2020-03-12",6127]
[null,null,null,null,null,"2020-03-13",5829]
[null,null,null,null,null,"2020-03-14",8843]
[null,null,null,null,null,"2020-03-15",1883]
[null,null,null,null,null,"2020-03-16",2410]
[null,null,null,null,null,"2020-03-17",1964]
[null,null,null,null,null,"2020-03-18",9259]
[null,null,null,null,null,"2020-03-19",7395]
[null,null,null,null,null,"2020-03-20",8370]
[null,null,null,null,null,"2020-03-21",4880]
[null,null,null,null,null,"2020-03-22",6232]
[null,null,null,null,null,"2020-03-23",9294]
[null,null,null,null,null,"2020-03-24",7235]
[null,null,null,null,null,"2020-03-25",3555]
[null,null,null,null,null,"2020-03-26",9737]
[null,null,null,null,null,"2020-03-27",2682]
[null,null,null,null,null,"2020-03-28",9060]
[null,null,null,null,null,"2020-03-29",9603]
[null,null,null,null,null,"2020-03-30",3133]
[null,null,null,null,null,"2020-03-31",1741]
[null,null,null,null,null,"2020-04-01",5672]
[null,null,null,null,null,"2020-04-02",2824]
[null,null,null,null,null,"2020-04-03",3677]
[null,null,null,null,null,"2020-04-04",2672]
[null,null,null,null,null,"2020-04-05",4196]
[null,null,null,null,null,"2020-04-06",6851]
[null,null,null,null,null,"2020-04-07",1187]
[null,null,null,null,null,"2020-04-08",4355]
[null,null,null,null,null,"2020-04-09",2644]
[null,null,null,null,null,"2020-04-10",9261]
[null,null,null,null,null,"2020-04-11",2238]
[null,null,null,null,null,"2020-04-12",2179]
[null,null,null,null,null,"2020-04-13",1994]
[null,null,null,null,null,"2020-04-14",1602]
[null,null,null,null,null,"2020-04-15",5449]
[null,null,null,null,null,"2020-04-16",2752]
[null,null,null,null,null,"2020-04-17",1877]
[null,null,null,null,null,"2020-04-18",3596]
[null,null,null,null,null,"2020-04-19",1940]
[null,null,null,null,null,"2020-04-20",2254]
[null,null,null,null,null,"2020-04-21",2110]
[null,null,null,null,null,"2020-04-22",7776]
[null,null,null,null,null,"2020-04-23",9502]
[null,null,null,null,null,"2020-04-24",4232]
[null,null,null,null,null,"2020-04-25",6372]
[null,null,null,null,null,"2020-04-26",3315]
[null,null,null,null,null,"2020-04-27",5165]
[null,null,null,null,null,"2020-04-28",9958]
[null,null,null,null,null,"2020-04-29",7408]
[null,null,null,null,null,"2020-04-30",7447]
[null,null,null,null,null,"2020-05-01",7824]
[null,null,null,null,null,"2020-05-02",5942]
[null,null,null,null,null,{"$f":"F1230+1","v":"2020-05-03"},1805]
[null,null,null,null,null,"2020-05-04",4235]
[null,null,null,null,null,"2020-05-05",7177]
[null,null,null,null,null,"2020-05-06",9141]
[null,null,null,null,null,"2020-05-07",4007]
[null,null,null,null,null,"2020-05-08",2634]
[null,null,null,null,null,"2020-05-09",2262]
[null,null,null,null,null,"2020-05-10",9981]
[null,null,null,null,null,"2020-05-11",8398]
[null,null,null,null,null,"2020-05-12",9660]
[null,null,null,null,null,"2020-05-13",3053]
[null,null,null,null,null,"2020-05-14",6024]
[null,null,null,null,null,"2020-05-15",6721]
[null,null,null,null,null,"2020-05-16",2097]
[null,null,null,null,null,"2020-05-17",9887]
[null,null,null,null,null,"2020-05-18",1638]
[null,null,null,null,null,"2020-05-19",2458]
[null,null,null,null,null,"2020-05-20",5561]
[null,null,null,null,null,"2020-05-21",8865]
[null,null,null,null,null,"2020-05-22",6421]
[null,null,null,null,null,"2020-05-23",4362]
[null,null,null,null,null,"2020-05-24",7277]
[null,null,null,null,null,"2020-05-25",2038]
[null,null,null,null,null,"2020-05-26",6459]
[null,null,null,null,null,"2020-05-27",7946]
[null,null,null,null,null,"2020-05-28",4399]
[null,null,null,null,null,"2020-05-29",7889]
[null,null,null,null,null,"2020-05-30",5016]
[null,null,null,null,null,"2020-05-31",5673]
[null,null,null,null,null,"2020-06-01",2166]
[null,null,null,null,null,"2020-06-02",7797]
[null,null,null,null,null,"2020-06-03",4188]
[null,null,null,null,null,"2020-06-04",6646]
[null,null,null,null,null,"2020-06-05",1799]
[null,null,null,null,null,"2020-06-06",3535]
[null,null,null,null,null,"2020-06-07",8894]
[null,null,null,null,null,"2020-06-08",9304]
[null,null,null,null,null,"2020-06-09",9765]
[null,null,null,null,null,"2020-06-10",9605]
[null,null,null,null,null,"2020-06-11",4784]
[null,null,null,null,null,"2020-06-12",4531]
[null,null,null,null,null,"2020-06-13",9087]
[null,null,null,null,null,"2020-06-14",7009]
[null,null,null,null,null,"2020-06-15",6116]
[null,null,null,null,null,"2020-06-16",1123]
[null,null,null,null,null,"2020-06-17",2865]
[null,null,null,null,null,"2020-06-18",2770]
[null,null,null,null,null,"2020-06-19",3909]
[null,null,null,null,null,"2020-06-20",7710]
[null,null,null,null,null,"2020-06-21",9645]
[null,null,null,null,null,"2020-06-22",1423]
[null,null,null,null,null,"2020-06-23",3396]
[null,null,null,null,null,"2020-06-24",6432]
[null,null,null,null,null,"2020-06-25",1694]
[null,null,null,null,null,"2020-06-26",2892]
[null,null,null,null,null,"2020-06-27",8289]
[null,null,null,null,null,"2020-06-28",6284]
[null,null,null,null,null,"2020-06-29",7792]
[null,null,null,null,null,"2020-06-30",9959]
[null,null,null,null,null,"2020-07-01",6369]
[null,null,null,null,null,"2020-07-02",8845]
[null,null,null,null,null,"2020-07-03",3914]
[null,null,null,null,null,"2020-07-04",7335]
[null,null,null,null,null,"2020-07-05",9969]
[null,null,null,null,null,{"$f":"F1294+1","v":"2020-07-06"},1490]
[null,null,null,null,null,"2020-07-07",3685]
[null,null,null,null,null,"2020-07-08",5824]
[null,null,null,null,null,"2020-07-09",5013]
[null,null,null,null,null,"2020-07-10",6598]
[null,null,null,null,null,"2020-07-11",1195]
[null,null,null,null,null,"2020-07-12",3273]
[null,null,null,null,null,"2020-07-13",7822]
[null,null,null,null,null,"2020-07-14",7333]
[null,null,null,null,null,"2020-07-15",6577]
[null,null,null,null,null,"2020-07-16",5636]
[null,null,null,null,null,"2020-07-17",1953]
[null,null,null,null,null,"2020-07-18",8416]
[null,null,null,null,null,"2020-07-19",1382]
[null,null,null,null,null,"2020-07-20",3310]
[null,null,null,null,null,"2020-07-21",8118]
[null,null,null,null,null,"2020-07-22",1935]
[null,null,null,null,null,"2020-07-23",9468]
[null,null,null,null,null,"2020-07-24",9906]
[null,null,null,null,null,"2020-07-25",7150]
[null,null,null,null,null,"2020-07-26",5795]
[null,null,null,null,null,"2020-07-27",5477]
[null,null,null,null,null,"2020-07-28",7683]
[null,null,null,null,null,"2020-07-29",1744]
[null,null,null,null,null,"2020-07-30",5117]
[null,null,null,null,null,"2020-07-31",3753]
[null,null,null,null,null,"2020-08-01",1265]
[null,null,null,null,null,"2020-08-02",5337]
[null,null,null,null,null,"2020-08-03",9612]
[null,null,null,null,null,"2020-08-04",2317]
[null,null,null,null,null,"2020-08-05",9795]
[null,null,null,null,null,"2020-08-06",2674]
[null,null,null,null,null,"2020-08-07",4867]
[null,null,null,null,null,"2020-08-08",9630]
[null,null,null,null,null,"2020-08-09",7008]
[null,null,null,null,null,"2020-08-10",4047]
[null,null,null,null,null,"2020-08-11",8780]
[null,null,null,null,null,"2020-08-12",4150]
[null,null,null,null,null,"2020-08-13",1173]
[null,null,null,null,null,"2020-08-14",1542]
[null,null,null,null,null,"2020-08-15",4943]
[null,null,null,null,null,"2020-08-16",3906]
[null,null,null,null,null,"2020-08-17",1096]
[null,null,null,null,null,"2020-08-18",2938]
[null,null,null,null,null,"2020-08-19",3449]
[null,null,null,null,null,"2020-08-20",3960]
[null,null,null,null,null,"2020-08-21",9310]
[null,null,null,null,null,"2020-08-22",6420]
[null,null,null,null,null,"2020-08-23",5273]
[null,null,null,null,null,"2020-08-24",9330]
[null,null,null,null,null,"2020-08-25",1755]
[null,null,null,null,null,"2020-08-26",4421]
[null,null,null,null,null,"2020-08-27",6243]
[null,null,null,null,null,"2020-08-28",2192]
[null,null,null,null,null,"2020-08-29",1610]
[null,null,null,null,null,"2020-08-30",2570]
[null,null,null,null,null,"2020-08-31",8847]
[null,null,null,null,null,"2020-09-01",2602]
[null,null,null,null,null,"2020-09-02",9273]
[null,null,null,null,null,"2020-09-03",3379]
[null,null,null,null,null,"2020-09-04",9320]
[null,null,null,null,null,"2020-09-05",8029]
[null,null,null,null,null,"2020-09-06",2532]
[null,null,null,null,null,"2020-09-07",3004]
[null,null,null,null,null,{"$f":"F1358+1","v":"2020-09-08"},2026]
[null,null,null,null,null,"2020-09-09",8095]
[null,null,null,null,null,"2020-09-10",7685]
[null,null,null,null,null,"2020-09-11",8443]
[null,null,null,null,null,"2020-09-12",8662]
[null,null,null,null,null,"2020-09-13",1714]
[null,null,null,null,null,"2020-09-14",8818]
[null,null,null,null,null,"2020-09-15",9447]
[null,null,null,null,null,"2020-09-16",6782]
[null,null,null,null,null,"2020-09-17",7367]
[null,null,null,null,null,"2020-09-18",4118]
[null,null,null,null,null,"2020-09-19",3124]
[null,null,null,null,null,"2020-09-20",2903]
[null,null,null,null,null,"2020-09-21",4994]
[null,null,null,null,null,"2020-09-22",1052]
[null,null,null,null,null,"2020-09-23",3968]
[null,null,null,null,null,"2020-09-24",4508]
[null,null,null,null,null,"2020-09-25",6150]
[null,null,null,null,null,"2020-09-26",8416]
[null,null,null,null,null,"2020-09-27",6988]
[null,null,null,null,null,"2020-09-28",6117]
[null,null,null,null,null,"2020-09-29",8491]
[null,null,null,null,null,"2020-09-30",8917]
[null,null,null,null,null,"2020-10-01",9828]
[null,null,null,null,null,"2020-10-02",2712]
[null,null,null,null,null,"2020-10-03",9544]
[null,null,null,null,null,"2020-10-04",9390]
[null,null,null,null,null,"2020-10-05",5069]
[null,null,null,null,null,"2020-10-06",9867]
[null,null,null,null,null,"2020-10-07",3819]
[null,null,null,null,null,"2020-10-08",9795]
[null,null,null,null,null,"2020-10-09",3388]
[null,null,null,null,null,"2020-10-10",8322]
[null,null,null,null,null,"2020-10-11",9437]
[null,null,null,null,null,"2020-10-12",3141]
[null,null,null,null,null,"2020-10-13",8058]
[null,null,null,null,null,"2020-10-14",2455]
[null,null,null,null,null,"2020-10-15",5959]
[null,null,null,null,null,"2020-10-16",8479]
[null,null,null,null,null,"2020-10-17",5002]
[null,null,null,null,null,"2020-10-18",3354]
[null,null,null,null,null,"2020-10-19",4388]
[null,null,null,null,null,"2020-10-20",6385]
[null,null,null,null,null,"2020-10-21",6985]
[null,null,null,null,null,"2020-10-22",4933]
[null,null,null,null,null,"2020-10-23",9978]
[null,null,null,null,null,"2020-10-24",4511]
[null,null,null,null,null,"2020-10-25",2913]
[null,null,null,null,null,"2020-10-26",3790]
[null,null,null,null,null,"2020-10-27",3288]
[null,null,null,null,null,"2020-10-28",1895]
[null,null,null,null,null,"2020-10-29",5956]
[null,null,null,null,null,"2020-10-30",3167]
[null,null,null,null,null,"2020-10-31",8323]
[null,null,null,null,null,"2020-11-01",6364]
[null,null,null,null,null,"2020-11-02",6509]
[null,null,null,null,null,"2020-11-03",5135]
[null,null,null,null,null,"2020-11-04",1843]
[null,null,null,null,null,"2020-11-05",9883]
[null,null,null,null,null,"2020-11-06",2198]
[null,null,null,null,null,"2020-11-07",1972]
[null,null,null,null,null,"2020-11-08",5837]
[null,null,null,null,null,"2020-11-09",8475]
[null,null,null,null,null,"2020-11-10",9496]
[null,null,null,null,null,{"$f":"F1422+1","v":"2020-11-11"},7979]
[null,null,null,null,null,"2020-11-12",8380]
[null,null,null,null,null,"2020-11-13",9966]
[null,null,null,null,null,"2020-11-14",4719]
[null,null,null,null,null,"2020-11-15",6525]
[null,null,null,null,null,"2020-11-16",9891]
[null,null,null,null,null,"2020-11-17",2523]
[null,null,null,null,null,"2020-11-18",7573]
[null,null,null,null,null,"2020-11-19",7451]
[null,null,null,null,null,"2020-11-20",8532]
[null,null,null,null,null,"2020-11-21",3742]
[null,null,null,null,null,"2020-11-22",4592]
[null,null,null,null,null,"2020-11-23",3173]
[null,null,null,null,null,"2020-11-24",3935]
[null,null,null,null,null,"2020-11-25",3102]
[null,null,null,null,null,"2020-11-26",6786]
[null,null,null,null,null,"2020-11-27",1368]
[null,null,null,null,null,"2020-11-28",4904]
[null,null,null,null,null,"2020-11-29",8748]
[null,null,null,null,null,"2020-11-30",1274]
[null,null,null,null,null,"2020-12-01",8169]
[null,null,null,null,null,"2020-12-02",9185]
[null,null,null,null,null,"2020-12-03",8658]
[null,null,null,null,null,"2020-12-04",9859]
[null,null,null,null,null,"2020-12-05",1855]
[null,null,null,null,null,"2020-12-06",6942]
[null,null,null,null,null,"2020-12-07",2837]
[null,null,null,null,null,"2020-12-08",9734]
[null,null,null,null,null,"2020-12-09",2358]
[null,null,null,null,null,"2020-12-10",3653]
[null,null,null,null,null,"2020-12-11",8240]
[null,null,null,null,null,"2020-12-12",5261]
[null,null,null,null,null,"2020-12-13",4923]
[null,null,null,null,null,"2020-12-14",7385]
[null,null,null,null,null,"2020-12-15",3104]
[null,null,null,null,null,"2020-12-16",4344]
[null,null,null,null,null,"2020-12-17",9582]
[null,null,null,null,null,"2020-12-18",2865]
[null,null,null,null,null,"2020-12-19",7833]
[null,null,null,null,null,"2020-12-20",9762]
[null,null,null,null,null,"2020-12-21",8746]
[null,null,null,null,null,"2020-12-22",6101]
[null,null,null,null,null,"2020-12-23",4795]
[null,null,null,null,null,"2020-12-24",5275]
[null,null,null,null,null,"2020-12-25",5100]
[null,null,null,null,null,"2020-12-26",7026]
[null,null,null,null,null,"2020-12-27",2527]
[null,null,null,null,null,"2020-12-28",8589]
[null,null,null,null,null,"2020-12-29",6704]
[null,null,null,null,null,"2020-12-30",5126]
[null,null,null,null,null,"2020-12-31",9402]

{"sheet":"Error Checks","index":5,"n_rows":17,"n_cols":9,"rows_kept":17,"cut":false,"hidden":false,"merged":[[0,8,0,9],[2,0,2,4]]}
[{"$f":"IF(ISERROR(RIGHT(CELL(\"filename\",A1),LEN(CELL(\"filename\",A1))-FIND(\"]\",CELL(\"filename\",A1)))),\n\"\",\nRIGHT(CELL(\"filename\",A1),LEN(CELL(\"filename\",A1))-FIND(\"]\",CELL(\"filename\",A1))))","v":"Error Checks"}]
[{"$f":"Model_Name","v":"SP Final Friday Monthly Reporting Starter File.xlsm"}]
["Navigator"]
[null,"Error Checks:",null,null,null,{"$f":"Overall_Error_Check","v":0}]
[]
[null,{"$f":"MAX($B$5:$B5)+1","v":1},"Error Checks"]
[]
[null,null,"Summary of Errors"]
[]
[null,null,null,"Assumptions"]
[]
[null,null,null,null,"Example"]
[]
[]
[]
[]
[null,null,null,null,{"$f":"C8","v":"Summary of Errors"},null,null,null,{"$f":"MIN(1,SUM(I11:I15))","v":0}]