{"text_format":"1","workbook":"xlsx","n_sheets":9,"sheets":["Cover","Navigator","Style Guide","Model Parameters","Simulation>>","Normal Distributions","Simulation Example","Lookups","Error Checks"],"not_rendered":{"charts":2,"images":1,"macros":1,"external_links":0,"defined_names":49,"comments":0,"pivot_tables":0},"unopened":[],"bounds":{"document_bytes":16777216,"sheet_cells":100000,"rows_first":2000,"rows_last":500,"rows_between":2000,"halvings":0,"cell_chars":16384,"cell_head_chars":4096},"cells_cut":0,"cells_raw":0,"read":"whole","date_system":"1900"}

{"sheet":"Cover","index":0,"n_rows":23,"n_cols":7,"rows_kept":23,"cut":false,"hidden":false,"merged":[[17,2,17,9],[18,2,18,9],[21,6,21,8],[22,6,22,8]]}
[]
[]
["Navigator"]
[]
[null,null,{"$f":"Client_Name","v":"SumProduct Pty Limited"}]
[null,null,{"$f":"Model_Name","v":"Agile Excel vLB1.02_for blog.xlsm"}]
[]
[]
[]
[]
[]
[]
[]
[null,null,"Primary Developer:  Liam Bastick"]
[null,null,"Revisions: Hanh Tran"]
[]
[null,null,"General Cover Notes:"]
[null,null,"Example to develop a dashboard."]
[]
[]
[]
[null,null,"Any queries, please e-mail:",null,null,null,"liam.bastick@sumproduct.com"]
[null,null,"Website:",null,null,null,"www.sumproduct.com"]

{"sheet":"Navigator","index":1,"n_rows":16,"n_cols":7,"rows_kept":16,"cut":false,"hidden":false,"merged":[]}
["Navigator"]
[{"$f":"Model_Name","v":"Agile Excel vLB1.02_for blog.xlsm"}]
["Navigator"]
[null,null,null,null,"Error Checks:",null,{"$f":"Overall_Error_Check","v":0}]
[]
[]
[null,1,"Table of Contents"]
[]
[null,null,null,null,null,"Cover"]
[null,null,null,null,null,"Style Guide"]
[null,null,null,null,null,"Model Parameters"]
[null,null,null,null,null,"Simulation>>"]
[null,null,null,null,null,"Normal Distributions"]
[null,null,null,null,null,"Simulation Example"]
[null,null,null,null,null,"Lookups"]
[null,null,null,null,null,"Error Checks"]

{"sheet":"Style Guide","index":2,"n_rows":74,"n_cols":11,"rows_kept":74,"cut":false,"hidden":false,"merged":[[16,2,16,6],[2,0,2,4],[7,2,7,6],[8,2,8,6],[9,2,9,6],[10,2,10,6],[11,2,11,6],[12,2,12,6],[13,2,13,6],[14,2,14,6],[15,2,15,6],[34,2,34,6],[17,2,17,6],[18,2,18,6],[19,2,19,6],[24,2,24,6],[25,2,25,6],[26,2,26,6],[27,2,27,6],[28,2,28,6],[29,2,29,6],[30,2,30,6],[31,2,31,6],[46,2,46,6],[35,2,35,6],[36,2,36,6],[37,2,37,6],[38,2,38,6],[39,2,39,6],[40,2,40,6],[41,2,41,6],[42,2,42,6],[43,2,43,6],[44,2,44,6],[45,2,45,6],[61,2,61,6],[47,2,47,6],[48,2,48,6],[49,2,49,6],[50,2,50,6],[51,2,51,6],[52,2,52,6],[53,2,53,6],[54,2,54,6],[57,2,57,6],[59,2,59,6],[60,2,60,6],[73,2,73,6],[62,2,62,6],[63,2,63,6],[64,2,64,6],[65,2,65,6],[66,2,66,6],[67,2,67,6],[68,2,68,6],[69,2,69,6],[70,2,70,6],[71,2,71,6],[72,2,72,6],[80,2,80,6],[74,2,74,6],[75,2,75,6],[76,2,76,6],[77,2,77,6],[78,2,78,6],[79,2,79,6]]}
[{"$f":"IF(ISERROR(RIGHT(CELL(\"filename\",A1),LEN(CELL(\"filename\",A1))-FIND(\"]\",CELL(\"filename\",A1)))),\n\"\",\nRIGHT(CELL(\"filename\",A1),LEN(CELL(\"filename\",A1))-FIND(\"]\",CELL(\"filename\",A1))))","v":"Style Guide"}]
[{"$f":"Model_Name","v":"Agile Excel vLB1.02_for blog.xlsm"}]
["Navigator"]
[null,null,null,null,"Error Checks:",null,null,null,{"$f":"Overall_Error_Check","v":0}]
[]
[null,{"$f":"MAX($B$5:$B5)+1","v":1},"Formatting of Headers / Dividers"]
[]
[null,null,"Description",null,null,null,null,null,"Display",null,"Style Name"]
[]
[null,null,"Sheet Title",null,null,null,null,null,{"$f":"C10","v":"Sheet Title"},null,"Sheet Title"]
[null,null,"Model Name",null,null,null,null,null,{"$f":"C11","v":"Model Name"},null,"Model Name"]
[]
[null,null,"Header 1",null,null,null,null,null,{"$f":"C13","v":"Header 1"},null,"Header 1"]
[null,null,"Header 2",null,null,null,null,null,{"$f":"C14","v":"Header 2"},null,"Header 2"]
[null,null,"Header 3",null,null,null,null,null,{"$f":"C15","v":"Header 3"},null,"Header 3"]
[null,null,"Header 4",null,null,null,null,null,{"$f":"C16","v":"Header 4"},null,"Header 4"]
[]
[null,null,"Notes",null,null,null,null,null,{"$f":"C18","v":"Notes"},null,"Notes"]
[]
[null,null,"Table Heading",null,null,null,null,null,{"$f":"C20","v":"Table Heading"},null,"Table Heading"]
[]
[]
[null,{"$f":"MAX($B$5:$B22)+1","v":2},"Individual Cell Styles"]
[]
[null,null,"Description",null,null,null,null,null,"Display",null,"Style Name"]
[]
[null,null,"Assumption",null,null,null,null,null,"Assumption",null,{"$f":"C27","v":"Assumption"}]
[]
[null,null,"Constraint",null,null,null,null,null,{"$f":"C29","v":"Constraint"},null,{"$f":"C29","v":"Constraint"}]
[]
[null,null,"Empty",null,null,null,null,null,null,null,{"$f":"C31","v":"Empty"}]
[]
[null,null,"Error Check",null,null,null,null,null,0,null,{"$f":"C33","v":"Error Check"}]
[]
[null,null,"Hyperlink",null,null,null,null,null,"Hyperlink",null,{"$f":"C35","v":"Hyperlink"}]
[]
[null,null,"Internal Reference",null,null,null,null,null,{"$f":"'Error Checks'!E12","v":"Example"},null,{"$f":"C37","v":"Internal Reference"}]
[]
[null,null,"Line Calculation",null,null,null,null,null,77,null,"Line Calc"]
[]
[null,null,"Line Total",null,null,null,null,null,{"$f":"I39","v":77},null,{"$f":"C41","v":"Line Total"}]
[]
[null,null,"Parameter",null,null,null,null,null,365,null,{"$f":"C43","v":"Parameter"}]
[]
[null,null,"Range Name Description",null,null,null,null,null,"Not_Named",null,{"$f":"C45","v":"Range Name Description"}]
[]
[null,null,"Row Reference",null,null,null,null,null,{"$f":"ROW(C47)","v":47},null,"Row Ref"]
[]
[null,null,"Row Summary",null,null,null,null,null,{"$f":"I41","v":77},null,{"$f":"C49","v":"Row Summary"}]
[]
[null,null,"Units",null,null,null,null,null,"A$",null,{"$f":"C51","v":"Units"}]
[]
[null,null,"WIP",null,null,null,null,null,null,null,{"$f":"C53","v":"WIP"}]
[]
[]
[null,{"$f":"MAX($B$5:$B55)+1","v":3},"Numerical Styles"]
[]
[null,null,"Description",null,null,null,null,null,"Display",null,"Style Name"]
[]
[null,null,"Comma",null,null,null,null,null,123456.789,null,{"$f":"C60","v":"Comma"}]
[]
[null,null,"Comma [0]",null,null,null,null,null,-123456.789,null,"Comma [0]"]
[]
[null,null,"Currency",null,null,null,null,null,123456.789,null,"Currency"]
[]
[null,null,"Currency [0]",null,null,null,null,null,123456.789,null,"Currency [0]"]
[]
[null,null,"Date",null,null,null,null,null,{"$f":"TODAY()","v":"2020-12-16"},null,{"$f":"C68","v":"Date"}]
[]
[null,null,"Date Heading",null,null,null,null,null,{"$f":"TODAY()","v":"2020-12-16"},null,{"$f":"C70","v":"Date Heading"}]
[]
[null,null,"Numbers 0",null,null,null,null,null,-123456.789,null,{"$f":"C72","v":"Numbers 0"}]
[]
[null,null,"Percent",null,null,null,null,null,0.5,null,{"$f":"C74","v":"Percent"}]

{"sheet":"Model Parameters","index":3,"n_rows":31,"n_cols":9,"rows_kept":31,"cut":false,"hidden":false,"merged":[[0,9,0,10],[2,0,2,4],[10,6,10,13],[11,6,11,13]]}
[{"$f":"IF(ISERROR(RIGHT(CELL(\"filename\",A1),LEN(CELL(\"filename\",A1))-FIND(\"]\",CELL(\"filename\",A1)))),\n\"\",\nRIGHT(CELL(\"filename\",A1),LEN(CELL(\"filename\",A1))-FIND(\"]\",CELL(\"filename\",A1))))","v":"Model Parameters"}]
[{"$f":"Model_Name","v":"Agile Excel vLB1.02_for blog.xlsm"}]
["Navigator"]
[null,null,null,null,"Error Checks:",null,null,null,{"$f":"Overall_Error_Check","v":0}]
[]
[null,{"$f":"MAX($B$5:$B5)+1","v":1},"General"]
[]
[null,null,"Key Inputs"]
[]
[null,null,null,null,"General"]
[null,null,null,null,"Model Name",null,{"$f":"IF(ISERROR(OR(FIND(\"[\",CELL(\"filename\",A1)),FIND(\"]\",CELL(\"filename\",A1)))),\"\",MID(CELL(\"filename\",A1),FIND(\"[\",CELL(\"filename\",A1))+1,FIND(\"]\",CELL(\"filename\",A1))-FIND(\"[\",CELL(\"filename\",A1))-1))","v":"Agile Excel vLB1.02_for blog.xlsm"}]
[null,null,null,null,"Client Name",null,"SumProduct Pty Limited"]
[]
[]
[null,{"$f":"MAX($B$5:$B14)+1","v":2},"General Range Names"]
[]
[null,null,"Technical Assumptions"]
[]
[null,null,null,null,"Days in Year",null,365]
[null,null,null,null,"Months in Month",null,1]
[null,null,null,null,"Months in Quarter",null,3]
[null,null,null,null,"Months in Half Yr",null,6]
[null,null,null,null,"Months in Year",null,12]
[null,null,null,null,"Quarters in Year",null,4]
[]
[null,null,null,null,"Rounding Accuracy",null,5]
[]
[null,null,null,null,"Very Large Number",null,9.9999999999999997E+98]
[null,null,null,null,"Very Small Number",null,1E-8]
[]
[null,null,null,null,"Thousand",null,1000]

{"sheet":"Simulation>>","index":4,"n_rows":3,"n_cols":1,"rows_kept":3,"cut":false,"hidden":false,"merged":[]}
[]
[]
["Navigator"]

{"sheet":"Normal Distributions","index":5,"n_rows":81,"n_cols":14,"rows_kept":81,"cut":false,"hidden":false,"merged":[[2,0,2,4]]}
[{"$f":"IF(ISERROR(RIGHT(CELL(\"filename\",A1),LEN(CELL(\"filename\",A1))-FIND(\"]\",CELL(\"filename\",A1)))),\n\"\",\nRIGHT(CELL(\"filename\",A1),LEN(CELL(\"filename\",A1))-FIND(\"]\",CELL(\"filename\",A1))))","v":"Normal Distributions"}]
["SP-Simulation-Examples_Rebuild_vHT1.00.xlsm"]
["Navigator"]
[null,null,null,null,"Error Checks:",null,null,null,0]
[]
[null,{"$f":"MAX($B$5:$B5)+1","v":1},{"$f":"A1","v":"Normal Distributions"}]
[]
[null,null,"Normal Distribution Examples"]
[]
[null,null,null,"Assumptions"]
[]
[null,null,null,null,null,null,"Mean",null,null,0]
[null,null,null,null,null,null,"Standard Deviation",null,null,1]
[]
[]
[null,null,null,"Calculations"]
[]
[null,null,null,null,null,null,"Value","Cum Probability",null,"Incorrect Probability","Correct Probability",null,"Value","NORMINV"]
[null,null,null,null,null,null,{"$f":"-3*J13","v":-3},{"$f":"_xlfn.NORM.DIST($G19,Mean,Standard_Deviation,TRUE)","v":1.3498980316300933E-3},null,{"$f":"_xlfn.NORM.DIST($G19,Mean,Standard_Deviation,FALSE)","v":4.4318484119380075E-3},null,null,{"$f":"H19","v":1.3498980316300933E-3},{"$f":"_xlfn.NORM.INV($M19,Mean,Standard_Deviation)","v":-3}]
[null,null,null,null,null,null,{"$f":"ROUND(G19+(0.1*$J$13),1)","v":-2.9},1.8658133003840378E-3,null,5.9525324197758538E-3,{"$f":"H20-H19","v":5.1591526875394448E-4},null,{"$f":"H20","v":1.8658133003840378E-3},-2.9]
[null,null,null,null,null,null,{"$f":"ROUND(G20+(0.1*$J$13),1)","v":-2.8},2.5551303304279312E-3,null,7.9154515829799686E-3,{"$f":"H21-H20","v":6.8931703004389343E-4},null,2.5551303304279312E-3,-2.7999999999999994]
[null,null,null,null,null,null,-2.7,3.4669738030406643E-3,null,1.0420934814422592E-2,9.1184347261273309E-4,null,3.4669738030406643E-3,-2.6999999999999997]
[null,null,null,null,null,null,-2.6,4.6611880237187476E-3,null,1.3582969233685613E-2,1.1942142206780833E-3,null,4.6611880237187476E-3,-2.6000000000000005]
[null,null,null,null,null,null,-2.5,6.2096653257761331E-3,null,1.752830049356854E-2,1.5484773020573855E-3,null,6.2096653257761331E-3,-2.5000000000000004]
[null,null,null,null,null,null,-2.4,8.1975359245961311E-3,null,2.2394530294842899E-2,1.987870598819998E-3,null,8.1975359245961311E-3,-2.4]
[null,null,null,null,null,null,-2.2999999999999998,1.0724110021675811E-2,null,2.8327037741601186E-2,2.5265740970796795E-3,null,1.0724110021675811E-2,-2.2999999999999994]
[null,null,null,null,null,null,-2.2000000000000002,1.3903447513498597E-2,null,3.5474592846231424E-2,3.1793374918227865E-3,null,1.3903447513498597E-2,-2.2000000000000002]
[null,null,null,null,null,null,-2.1,1.7864420562816546E-2,null,4.3983595980427191E-2,3.9609730493179486E-3,null,1.7864420562816546E-2,-2.1000000000000005]
[null,null,null,null,null,null,-2,2.2750131948179191E-2,null,5.3990966513188063E-2,4.8857113853626455E-3,null,2.2750131948179191E-2,-2.0000000000000004]
[null,null,null,null,null,null,-1.9,2.87165598160018E-2,null,6.5615814774676595E-2,5.9664278678226088E-3,null,2.87165598160018E-2,-1.9]
[null,null,null,null,null,null,-1.8,3.5930319112925789E-2,null,7.8950158300894149E-2,7.213759296923989E-3,null,3.5930319112925789E-2,-1.7999999999999998]
[null,null,null,null,null,null,-1.7,4.4565462758543041E-2,null,9.4049077376886947E-2,8.635143645617252E-3,null,4.4565462758543041E-2,-1.6999999999999997]
[null,null,null,null,null,null,-1.6,5.4799291699557967E-2,null,0.11092083467945554,1.0233828941014926E-2,null,5.4799291699557967E-2,-1.6]
[null,null,null,null,null,null,-1.5,6.6807201268858057E-2,null,0.12951759566589174,1.200790956930009E-2,null,6.6807201268858057E-2,-1.4999999999999998]
[null,null,null,null,null,null,-1.4,8.0756659233771053E-2,null,0.14972746563574488,1.3949457964912995E-2,null,8.0756659233771053E-2,-1.400000000000001]
[null,null,null,null,null,null,-1.3,9.6800484585610316E-2,null,0.17136859204780736,1.6043825351839264E-2,null,9.6800484585610316E-2,-1.3000000000000007]
[null,null,null,null,null,null,-1.2,0.11506967022170828,null,0.19418605498321295,1.8269185636097959E-2,null,0.11506967022170828,-1.2000000000000002]
[null,null,null,null,null,null,-1.1000000000000001,0.13566606094638264,null,0.21785217703255053,2.0596390724674368E-2,null,0.13566606094638264,-1.1000000000000003]
[null,null,null,null,null,null,-1,0.15865525393145699,null,0.24197072451914337,2.2989192985074347E-2,null,0.15865525393145699,-0.99999999999999956]
[null,null,null,null,null,null,-0.9,0.1840601253467595,null,0.26608524989875482,2.540487141530251E-2,null,0.1840601253467595,-0.89999999999999958]
[null,null,null,null,null,null,-0.8,0.21185539858339661,null,0.28969155276148273,2.7795273236637108E-2,null,0.21185539858339661,-0.80000000000000016]
[null,null,null,null,null,null,-0.7,0.24196365222307298,null,0.31225393336676127,3.0108253639676369E-2,null,0.24196365222307298,-0.70000000000000029]
[null,null,null,null,null,null,-0.6,0.27425311775007355,null,0.33322460289179967,3.2289465527000571E-2,null,0.27425311775007355,-0.6000000000000002]
[null,null,null,null,null,null,-0.5,0.30853753872598688,null,0.35206532676429952,3.4284420975913332E-2,null,0.30853753872598688,-0.50000000000000011]
[null,null,null,null,null,null,-0.4,0.34457825838967576,null,0.36827014030332333,3.604071966368888E-2,null,0.34457825838967576,-0.40000000000000024]
[null,null,null,null,null,null,-0.3,0.38208857781104733,null,0.38138781546052414,3.7510319421371563E-2,null,0.38208857781104733,-0.3000000000000001]
[null,null,null,null,null,null,-0.2,0.42074029056089696,null,0.39104269397545588,3.8651712749849632E-2,null,0.42074029056089696,-0.20000000000000009]
[null,null,null,null,null,null,-0.1,0.46017216272297101,null,0.39695254747701181,3.9431872162074055E-2,null,0.46017216272297101,-0.1]
[null,null,null,null,null,null,0,0.5,null,0.3989422804014327,3.9827837277028988E-2,null,0.5,0]
[null,null,null,null,null,null,0.1,0.53982783727702899,null,0.39695254747701181,3.9827837277028988E-2,null,0.53982783727702899,0.1]
[null,null,null,null,null,null,0.2,{"$f":"_xlfn.NORM.DIST($G51,Mean,Standard_Deviation,TRUE)","v":0.57925970943910299},null,{"$f":"_xlfn.NORM.DIST($G51,Mean,Standard_Deviation,FALSE)","v":0.39104269397545588},3.9431872162074E-2,null,0.57925970943910299,{"$f":"_xlfn.NORM.INV($M51,Mean,Standard_Deviation)","v":0.19999999999999993}]
[null,null,null,null,null,null,0.3,0.61791142218895267,null,0.38138781546052414,3.8651712749849687E-2,null,0.61791142218895267,0.3000000000000001]
[null,null,null,null,null,null,0.4,0.65542174161032429,null,0.36827014030332333,3.7510319421371618E-2,null,0.65542174161032429,0.40000000000000036]
[null,null,null,null,null,null,0.5,0.69146246127401312,null,0.35206532676429952,3.6040719663688825E-2,null,0.69146246127401312,0.50000000000000011]
[null,null,null,null,null,null,0.6,0.72574688224992645,null,0.33322460289179967,3.4284420975913332E-2,null,0.72574688224992645,0.6000000000000002]
[null,null,null,null,null,null,0.7,0.75803634777692697,null,0.31225393336676127,3.2289465527000516E-2,null,0.75803634777692697,0.69999999999999973]
[null,null,null,null,null,null,0.8,0.78814460141660336,null,0.28969155276148273,3.0108253639676397E-2,null,0.78814460141660336,0.80000000000000016]
[null,null,null,null,null,null,0.9,0.81593987465324047,null,0.26608524989875482,2.7795273236637108E-2,null,0.81593987465324047,0.89999999999999958]
[null,null,null,null,null,null,1,0.84134474606854304,null,0.24197072451914337,2.5404871415302566E-2,null,0.84134474606854304,0.99999999999999956]
[null,null,null,null,null,null,1.1000000000000001,0.86433393905361733,null,0.21785217703255053,2.2989192985074292E-2,null,0.86433393905361733,1.1000000000000003]
[null,null,null,null,null,null,1.2,0.88493032977829178,null,0.19418605498321295,2.0596390724674452E-2,null,0.88493032977829178,1.2000000000000006]
[null,null,null,null,null,null,1.3,0.9031995154143897,null,0.17136859204780736,1.8269185636097918E-2,null,0.9031995154143897,1.3000000000000007]
[null,null,null,null,null,null,1.4,0.91924334076622893,null,0.14972746563574488,1.6043825351839236E-2,null,0.91924334076622893,1.400000000000001]
[null,null,null,null,null,null,1.5,0.93319279873114191,null,0.12951759566589174,1.3949457964912981E-2,null,0.93319279873114191,1.5]
[null,null,null,null,null,null,1.6,0.94520070830044201,null,0.11092083467945554,1.200790956930009E-2,null,0.94520070830044201,1.5999999999999999]
[null,null,null,null,null,null,1.7,0.95543453724145699,null,9.4049077376886947E-2,1.0233828941014989E-2,null,0.95543453724145699,1.7]
[null,null,null,null,null,null,1.8,0.96406968088707423,null,7.8950158300894149E-2,8.6351436456172381E-3,null,0.96406968088707423,1.7999999999999998]
[null,null,null,null,null,null,1.9,0.97128344018399815,null,6.5615814774676595E-2,7.2137592969239162E-3,null,0.97128344018399815,1.899999999999999]
[null,null,null,null,null,null,2,0.97724986805182079,null,5.3990966513188063E-2,5.9664278678226434E-3,null,0.97724986805182079,2]
[null,null,null,null,null,null,2.1,0.98213557943718344,null,4.3983595980427191E-2,4.8857113853626455E-3,null,0.98213557943718344,2.0999999999999996]
[null,null,null,null,null,null,2.2000000000000002,0.98609655248650141,null,3.5474592846231424E-2,3.9609730493179729E-3,null,0.98609655248650141,2.2000000000000006]
[null,null,null,null,null,null,2.2999999999999998,0.98927588997832416,null,2.8327037741601186E-2,3.1793374918227535E-3,null,0.98927588997832416,2.2999999999999989]
[null,null,null,null,null,null,2.4,0.99180246407540384,null,2.2394530294842899E-2,2.5265740970796813E-3,null,0.99180246407540384,2.399999999999999]
[null,null,null,null,null,null,2.5,0.99379033467422384,null,1.752830049356854E-2,1.9878705988199963E-3,null,0.99379033467422384,2.4999999999999982]
[null,null,null,null,null,null,2.6,0.99533881197628127,null,1.3582969233685613E-2,1.5484773020574272E-3,null,0.99533881197628127,2.600000000000001]
[null,null,null,null,null,null,2.7,0.99653302619695938,null,1.0420934814422592E-2,1.1942142206781137E-3,null,0.99653302619695938,2.7000000000000042]
[null,null,null,null,null,null,2.8,0.99744486966957202,null,7.9154515829799686E-3,9.1184347261263898E-4,null,0.99744486966957202,2.7999999999999927]
[null,null,null,null,null,null,2.9,0.99813418669961596,null,5.9525324197758538E-3,6.8931703004393441E-4,null,0.99813418669961596,2.8999999999999986]
[null,null,null,null,null,null,3,0.9986501019683699,null,4.4318484119380075E-3,5.1591526875394145E-4,null,0.9986501019683699,2.9999999999999969]
[]
[null,null,null,null,null,null,"ANALYSIS",{"$f":"H79-H19","v":0.99730020393673979},null,{"$f":"SUM(J19:J79)","v":9.9772125168981134},{"$f":"SUM(K19:K79)","v":0.99730020393673979}]

{"sheet":"Simulation Example","index":6,"n_rows":1147,"n_cols":17,"rows_kept":1147,"cut":false,"hidden":false,"merged":[[2,0,2,4],[1045,6,1045,7],[1045,8,1045,9],[1045,10,1045,11],[1045,12,1045,13]]}
[{"$f":"IF(ISERROR(RIGHT(CELL(\"filename\",A1),LEN(CELL(\"filename\",A1))-FIND(\"]\",CELL(\"filename\",A1)))),\n\"\",\nRIGHT(CELL(\"filename\",A1),LEN(CELL(\"filename\",A1))-FIND(\"]\",CELL(\"filename\",A1))))","v":"Simulation Example"}]
["Simulation Example.xlsm"]
["Navigator"]
[null,null,null,null,"Error Checks:",null,null,null,0]
[]
[null,{"$f":"MAX($B$5:$B5)+1","v":1},{"$f":"A1","v":"Simulation Example"}]
[]
[null,null,"Simulation Example"]
[]
[null,null,null,"Assumptions"]
[null,null,null,null,null,null,null,null,"Mean","Standard Deviation",null,"Value Used"]
[null,null,null,null,null,null,"Sales (US$)",null,1000,175,null,{"$f":"_xlfn.NORM.INV(RAND(),Mean_Sales,SD_Sales)","v":1030.7159789326049}]
[null,null,null,null,null,null,"Foreign Exchange (US$:A$)",null,0.92,0.05,null,{"$f":"_xlfn.NORM.INV(RAND(),Mean_FX,SD_FX)","v":0.91735289925008412}]
[null,null,null,null,null,null,"Gross Margin (%)",null,0.4,0.02,null,{"$f":"_xlfn.NORM.INV(RAND(),Mean_GM,SD_GM)","v":0.41579367461890171}]
[]
[]
[null,null,null,"Calculations"]
[]
[null,null,null,null,null,null,{"$f":"G12","v":"Sales (US$)"},null,{"$f":"L12","v":1030.7159789326049}]
[null,null,null,null,null,null,{"$f":"G13","v":"Foreign Exchange (US$:A$)"},null,{"$f":"L13","v":0.91735289925008412}]
[null,null,null,null,null,null,"Sales (A$)",null,{"$f":"I19/I20","v":1123.5763028330675}]
[null,null,null,null,null,null,{"$f":"G14","v":"Gross Margin (%)"},null,{"$f":"L14","v":0.41579367461890171}]
[]
[null,null,null,null,null,null,"Gross Profit (A$)",null,{"$f":"I21*I22","v":467.17591966968104}]
[]
[]
[null,null,null,"Data Table"]
[]
[null,null,null,null,null,null,"Data Table Switch",true]
[]
[null,null,null,null,null,null,{"$f":"IF(Data_Switch,I19,)","v":1030.7159789326049},{"$f":"IF(Data_Switch,I20,)","v":0.91735289925008412},{"$f":"IF(Data_Switch,I22,)","v":0.41579367461890171},{"$f":"IF(Data_Switch,I24,)","v":467.17591966968104}]
[null,null,null,null,null,1,1085.2304304698619,1.0209957967069605,0.38209952294617311,406.13882163534407]
[null,null,null,null,null,2,818.390039054618,0.90055482547606402,0.42180440815970577,383.31983384215044]
[null,null,null,null,null,3,642.94110733062246,0.86081178812482506,0.3840506131962117,286.84775223311777]
[null,null,null,null,null,4,1247.0396115558178,0.91639254651318625,0.40284353916171911,548.19504207607872]
[null,null,null,null,null,5,1046.54400661663,0.83450183579893933,0.4332265739291411,543.30698268450146]
[null,null,null,null,null,6,1192.0803768209942,0.77287510267819548,0.40990493819421231,632.23621965579002]
[null,null,null,null,null,7,1257.6704071229947,0.94182364863417278,0.39698489896609013,530.11639729838055]
[null,null,null,null,null,8,1024.2971145723634,0.88915107888572797,0.39892293122226441,459.55700565508658]
[null,null,null,null,null,9,1219.6609168057594,1.0288318548772242,0.38654066967073014,458.23673258015066]
[null,null,null,null,null,10,946.91799316958338,0.87980180773267702,0.40612139382389451,437.10259724745168]
[null,null,null,null,null,11,1427.120915497047,0.86283234670734932,0.42071479748100904,695.86042901089377]
[null,null,null,null,null,12,1001.4043663549813,1.0017168418032703,0.38736903172252329,387.24819586673112]
[null,null,null,null,null,13,1174.7119570256286,0.90898356488129339,0.40442765245301554,522.65631353896413]
[null,null,null,null,null,14,924.42068150573448,0.993722689737916,0.39438824103351222,366.88368930189324]
[null,null,null,null,null,15,1016.8776810825145,0.99640830091164667,0.38084274742887758,388.66646284283695]
[null,null,null,null,null,16,879.2109331114624,0.97796919686240658,0.40479469581025884,363.91731290078752]
[null,null,null,null,null,17,1193.5750492530792,0.96644736194083658,0.39805313361496159,491.6007920035122]
[null,null,null,null,null,18,900.18272082914689,0.84021381916506077,0.38438709961030382,411.82210680928102]
[null,null,null,null,null,19,1140.4089309668047,0.93469480241457492,0.38183519526007181,465.87213891331857]
[null,null,null,null,null,20,981.59873723082649,0.95351957802705678,0.41773916970497693,430.04071539118809]
[null,null,null,null,null,21,1203.0861993015651,0.90036222956195822,0.38370278566933363,512.71311802687615]
[null,null,null,null,null,22,797.98370868713891,0.83971382832145813,0.38962770003725189,370.26490048933874]
[null,null,null,null,null,23,971.64177141626021,0.96109281017888248,0.385364386878295,389.59414901613508]
[null,null,null,null,null,24,932.12551618892996,0.85291857434914997,0.36011235333447017,393.55446502504446]
[null,null,null,null,null,25,896.93880175556887,0.84730836308489133,0.34900059232160169,369.44303482291804]
[null,null,null,null,null,26,1152.2070965874677,0.98353184159283413,0.41718618185455369,488.73341868889099]
[null,null,null,null,null,27,942.81526928710423,0.91838855622311977,0.39289693339318754,403.34695543525572]
[null,null,null,null,null,28,1113.2209187803428,0.93605828159756999,0.44922333133022729,534.24537710142113]
[null,null,null,null,null,29,1053.6883521264383,0.90618607704152787,0.38872590365825133,451.99983450612308]
[null,null,null,null,null,30,1070.1878016203154,0.93656280188899799,0.39710133274291359,453.75814782680658]
[null,null,null,null,null,31,1242.2414599015415,0.87436518619420078,0.40720704620305798,578.53341320605773]
[null,null,null,null,null,32,1001.8510898337234,0.90126352594438341,0.38674517865247904,429.90875317507772]
[null,null,null,null,null,33,911.37591628969028,0.96010596569144047,0.44977917251157279,426.95069099017871]
[null,null,null,null,null,34,1042.6313379721396,0.90506390233595135,0.40071744962293687,461.62549359311691]
[null,null,null,null,null,35,876.28247474175237,0.868117700796883,0.41439559033349527,418.29304146911647]
[null,null,null,null,null,36,1241.2743135682804,1.0124760843357439,0.42134015413934306,516.5541376231032]
[null,null,null,null,null,37,951.75213936846797,0.87685505427317945,0.43155010225334223,468.41120554953119]
[null,null,null,null,null,38,898.46862837162882,0.98953181141686541,0.39631271942193125,359.84143341021638]
[null,null,null,null,null,39,722.06089153507128,0.98929874703272536,0.37521705810259603,273.86021088710118]
[null,null,null,null,null,40,870.67132110545049,0.91974893323140994,0.42548898076335179,402.78497708660092]
[null,null,null,null,null,41,857.30394189252911,0.86143037439815306,0.39538508176942166,393.49110414552837]
[null,null,null,null,null,42,1125.5219630853433,0.87274319055770277,0.3930333094603477,506.87032200051516]
[null,null,null,null,null,43,1111.9989789435572,0.85876481057204623,0.42622486761896672,551.91085121073513]
[null,null,null,null,null,44,1160.131930572074,0.91479151420122273,0.41353734328990416,524.44504456676975]
[null,null,null,null,null,45,1109.8676146965511,0.92891410134598862,0.40429358304764801,483.05042845623149]
[null,null,null,null,null,46,1264.7486383907885,0.90755796544474543,0.35919858878322825,500.569598166498]
[null,null,null,null,null,47,1007.1396425369214,0.90483754697013152,0.40904679203401767,455.29414787162227]
[null,null,null,null,null,48,924.10533187302724,0.87564488885427616,0.38828638436067131,409.77515274586381]
[null,null,null,null,null,49,1197.8804462941448,0.94236664374544099,0.41451137719858516,526.90221667774722]
[null,null,null,null,null,50,899.56690324081637,0.8969093328617247,0.38648807317192524,387.63324940936803]
[null,null,null,null,null,51,1069.9139180750979,0.98263559618853114,0.36929632352607994,402.09745908564582]
[null,null,null,null,null,52,1234.7627491984701,0.88358974142898461,0.3818370329509202,533.59395480278829]
[null,null,null,null,null,53,983.77899829773742,0.83373068067450362,0.41387757005252074,488.3640133703214]
[null,null,null,null,null,54,1148.0646065117055,0.93027635591421687,0.35217989177223685,434.62920055780927]
[null,null,null,null,null,55,1239.6185347966259,0.92998883014358236,0.37659230909479202,501.97463806494261]
[null,null,null,null,null,56,1013.7055589613915,0.89256114346318005,0.39980032417199635,454.06391938059727]
[null,null,null,null,null,57,787.45929884121369,0.88704697739979543,0.42448392497294768,376.82763421210529]
[null,null,null,null,null,58,1013.2819552774303,0.93285658528888016,0.4358852669342288,473.46471314126535]
[null,null,null,null,null,59,944.69281027636464,0.82820641690781061,0.40895108666733387,466.46964264265097]
[null,null,null,null,null,60,1010.6668242696345,0.8843216308809938,0.39290803393457513,449.04376532221437]
[null,null,null,null,null,61,920.72864605561222,0.9470745252870898,0.39443804992066717,383.46550557484676]
[null,null,null,null,null,62,734.89160258500328,0.94595249230984257,0.42992378182648944,333.99920142330672]
[null,null,null,null,null,63,836.79188416837792,0.87004107490359273,0.36734318275295225,353.30492191568413]
[null,null,null,null,null,64,883.47679604458017,0.9977178731498102,0.39773050592892223,352.18941398528256]
[null,null,null,null,null,65,1339.752282452087,0.92302934909429746,0.40097286954299044,582.00133906760868]
[null,null,null,null,null,66,1113.731086460622,0.88902329724209694,0.37646181690002767,471.61556918438203]
[null,null,null,null,null,67,1122.8214759702926,0.94929801019516113,0.42060080563085356,497.48299511935119]
[null,null,null,null,null,68,1033.3129974034114,0.93084881786988738,0.41067296379864765,455.87822966396971]
[null,null,null,null,null,69,710.36851426152816,0.87938375670393931,0.40665167669366992,328.49429522962618]
[null,null,null,null,null,70,1378.1477120488071,0.88491567133112425,0.41028312528738392,638.96568760783668]
[null,null,null,null,null,71,1020.9400875999411,0.84322856913551159,0.38998078573938838,472.16974392038247]
[null,null,null,null,null,72,849.81080263404647,0.88727410288561592,0.46877474197640767,448.98170524525653]
[null,null,null,null,null,73,996.13010673344172,0.88540991140235681,0.39940365562195701,449.34894107327]
[null,null,null,null,null,74,1216.6530345481206,0.97016194885550378,0.4049176656698863,507.79594815131537]
[null,null,null,null,null,75,930.69968814670756,0.88552769520434549,0.42293219381228297,444.5065501847028]
[null,null,null,null,null,76,913.29661167467907,0.98591488369230162,0.43706328972376157,404.87107781271533]
[null,null,null,null,null,77,835.33868230583175,0.83602842987276227,0.40149173029252083,401.16048803541946]
[null,null,null,null,null,78,955.17179457458758,0.99229246642696256,0.39159176497534021,376.94270746502417]
[null,null,null,null,null,79,999.86382087775121,0.88059335042585785,0.39745523280507911,451.28788164043942]
[null,null,null,null,null,80,1266.8905730265524,0.91222190805672465,0.41246966204756197,572.83641391674428]
[null,null,null,null,null,81,1204.404020616465,0.97983355027050389,0.43003941515431393,528.60121037131273]
[null,null,null,null,null,82,809.95716379621354,1.030356187146821,0.40477635960185299,318.19240402945798]
[null,null,null,null,null,83,1045.2204248084543,0.98010873468851856,0.38296929736550139,408.41114614510309]
[null,null,null,null,null,84,1174.9725772606944,0.85173995115637835,0.40080561939873499,552.91008830351018]
[null,null,null,null,null,85,1021.1624040256444,0.91383058766616654,0.41791863300874965,467.00428036692887]
[null,null,null,null,null,86,1063.9684902698091,0.88385718259671475,0.41676906525938073,501.69774244795627]
[null,null,null,null,null,87,970.71128726270649,0.90959997333166942,0.40703353966305633,434.38001630344235]
[null,null,null,null,null,88,942.86176537384108,0.97973119024221433,0.39667776319462256,381.74991244053689]
[null,null,null,null,null,89,792.77360335778201,0.86582919949252735,0.41541480776545825,380.36358006108685]
[null,null,null,null,null,90,932.74041654406346,0.92504815430032639,0.42494062011967226,428.47422501665102]
[null,null,null,null,null,91,1046.4294080566701,0.89654630176646399,0.37329202827106245,435.69836315906514]
[null,null,null,null,null,92,892.23049185448792,0.89399627481772437,0.3779261820251697,377.17971849687689]
[null,null,null,null,null,93,880.51354766844759,0.98542506992475487,0.40061231979990536,357.96184378953967]
[null,null,null,null,null,94,787.12590261015123,0.86383755097399206,0.42901658115812008,390.91848148769981]
[null,null,null,null,null,95,741.32524058299646,0.93459350256845186,0.41712320309778494,330.86465724339575]
[null,null,null,null,null,96,953.85270758347474,0.94275852168215568,0.38932913490999388,393.9106790701934]
[null,null,null,null,null,97,901.11200699303186,0.8057381557739216,0.42719804382885335,477.76474764107803]
[null,null,null,null,null,98,1117.5512336071522,0.99925947745459553,0.39342983282114408,440.00382776164696]
[null,null,null,null,null,99,1161.0292715245994,0.96002788153844576,0.39285837964923026,475.11128281560673]
[null,null,null,null,null,100,943.88122128609484,0.85528342847725858,0.41326872345643006,456.07873884554334]
[null,null,null,null,null,101,1255.3762720458687,0.93870425677255354,0.37510173843729133,501.64236354520779]
[null,null,null,null,null,102,1255.8680734788718,0.95585425434553506,0.43162545031951477,567.09966011331539]
[null,null,null,null,null,103,856.1801650554662,0.93800132380474899,0.38921197173310595,355.26130053669226]
[null,null,null,null,null,104,1162.2277446946841,0.90923904665592015,0.39281260044791816,502.10965354527252]
[null,null,null,null,null,105,1063.2301335231712,0.9814651173949509,0.39696359506347151,430.0342912883479]
[null,null,null,null,null,106,1011.3216053295045,0.98527276091508176,0.41431931806521499,425.2731776280703]
[null,null,null,null,null,107,751.01852307770423,0.89055228464476299,0.40666023497923254,342.94378256562635]
[null,null,null,null,null,108,915.40503722071094,0.97925568287103637,0.39477812741314,369.03731348183595]
[null,null,null,null,null,109,1065.1334732917323,0.97898443518871725,0.40318319029693139,438.66265531691397]
[null,null,null,null,null,110,953.68249060387939,0.89293414112561598,0.38570513262455752,411.94553391854316]
[null,null,null,null,null,111,855.71493203961245,0.98674862589406942,0.37498150481679482,325.18644008211913]
[null,null,null,null,null,112,1126.689849637625,0.93745549865926292,0.39301839740173583,472.35291670557501]
[null,null,null,null,null,113,1085.6766684964643,0.86123593163464252,0.38770552772715972,488.74278259798871]
[null,null,null,null,null,114,1241.3303370370759,0.85283523736010869,0.41735732116751856,607.47760112896106]
[null,null,null,null,null,115,809.13974021482397,0.92176484334714959,0.36628076882519156,321.52704485528261]
[null,null,null,null,null,116,1241.711889293533,0.87116986858227075,0.36542279706767061,520.851154409473]
[null,null,null,null,null,117,954.21903949393129,0.91279787965521697,0.40076106077982243,418.94689175695385]
[null,null,null,null,null,118,953.65854111656279,0.88418598254810954,0.38116096940517202,411.10967736217515]
[null,null,null,null,null,119,1205.5300012377215,0.96126995484232103,0.39928964107988768,500.74969999889794]
[null,null,null,null,null,120,1247.4513650988481,0.89006680603128963,0.38671295239734677,541.98808123231765]
[null,null,null,null,null,121,917.87558053954922,0.92041783910963137,0.39503148456408205,393.94037992180699]
[null,null,null,null,null,122,621.2276129123361,1.0327626836169279,0.39382427793350894,236.89325724931533]
[null,null,null,null,null,123,740.788463111939,0.97110801021115634,0.37315636252129375,284.65415317960793]
[null,null,null,null,null,124,868.91235326037292,0.94802437102397996,0.37439966403832509,343.15625534821322]
[null,null,null,null,null,125,1046.3787979625504,1.036982398118949,0.41306398893180341,416.80688216512806]
[null,null,null,null,null,126,1213.2093906018704,0.8268914400554076,0.45140094685862853,662.29234108260687]
[null,null,null,null,null,127,977.3194519688185,0.97170710595561915,0.3718790266163931,374.02691023238293]
[null,null,null,null,null,128,1044.5724823301316,0.91384331687240183,0.40120345482732039,458.59731202358296]
[null,null,null,null,null,129,1057.739597322065,0.90825973631371115,0.41700656220419874,485.63680140300539]
[null,null,null,null,null,130,1286.6935889951953,0.9427347850490494,0.41350896180030133,564.37859149625467]
[null,null,null,null,null,131,822.64404268429655,0.94888827824869315,0.39258084544881067,340.3501773427808]
[null,null,null,null,null,132,912.24820749057551,0.83469156459073335,0.37459224165785432,409.39805251273515]
[null,null,null,null,null,133,880.80138557936846,0.9286582946047498,0.3949193079011234,374.56777763386339]
[null,null,null,null,null,134,935.71411433390176,1.0214434243262542,0.38806224388895783,355.4923456348003]
[null,null,null,null,null,135,1054.5623040365781,0.98597161685065871,0.42800080287268749,457.77536096689829]
[null,null,null,null,null,136,768.70427736398904,0.82236836475431707,0.39451094657542901,368.76692379825215]
[null,null,null,null,null,137,1105.2604886596578,0.85392067944634331,0.42542473997893648,550.64266191784247]
[null,null,null,null,null,138,1003.6908823091611,0.92516046903185023,0.3588885503946424,389.352093884]
[null,null,null,null,null,139,1201.6410300045463,0.89886763151498539,0.411521019518376,550.13722201691985]
[null,null,null,null,null,140,877.70445790852182,0.9121095391249,0.35692648022477497,343.46309231613498]
[null,null,null,null,null,141,1068.8209536605418,0.93543175402567758,0.36911035586415009,421.74416344420297]
[null,null,null,null,null,142,1029.471949640699,0.86262528970645935,0.35026176999985265,418.00845807459791]
[null,null,null,null,null,143,1074.2316988235593,0.87628306542773682,0.38325080675563644,469.82554092340621]
[null,null,null,null,null,144,1087.0708537605117,0.8594462185649514,0.35869311431912065,453.69311260915777]
[null,null,null,null,null,145,1143.3173668253044,0.91984179605568261,0.39422929534589923,490.0073054007907]
[null,null,null,null,null,146,1121.073525110422,0.90933173596089445,0.4234335558881272,522.03187283233456]
[null,null,null,null,null,147,996.18975434024935,0.91032817088459883,0.42623500477003901,466.43722371073102]
[null,null,null,null,null,148,829.11587289211184,0.98500113668395672,0.39574458497554199,333.11445519641222]
[null,null,null,null,null,149,1064.6506853025646,0.83869492322719796,0.36647353993761278,465.2064709519438]
[null,null,null,null,null,150,1316.5160469727377,0.8940953679135365,0.3903364632992275,574.75324903116302]
[null,null,null,null,null,151,1050.3353615611475,0.95431540123552472,0.37233143731096324,409.7941564416559]
[null,null,null,null,null,152,800.06069176949188,1.0544063967902766,0.37545958100394738,284.89058206012567]
[null,null,null,null,null,153,1092.9351622262434,0.87958993285639653,0.42602008381676043,529.35158990038781]
[null,null,null,null,null,154,1029.4277878973255,0.85223269122811796,0.4119097581389779,497.55349155085338]
[null,null,null,null,null,155,904.15818173856792,0.85001692267351603,0.36179002251887393,384.8339958961767]
[null,null,null,null,null,156,1149.5759243926834,0.9979029591000359,0.43138022552223065,496.94643852612336]
[null,null,null,null,null,157,1006.7392623457682,0.89911645876662849,0.42076307660937357,471.12774461845822]
[null,null,null,null,null,158,1012.0959910118698,1.0469405799463984,0.37473662695986887,362.2645306678358]
[null,null,null,null,null,159,1024.0554103344409,0.91842275787706629,0.4268455197033485,475.93927750616479]
[null,null,null,null,null,160,1194.2791065873671,0.94953932790861539,0.40162114948320421,505.13731605812359]
[null,null,null,null,null,161,1321.6632322499572,0.97342727688922159,0.4355994786768736,591.4317675525657]
[null,null,null,null,null,162,1008.4275159343165,0.92092901161927587,0.36678536212122048,401.63405315531838]
[null,null,null,null,null,163,1181.7510710533513,0.87205013043654989,0.41195817973412091,558.26150715243568]
[null,null,null,null,null,164,944.59082059575144,0.9694519309071481,0.39474072663110116,384.61779795737755]
[null,null,null,null,null,165,1036.0332662482738,0.88476589156826502,0.39731577341967228,465.24437977408422]
[null,null,null,null,null,166,950.55744387242305,1.0067584648798289,0.43842154288733337,413.94721344144051]
[null,null,null,null,null,167,1211.9508189446267,0.98120054721991035,0.40279182296525506,497.51692565814568]
[null,null,null,null,null,168,938.20920225897009,0.96898584802432652,0.3758138787296369,363.8773879718521]
[null,null,null,null,null,169,808.32771414640274,0.91129886383551073,0.39537542322809188,350.70043952706664]
[null,null,null,null,null,170,965.17461115034769,0.78507585996437634,0.38999452547743563,479.46043646728413]
[null,null,null,null,null,171,916.71971889240319,0.95488054139014433,0.44090554951048766,423.28521096149609]
[null,null,null,null,null,172,1030.7421507739314,0.8000045203407895,0.38154561203287674,491.5911532569769]
[null,null,null,null,null,173,1202.1758032592804,0.95878758828197608,0.3914067918371722,490.7654001040388]
[null,null,null,null,null,174,1247.5876412620773,0.92031516813190173,0.42271423797135899,573.03527893500916]
[null,null,null,null,null,175,976.1758442177462,0.87044214169854939,0.42551856839417879,477.20684446866841]
[null,null,null,null,null,176,705.88972094934024,0.88399213656940123,0.40773036143266783,325.58284078320384]
[null,null,null,null,null,177,947.55069768993746,0.95782430859690049,0.42026358200517305,415.75584036494212]
[null,null,null,null,null,178,1091.1346821494349,0.90593076562279951,0.38091837967684355,458.79141199916683]
[null,null,null,null,null,179,1174.8338672120817,0.87772734426785548,0.38987998838535337,521.85250635598879]
[null,null,null,null,null,180,1226.3350676034477,0.87619229204515625,0.40073695644933266,560.87891555335102]
[null,null,null,null,null,181,965.73646804454154,0.94264966508292281,0.41861015292843101,428.86249849897939]
[null,null,null,null,null,182,1027.9717272869677,0.99947998173555819,0.43859368732818821,451.09648875309512]
[null,null,null,null,null,183,727.82507990116983,0.86688776956884972,0.37382153911212151,313.85457394141878]
[null,null,null,null,null,184,880.05557973632324,0.97044926244277352,0.3823676859474352,346.75158048126173]
[null,null,null,null,null,185,1197.7476308297316,0.87067527816110757,0.4373440168958635,601.63389639466811]
[null,null,null,null,null,186,668.38366706915576,0.91447110107300555,0.3727039851363006,272.40801379550805]
[null,null,null,null,null,187,1234.3520626679565,0.89825070148569996,0.40197975194509233,552.38981182368434]
[null,null,null,null,null,188,1123.054918976454,0.90799958368793476,0.40765561205601059,504.2068835630713]
[null,null,null,null,null,189,904.68137325178861,0.85869265491187519,0.41561364175907528,437.87252402591542]
[null,null,null,null,null,190,929.23694744452951,0.86135546219955084,0.41766257610457697,450.57762365628611]
[null,null,null,null,null,191,825.01699947396492,0.95986263998209631,0.41681441603966329,358.25853047572519]
[null,null,null,null,null,192,1160.2616008086984,0.82293144168997767,0.39312859599087568,554.27705274127527]
[null,null,null,null,null,193,924.12423477592063,0.87234303331443785,0.40347875825766993,427.42875736225216]
[null,null,null,null,null,194,980.25666810607254,0.98435935397318064,0.39030134744725603,388.67462056583634]
[null,null,null,null,null,195,982.68971165070616,0.86819336211061071,0.4288868053116186,485.44790761573603]
[null,null,null,null,null,196,1123.9326094081769,0.93215914902465891,0.39653208270985063,478.11078065420753]
[null,null,null,null,null,197,856.80108463593547,0.95454093166860221,0.38339660730331715,344.13886097999909]
[null,null,null,null,null,198,1211.736925703698,0.87139795475764126,0.40605639873792487,564.64848188203007]
[null,null,null,null,null,199,707.61945389091261,0.94712345242022311,0.37647430663023335,281.2733045316337]
[null,null,null,null,null,200,1077.963930711494,0.8039521122789075,0.38412953435764835,515.05279535218676]
[null,null,null,null,null,201,1094.1714864128028,0.92694617476481744,0.41117468692744291,485.35247311945108]
[null,null,null,null,null,202,1247.2043540291425,0.85578556512636084,0.39382815464734744,573.95708601711283]
[null,null,null,null,null,203,939.57614852266568,0.91417684119444376,0.40372578147708715,414.94281820125639]
[null,null,null,null,null,204,1182.4271014287692,0.92481684352934301,0.42061570117293517,537.77935364513394]
[null,null,null,null,null,205,962.55103420743171,0.87507538256492035,0.39481280767039678,434.27970196988906]
[null,null,null,null,null,206,704.42950687795974,0.86826919701950978,0.41616366551189488,337.63487946294276]
[null,null,null,null,null,207,950.74340833286556,0.9486528661251552,0.34404635430710034,344.80452776629801]
[null,null,null,null,null,208,987.45397643846093,0.97793221152034204,0.39567223054086437,399.52474497842513]
[null,null,null,null,null,209,818.1228305604742,0.94251760358675507,0.40738728216171149,353.61974688656272]
[null,null,null,null,null,210,1006.9904973424916,0.79231573409514422,0.37719751397804213,479.3976641532758]
[null,null,null,null,null,211,856.39755305278084,0.91712864315156617,0.40564771828993712,378.78624328117809]
[null,null,null,null,null,212,1313.0083127280459,0.91804094796692881,0.43370743167836767,620.30072225726235]
[null,null,null,null,null,213,799.14965731720099,0.91858708675427192,0.37373708635488145,325.142677046068]
[null,null,null,null,null,214,840.44493987059093,0.99062395651031243,0.38630859436688691,327.74404579099325]
[null,null,null,null,null,215,960.45593447183751,0.9536909977969199,0.41060796790619514,413.52058520835982]
[null,null,null,null,null,216,973.6668858572898,0.86840308377672548,0.42159508330461609,472.69888778917772]
[null,null,null,null,null,217,998.32740848988465,0.9111670404402411,0.45937479218652183,503.31764150245004]
[null,null,null,null,null,218,989.65214388452807,0.89977958520233736,0.4023292579524877,442.5150550516363]
[null,null,null,null,null,219,1087.285576818033,0.96133296524028833,0.37061663263351963,419.17434828688181]
[null,null,null,null,null,220,1318.4867018296277,0.96563199176838577,0.37319892810227673,509.57075576877429]
[null,null,null,null,null,221,1129.5225094802388,0.99366284689262263,0.43087178964994832,489.78321634102804]
[null,null,null,null,null,222,1157.099591429044,0.87389848347789101,0.39235419125749715,519.50298917186376]
[null,null,null,null,null,223,1092.7400108718482,0.92529175666566799,0.39321793310043501,464.37781963989914]
[null,null,null,null,null,224,1015.9304744943864,0.95606030775361972,0.34820987139755893,370.01538187872956]
[null,null,null,null,null,225,947.16756233461899,0.84780401762502677,0.38279143065129667,427.65499893270049]
[null,null,null,null,null,226,863.16455392030218,0.96298237922268115,0.3916054604684498,351.01364250387792]
[null,null,null,null,null,227,1049.6184220317371,0.89818685248645636,0.41225655651445736,481.76175717008419]
[null,null,null,null,null,228,1052.9554257680284,0.97930525799026935,0.40765644545622626,438.31487944151002]
[null,null,null,null,null,229,849.07152161655472,0.8708087619076047,0.41629787932672901,405.90619813170241]
[null,null,null,null,null,230,957.46991408783356,0.94409049670479472,0.34395087713838141,348.82526403302637]
[null,null,null,null,null,231,1178.7084809815399,0.91660802520411244,0.39131051665555744,503.20421815689798]
[null,null,null,null,null,232,834.18189166914931,0.96844065575108251,0.40903340173388764,352.32748107793395]
[null,null,null,null,null,233,680.61560703138207,0.95834153831040791,0.40037529176540265,284.3471365393458]
[null,null,null,null,null,234,936.77920599139134,0.86698581700159383,0.42519401018723163,459.42263350169452]
[null,null,null,null,null,235,1010.2106717078324,0.90795724307679815,0.42978095362991436,478.1825456697029]
[null,null,null,null,null,236,749.10529568367247,1.0020961030356337,0.39892042437630615,298.20832707703153]
[null,null,null,null,null,237,792.74066740714363,0.95897030720880339,0.41244726955065036,340.95291718207966]
[null,null,null,null,null,238,817.69589464251794,0.9662419642778568,0.3747083336982065,317.10221402188358]
[null,null,null,null,null,239,1103.630595592216,0.925878394660546,0.41516320013605501,494.86715801604748]
[null,null,null,null,null,240,1233.8143826112459,0.94271520860661606,0.42154349758968135,551.71108461392419]
[null,null,null,null,null,241,826.43787812334335,0.96939163628072167,0.38870231610945633,331.38135849781793]
[null,null,null,null,null,242,1175.3792565244578,0.86674939922450145,0.38761907010357599,525.64145396659865]
[null,null,null,null,null,243,785.54338067061144,0.93047358090568066,0.46843970771450949,395.47572245977602]
[null,null,null,null,null,244,1404.5226169543914,0.87395780065328343,0.40718823011243449,654.38523247122953]
[null,null,null,null,null,245,1138.7832331965762,0.94712317523063083,0.40975052554137814,492.6677337046288]
[null,null,null,null,null,246,1054.5274429916647,0.97356774229931298,0.42316755334518402,458.35721398516051]
[null,null,null,null,null,247,999.9062149791306,0.94593677930574838,0.41502053726426091,438.69910086282925]
[null,null,null,null,null,248,1284.0777743847293,0.99918547477125286,0.43880715025281652,563.92183744438205]
[null,null,null,null,null,249,1036.3630990112492,0.88790525031698564,0.39742957511131666,463.87984073080429]
[null,null,null,null,null,250,884.44566541437371,0.8934572780044947,0.38570623145240218,381.81591098939384]
[null,null,null,null,null,251,1038.9481041477661,1.0042594709344539,0.42554153295879471,440.24037781021832]
[null,null,null,null,null,252,1106.3941010619462,0.96579007072236966,0.40153652064762596,459.99400001408799]
[null,null,null,null,null,253,753.33784319556207,0.95633623538149004,0.41041392018038192,323.29668792983676]
[null,null,null,null,null,254,1082.8251014149585,0.91828213865694164,0.38999259738825393,459.87366631747437]
[null,null,null,null,null,255,765.51845711148678,0.95160560763239344,0.36893594579899003,296.79026030930243]
[null,null,null,null,null,256,1125.7402610748723,0.9235468417009961,0.38642132360156572,471.02109181048064]
[null,null,null,null,null,257,1122.049727675728,0.77110105614024882,0.41495944252164796,603.81856018778706]
[null,null,null,null,null,258,1179.7954513432692,0.93932007175848842,0.38259060424041341,480.53764438834224]
[null,null,null,null,null,259,934.11350425838123,0.9463556731455951,0.38610566791910234,381.11095934482512]
[null,null,null,null,null,260,1031.0586328661041,1.0121771942142648,0.38385979911367085,391.02042799298334]
[null,null,null,null,null,261,959.78153307991101,0.97138208220277333,0.39169653465943111,387.01877193884678]
[null,null,null,null,null,262,759.27135658808425,0.9298928933897318,0.39493856112349679,322.47320009091129]
[null,null,null,null,null,263,1101.2802115586974,0.97889851211329271,0.42484369550501783,477.95757075478701]
[null,null,null,null,null,264,814.47986919523123,1.0007197553187517,0.42865589882354554,348.88049181397383]
[null,null,null,null,null,265,605.90083734043947,0.90060552507623592,0.39284586599686072,264.29511314965475]
[null,null,null,null,null,266,882.92552521217431,0.89493375305265432,0.38897070946691559,383.75149755696202]
[null,null,null,null,null,267,855.26141365227386,1.0277716544983901,0.36197548503830212,301.21833355330261]
[null,null,null,null,null,268,1370.2327607811137,0.88485422146132664,0.40997675403826861,634.86568286264185]
[null,null,null,null,null,269,1347.864560356019,0.86098551954596103,0.41188048294724333,644.79493959395847]
[null,null,null,null,null,270,865.81255750492505,0.87767793075471734,0.42656642355248969,420.79965005400715]
[null,null,null,null,null,271,798.474683408494,0.97573536683541084,0.36795176858336298,301.10640847433285]
[null,null,null,null,null,272,1434.3450520890042,0.92836696886011549,0.38503021902420587,594.87918903470779]
[null,null,null,null,null,273,965.44068892416203,0.88505608453550744,0.41153143073326726,448.90848720574166]
[null,null,null,null,null,274,1120.616890969121,0.81273736448411149,0.38775930784773349,534.64950547768274]
[null,null,null,null,null,275,1030.3728805950025,0.86752793180276577,0.39966473019532128,474.68638671705855]
[null,null,null,null,null,276,961.58260649604881,0.97847492304666472,0.42191660694141853,414.63267077244188]
[null,null,null,null,null,277,1310.5702216199275,0.884965959561968,0.37079038972905409,549.11359921942642]
[null,null,null,null,null,278,872.85114023922074,0.88281198926259696,0.39832968327972246,393.83529275836952]
[null,null,null,null,null,279,1265.7670736415057,1.0433603748724436,0.41477062732938053,503.1847248860164]
[null,null,null,null,null,280,1026.4321431195958,1.0170418067284812,0.37580213115226124,379.27190830858967]
[null,null,null,null,null,281,1252.9923155037127,0.97833278341482355,0.4503120108189127,576.73370319420201]
[null,null,null,null,null,282,1268.6559157125448,0.95818190181559482,0.43765241885465384,579.46234337529461]
[null,null,null,null,null,283,1011.6355448637704,0.86910991766002665,0.39005609110238915,454.02152044495841]
[null,null,null,null,null,284,1006.9421629117331,0.90556368444309721,0.40518136756568107,450.54170086229635]
[null,null,null,null,null,285,943.7278684049179,0.96158101256010642,0.41931651494297961,411.53129654729054]
[null,null,null,null,null,286,1155.7683808476331,0.91441861704113025,0.41877638100542319,529.30735528769196]
[null,null,null,null,null,287,875.54281375184735,0.92924542802605647,0.37706515875814345,355.27394605339373]
[null,null,null,null,null,288,881.02556549943085,1.0254196645033162,0.38845323584474756,333.75333400298342]
[null,null,null,null,null,289,1071.5526743354999,0.91109191021107416,0.39106081512536289,459.93412692943667]
[null,null,null,null,null,290,960.87708730612985,0.92882049418537005,0.39073169511389966,404.21710704016931]
[null,null,null,null,null,291,1358.1684466237136,0.8826007776148086,0.39148045865825087,602.4200520832336]
[null,null,null,null,null,292,1144.3808189842832,0.94577424784465314,0.42185636150057432,510.44351182953005]
[null,null,null,null,null,293,924.6244488589241,0.9433553938744309,0.40073513529583971,392.7782742509479]
[null,null,null,null,null,294,1134.7660356257279,0.89177895251458372,0.41217578943517941,524.48320880348922]
[null,null,null,null,null,295,1053.2892106772956,0.96219740527813291,0.38257510372960357,418.79371823462606]
[null,null,null,null,null,296,847.73146025816482,0.97097327374401676,0.42186743682873423,368.3214645849007]
[null,null,null,null,null,297,592.88161144379751,0.99133421822929324,0.42159519767438275,252.14103939700806]
[null,null,null,null,null,298,1041.0129244506647,0.87876162084831011,0.41951718819714229,496.97529407444739]
[null,null,null,null,null,299,1095.2058446174226,0.94659276658714597,0.43643346331700122,504.95260124872152]
[null,null,null,null,null,300,855.43287754152766,0.9337142408732737,0.42259244936996049,387.16285900680759]
[null,null,null,null,null,301,769.67221855610137,0.88403037719061373,0.38796142400155809,337.77473900207281]
[null,null,null,null,null,302,792.86304823812816,0.86937991816502525,0.40522883022020417,369.56336217254875]
[null,null,null,null,null,303,763.20964109723764,0.90253613226516416,0.39637105845327603,335.18238489157642]
[null,null,null,null,null,304,1302.893852410803,0.95420917461721577,0.43084460424810572,588.28273836751532]
[null,null,null,null,null,305,1026.3613606042143,0.90795738859935049,0.37947819047545589,428.96479150507651]
[null,null,null,null,null,306,756.17327491979518,0.84656550101030736,0.37703263780551921,336.77489118184275]
[null,null,null,null,null,307,942.80939131649086,0.94335259157934626,0.37850923633420153,378.2912835575778]
[null,null,null,null,null,308,1114.8166349209378,0.87210623959807387,0.36771679009075953,470.05373418935318]
[null,null,null,null,null,309,1063.4161291047913,1.0002775944817088,0.43172742714212609,458.97849950116603]
[null,null,null,null,null,310,1049.3784640387883,0.97673999277390955,0.40524248370182625,435.37966936582814]
[null,null,null,null,null,311,1101.9727806636158,0.87843599066624378,0.36945573044740648,463.47162791502973]
[null,null,null,null,null,312,785.51999427231328,0.84754264466930751,0.39360357356992914,364.79990570486206]
[null,null,null,null,null,313,1228.1083159362347,1.0174145286709089,0.40513605974922601,489.03465602524409]
[null,null,null,null,null,314,1283.7898737182456,1.0249037444748701,0.40205770580327599,503.61569478419545]
[null,null,null,null,null,315,988.84359659122947,0.96397876065524546,0.4073487556192828,417.85589580805203]
[null,null,null,null,null,316,982.16336982157702,0.8563221132329224,0.4149226838979016,475.89786032038245]
[null,null,null,null,null,317,1214.2023456913757,0.80757821245532568,0.39880096545518223,599.60145067243798]
[null,null,null,null,null,318,960.96664583447421,0.98969999683689391,0.41880039680824122,406.64162259393049]
[null,null,null,null,null,319,1053.1598888016083,0.97093249254456193,0.39048723355674869,423.55724484336235]
[null,null,null,null,null,320,1392.3078617956148,0.87930828824020302,0.40499828711398439,641.27940871691271]
[null,null,null,null,null,321,902.05112988598466,0.97665936618877591,0.38672428213717169,357.18192824739128]
[null,null,null,null,null,322,1158.0752609996159,0.97542066121967408,0.3779194516888999,448.68761248526539]
[null,null,null,null,null,323,1116.4656013812444,0.88047093509872254,0.42806312614852304,542.79787840010852]
[null,null,null,null,null,324,772.11081274219362,0.8324722901892101,0.37003226862647215,343.20171258203186]
[null,null,null,null,null,325,1002.6101468345538,0.89849701291928374,0.41162141785372747,459.31795460698697]
[null,null,null,null,null,326,858.43181330431764,0.95328774487786061,0.36813091544212762,331.50042154045872]
[null,null,null,null,null,327,1049.5635112330344,0.97509105639645122,0.37727723393283602,406.09173446652835]
[null,null,null,null,null,328,1092.2312547530196,0.9863582389490414,0.3805113158053523,421.35436750913993]
[null,null,null,null,null,329,1135.9103988031181,0.87996166636673845,0.40856617034670661,527.40315769911183]
[null,null,null,null,null,330,878.53712823948695,0.89672531428662738,0.40648264853267846,398.23800335688315]
[null,null,null,null,null,331,1237.2143662432379,0.89295381585038136,0.41002643865818633,568.10396175344727]
[null,null,null,null,null,332,1251.8350417106669,0.96802264930434134,0.39126888200516713,505.98412916992862]
[null,null,null,null,null,333,1033.5696528965316,0.95073674832030985,0.37927175417109987,412.31579194203346]
[null,null,null,null,null,334,1204.9947906733607,0.93456747886890457,0.37826022070964893,487.71394873030852]
[null,null,null,null,null,335,956.65531625099811,0.92573976983905126,0.41929095625433044,433.29338916314242]
[null,null,null,null,null,336,1140.5675583583916,0.85753853190881779,0.35936755571683188,477.97616121668699]
[null,null,null,null,null,337,1308.5068169984659,0.9912319614066617,0.34598997462311415,456.73490972284588]
[null,null,null,null,null,338,1334.5392873112994,0.90530978772016313,0.39160360316535919,577.27244371556208]
[null,null,null,null,null,339,903.71754969652523,0.91336328036581638,0.37407418015868177,370.12370517275787]
[null,null,null,null,null,340,1139.7127554251924,0.86534869937685532,0.3920307198968192,516.32643847118709]
[null,null,null,null,null,341,543.90435181359544,0.84860934055122494,0.41336850697484667,264.94279417224493]
[null,null,null,null,null,342,835.22855898687408,1.0080200194605102,0.3877133308450017,321.25279297030681]
[null,null,null,null,null,343,934.77250866078327,1.043974255726936,0.39818194478060359,356.53133531230503]
[null,null,null,null,null,344,644.52645845275003,0.92706637636411993,0.37147441958266852,258.2610028403945]
[null,null,null,null,null,345,1042.6379175233087,1.0500860419988123,0.41347677050993498,410.54403325668551]
[null,null,null,null,null,346,940.78712155235894,1.0106876715543152,0.41078126346356064,382.37106607543677]
[null,null,null,null,null,347,810.20284232867641,1.0203949289249419,0.40596460651955096,322.33958515799043]
[null,null,null,null,null,348,723.48654646803084,0.91879500589454288,0.42095059265549678,331.46903124215714]
[null,null,null,null,null,349,1259.0106913972552,0.88950229588896823,0.40639589663775438,575.2169288057396]
[null,null,null,null,null,350,955.26049533659534,0.92039705278766759,0.41382451446212354,429.49964851605284]
[null,null,null,null,null,351,928.12348823859747,0.97615825853876326,0.40143510023939988,381.68129222543234]
[null,null,null,null,null,352,1250.5857400630466,0.9211710727399296,0.38447920644487943,521.97059499551995]
[null,null,null,null,null,353,1086.3714525377836,0.94951185791138293,0.40528335497616497,463.6995982370704]
[null,null,null,null,null,354,1077.7146420257868,0.92354508502287047,0.39965428100599509,466.36951175781866]
[null,null,null,null,null,355,1110.8757248044767,0.87226094465207382,0.38558238266369738,491.06189087054128]
[null,null,null,null,null,356,1010.9609955530146,0.88720045258703528,0.41128569897918771,468.65823668628849]
[null,null,null,null,null,357,1065.2784827148985,0.90294616373179515,0.40458673047955424,477.32362756885431]
[null,null,null,null,null,358,1234.6602542405246,0.91786604647918235,0.43122854848427,580.06367198096018]
[null,null,null,null,null,359,1001.9513535328339,0.88269246422774306,0.34313529248836211,389.4956450708911]
[null,null,null,null,null,360,591.19194483344529,0.93042217506647085,0.40108302460055723,254.84888441781169]
[null,null,null,null,null,361,748.79574035425435,0.90612999502541292,0.35710603113245737,295.10056662377502]
[null,null,null,null,null,362,881.12532314472264,0.93128755747287006,0.3863670976070564,365.55608522819085]
[null,null,null,null,null,363,1150.6532783222478,0.91501758082023488,0.42367335037477072,532.7778829227492]
[null,null,null,null,null,364,1191.4351480277551,0.88111259125170704,0.38977315558044284,527.04891738809374]
[null,null,null,null,null,365,946.58367232180126,0.87986882816375034,0.41536427044250274,446.85869516172562]
[null,null,null,null,null,366,731.35721539969472,0.82564454523553465,0.38782084064707484,343.53230058426612]
[null,null,null,null,null,367,880.96755200955829,0.95271438507089401,0.42183791655730485,390.07022725561922]
[null,null,null,null,null,368,817.7363631927708,0.86163463946232655,0.41199956691251005,391.00914941658777]
[null,null,null,null,null,369,1011.0167163180066,0.95485131121661448,0.41935527610935447,444.02221502163172]
[null,null,null,null,null,370,879.02628035566568,0.84276987920718627,0.37477755997089024,390.90068668791952]
[null,null,null,null,null,371,1277.5938525081469,0.95398688430713463,0.41420084965170295,554.7041242637232]
[null,null,null,null,null,372,947.10111984529317,0.97245939334029352,0.42530499287006135,414.21455515939982]
[null,null,null,null,null,373,961.53552551739529,0.94859291873809881,0.43539110773048328,441.33158629746885]
[null,null,null,null,null,374,887.30530180729056,0.92723051923244493,0.41384333613726887,396.02383512590313]
[null,null,null,null,null,375,780.79778007439734,0.86575678219695984,0.40377210823376519,364.14888366783873]
[null,null,null,null,null,376,933.12123208943046,0.95517779334244202,0.42719432695905224,417.32973640304743]
[null,null,null,null,null,377,859.19475885066913,0.92214559678039054,0.38191401759805133,355.84242162790946]
[null,null,null,null,null,378,1041.5611756830278,0.96042419241842214,0.35106414132608854,380.72216700310986]
[null,null,null,null,null,379,963.0612586823446,0.89207926122266856,0.38509100970145393,415.73237786296511]
[null,null,null,null,null,380,1155.0248764563325,0.74831700127295298,0.40258446680920335,621.38782527797866]
[null,null,null,null,null,381,961.69008937815727,0.92949654908759094,0.39537214635059109,409.06604240195338]
[null,null,null,null,null,382,967.13706971169324,0.90051521088612574,0.42089608140909823,452.03478842580557]
[null,null,null,null,null,383,1107.9615406629343,0.80605263608089561,0.39996007508058895,549.76605888238612]
[null,null,null,null,null,384,1257.1703414257715,0.91477007521452425,0.41796714204973962,574.41307811932916]
[null,null,null,null,null,385,1105.417237117221,0.88445275391510203,0.3775318543876669,471.85134259982755]
[null,null,null,null,null,386,985.23278455090258,0.86401988634477811,0.43343061779476716,494.23637259797346]
[null,null,null,null,null,387,884.93684581014668,0.92941631254516488,0.37772424543143496,359.64733760993494]
[null,null,null,null,null,388,1351.9822131118269,0.94088686274946243,0.42868206461550562,615.98322751217472]
[null,null,null,null,null,389,884.35174716715437,0.88291541509771432,0.39966969926494872,400.31988431826346]
[null,null,null,null,null,390,1217.9854409425602,0.84525470677159253,0.3569210500403216,514.31200445538059]
[null,null,null,null,null,391,931.74297555865178,0.88763990054419717,0.37648105746890065,395.1868100031125]
[null,null,null,null,null,392,915.19077048218037,1.0127849406650005,0.39504494317327254,356.97754913342828]
[null,null,null,null,null,393,1124.132647654304,0.90266843030721866,0.39744704778479578,494.95826720853495]
[null,null,null,null,null,394,1074.1732936007925,0.86084622208479167,0.3826035345079532,477.4168582751027]
[null,null,null,null,null,395,1366.120892478428,0.9207185778024114,0.41201691101725701,611.33219614027644]
[null,null,null,null,null,396,738.30382960474731,1.0028644174093038,0.44283761642052533,326.01486544005365]
[null,null,null,null,null,397,1007.4072926310658,0.91502808410433856,0.430809909115203,474.30352326857553]
[null,null,null,null,null,398,745.41030808577136,0.93417033254592741,0.39231242849047676,313.04112108761092]
[null,null,null,null,null,399,919.05067528436916,0.92385771567146824,0.42906364467559233,426.83112961011773]
[null,null,null,null,null,400,1457.1409074542339,0.8829340426041995,0.40784371735342045,673.08058782175283]
[null,null,null,null,null,401,843.30241335997346,0.86794693860909899,0.38800033880200674,376.98343935697989]
[null,null,null,null,null,402,741.18075220230298,0.94964840492535929,0.39793201230726155,310.57762712764622]
[null,null,null,null,null,403,911.14485291355982,0.99829146202527097,0.38864511897104292,354.71804901751204]
[null,null,null,null,null,404,974.08265870432342,0.93302522271925048,0.40202125186265769,419.71205100834874]
[null,null,null,null,null,405,1022.234957656692,0.83619384359758808,0.42400903365048026,518.34495060973177]
[null,null,null,null,null,406,1074.1604872578359,0.89885603667122216,0.40175843666685918,480.11363386756744]
[null,null,null,null,null,407,792.86037859564931,0.92803290536745553,0.40092077303533841,342.52470365778265]
[null,null,null,null,null,408,910.21537916122895,0.95892971326626253,0.40286631906772025,382.4004140120901]
[null,null,null,null,null,409,986.46219923421529,0.92485796978126211,0.40326039324303203,430.12132390085765]
[null,null,null,null,null,410,714.76823229044464,0.89549098438704233,0.39656887397549767,316.53566364702323]
[null,null,null,null,null,411,972.51587804790393,0.94047369657298852,0.3969050336559326,410.42769055006278]
[null,null,null,null,null,412,1115.2162332786938,0.91022291978620007,0.43083206728111079,527.86070840950674]
[null,null,null,null,null,413,1062.6216781048954,0.91784364357751369,0.34884646005687692,403.87250419007262]
[null,null,null,null,null,414,1260.7557427692477,0.94844482676140773,0.4027322159015056,535.34685378566292]
[null,null,null,null,null,415,1071.7150157575577,0.81698445731159364,0.39043481973884797,512.16991369167476]
[null,null,null,null,null,416,818.18084616715623,0.89838647941547256,0.41097447279267013,374.28372933816513]
[null,null,null,null,null,417,1316.6231844818158,0.92929570418690588,0.40348615515408814,571.6578954361047]
[null,null,null,null,null,418,975.00357867889329,0.91683955478735868,0.41404317992896872,440.30995396131391]
[null,null,null,null,null,419,924.24756104750963,0.91661892009168833,0.39767001116858619,400.97965454120953]
[null,null,null,null,null,420,1207.4143149433639,0.90157420674606481,0.37714169702530143,505.07909425878171]
[null,null,null,null,null,421,1085.3988469026037,0.86494015089487264,0.39791683314462012,499.3391408775064]
[null,null,null,null,null,422,426.6386690701039,0.8686546615039954,0.3779992526874984,185.65386824364199]
[null,null,null,null,null,423,1139.5548621359681,0.92172964112280131,0.39935018258794674,493.72551555207195]
[null,null,null,null,null,424,1147.4894581594901,0.95563060306420289,0.38155459190116447,458.15806914831251]
[null,null,null,null,null,425,729.50940285011052,0.83584796228320413,0.39071781942950251,341.00977210773925]
[null,null,null,null,null,426,1086.0250183809446,0.95608330124186314,0.42973238476078107,488.1375089937398]
[null,null,null,null,null,427,654.3555394209186,0.92845596705660527,0.37510367823899754,264.36490089129393]
[null,null,null,null,null,428,969.23548095336912,0.94751963093432623,0.39738258943414828,406.49005320650463]
[null,null,null,null,null,429,835.97579436017952,0.98615563228755954,0.4094965958832274,347.13510811389699]
[null,null,null,null,null,430,1157.8593584462369,0.90818209913763837,0.37079921887149458,472.73927341508573]
[null,null,null,null,null,431,820.80647033271259,0.92926095327429614,0.41678469883868308,368.14156059937477]
[null,null,null,null,null,432,1084.5509123451109,0.90051147942616361,0.40177316872864594,483.88439976146623]
[null,null,null,null,null,433,1145.9529176935625,0.89482231018619363,0.4045140090408848,518.04028982230705]
[null,null,null,null,null,434,1157.0687440993458,0.92223179477195993,0.4034150612113751,506.1406046427046]
[null,null,null,null,null,435,776.86770019677488,0.87914891599988976,0.41627676174051564,367.84663514133905]
[null,null,null,null,null,436,851.15557298418423,0.91941685758554192,0.40746615346901682,377.21419230701343]
[null,null,null,null,null,437,1097.6290753015937,0.88313329315442612,0.38853114192320132,482.89774753227846]
[null,null,null,null,null,438,695.48343559453212,0.94583800276221774,0.37348355984301401,274.62591752405677]
[null,null,null,null,null,439,1377.3176049757151,1.0033254977158159,0.38646767290872636,530.52447173225494]
[null,null,null,null,null,440,1115.3040851587352,1.0024573351591231,0.42730144843437906,475.40282695169276]
[null,null,null,null,null,441,1051.3505201638493,0.90102593218424376,0.35904078733271577,418.94212479236535]
[null,null,null,null,null,442,1096.1265981703386,0.90993130305899805,0.40141665904847151,483.55680857720188]
[null,null,null,null,null,443,1138.9857028450883,0.86252320413316341,0.4088687853848228,539.9225187929577]
[null,null,null,null,null,444,1076.5350249138755,0.98289585545347202,0.41217396659739625,451.44122740762083]
[null,null,null,null,null,445,542.05996617942901,0.98010508996373158,0.38630658088208031,213.65191785258469]
[null,null,null,null,null,446,1026.7819674276941,0.95541218317435161,0.38613789262205056,414.98259292397978]
[null,null,null,null,null,447,915.69930857852785,0.95021989317026456,0.36104565704588965,347.92921185766153]
[null,null,null,null,null,448,887.43854908192407,0.95104444453511727,0.42938663034707747,400.66923309420213]
[null,null,null,null,null,449,1241.4126296222828,0.93484908439258629,0.39721984234263902,527.47950150812028]
[null,null,null,null,null,450,955.74656669418039,0.99515513321035298,0.41985129315252884,403.22500338027368]
[null,null,null,null,null,451,1252.107775967422,1.0009384639371341,0.4220195489542205,527.91852635711246]
[null,null,null,null,null,452,1029.8174985159612,0.86592035444167315,0.39577547147201342,470.68590536606644]
[null,null,null,null,null,453,945.88033381719754,1.0283062519481612,0.41781862882414311,384.32755160098679]
[null,null,null,null,null,454,853.61302573472642,0.81984500225867474,0.42384552488778043,441.3030023319306]
[null,null,null,null,null,455,916.70116797750097,0.93115391540311776,0.42485458867278775,418.26028029784646]
[null,null,null,null,null,456,1020.2054565182269,0.95571139326234089,0.40636457554074645,433.78718745543154]
[null,null,null,null,null,457,879.73849987928611,0.9044607346985295,0.38451919363470705,374.00887136990258]
[null,null,null,null,null,458,1191.9179802636449,0.9232632909395061,0.40415464666289619,521.75711402368472]
[null,null,null,null,null,459,904.91455678027171,0.91143449965176326,0.46107563952528574,457.7773368712937]
[null,null,null,null,null,460,1042.2687312874416,0.86357527022899905,0.38332964115155582,462.64930518674544]
[null,null,null,null,null,461,834.83902042656371,0.97199098275387685,0.40641178100930681,349.06539172445997]
[null,null,null,null,null,462,1160.4064834816097,0.96068874976864549,0.40153012599603483,485.00428638431993]
[null,null,null,null,null,463,898.19118358097217,0.8972487237469241,0.38375031893154449,384.15340589319072]
[null,null,null,null,null,464,1103.4187834188222,0.90695939923980384,0.40704906936680024,495.22127372950075]
[null,null,null,null,null,465,1301.6076237913744,1.0123807526617357,0.38769580139472432,498.45654362799786]
[null,null,null,null,null,466,997.57633917835187,0.91797029272598851,0.3849974211067872,418.38425598752701]
[null,null,null,null,null,467,926.6980419664792,0.9610742564832242,0.40118649691583963,386.83664518880909]
[null,null,null,null,null,468,1096.2787942867694,0.97587827451011677,0.41658556314349621,467.98246339635307]
[null,null,null,null,null,469,1133.4825549409388,0.99210546965316104,0.39445578374663487,450.66655033025353]
[null,null,null,null,null,470,715.99393146811258,0.93857450775982787,0.35658950694119718,272.02520512142064]
[null,null,null,null,null,471,880.46244462134337,0.90900408800385646,0.3819643482665005,369.97112364085916]
[null,null,null,null,null,472,989.71079443018789,0.95676510695690287,0.39252307555921628,406.03939474706584]
[null,null,null,null,null,473,1048.1586037725444,0.96894235953089791,0.39168830468913612,423.71092822875823]
[null,null,null,null,null,474,1146.4117690853366,0.94020302299691227,0.4086089643722744,498.22656836074094]
[null,null,null,null,null,475,966.89871895351428,0.97790329587579905,0.40190841000899474,397.38563967750082]
[null,null,null,null,null,476,985.33189251266742,0.94418387194757003,0.42191772633436403,440.30511865888531]
[null,null,null,null,null,477,1009.0595575258218,0.90902857149635485,0.37814629255006504,419.75812708778943]
[null,null,null,null,null,478,1006.3225810939024,0.92408565628249328,0.40937202582865267,445.80316863352874]
[null,null,null,null,null,479,1062.5174085278632,0.91342183067652827,0.40531365174268763,471.47199292537289]
[null,null,null,null,null,480,885.34481521889745,0.92588376274450734,0.35819176219326065,342.50867362864864]
[null,null,null,null,null,481,987.22554848294362,0.91251905327174954,0.394590548610873,426.89505428063234]
[null,null,null,null,null,482,730.90994671760495,1.0085302579712476,0.40019800903690117,290.03463520277666]
[null,null,null,null,null,483,1295.3642423338956,0.91757603432795742,0.42565844190148999,600.91229986252722]
[null,null,null,null,null,484,1259.8972086860372,0.86232055923949935,0.4017551603016099,586.98612669702914]
[null,null,null,null,null,485,755.52169263983785,0.97230721435975731,0.40997820393371087,318.56950355490233]
[null,null,null,null,null,486,1223.873640829087,0.97908481129381242,0.37550751631772061,469.39115575406834]
[null,null,null,null,null,487,836.72262076916536,0.97894659202384737,0.33757113683381085,288.5279019396516]
[null,null,null,null,null,488,784.00699657222617,0.95369370931627806,0.35242475702439524,289.71930146260496]
[null,null,null,null,null,489,1342.7417167253509,1.0177085871312217,0.37909227718021199,500.16578566281453]
[null,null,null,null,null,490,649.42372141194642,0.94886612575991125,0.41823833042090147,286.25101645559931]
[null,null,null,null,null,491,1084.4247495433372,0.83063036692515202,0.39272357720154477,512.71803175590435]
[null,null,null,null,null,492,1533.5698397202273,0.92734500010760124,0.39930238256478678,660.33470904434932]
[null,null,null,null,null,493,1125.8367799849718,0.92786476101097082,0.39814946279263635,483.09983090079663]
[null,null,null,null,null,494,1020.652927749229,0.89810373754657269,0.39618444007796616,450.24510175061596]
[null,null,null,null,null,495,791.44878196007085,0.96616038814664096,0.39503779284455498,323.60277218026914]
[null,null,null,null,null,496,811.99091563425327,0.93119740743980994,0.40741705543568885,355.26188673331279]
[null,null,null,null,null,497,1040.618045149612,0.91011612725238089,0.38184587840126905,436.59891263543767]
[null,null,null,null,null,498,900.4355718372135,0.9229705507050967,0.41923577636504616,408.99983833448863]
[null,null,null,null,null,499,835.35858730866528,0.97422349475600856,0.3936953561177694,337.57838759461242]
[null,null,null,null,null,500,1115.8480333392572,0.87973342859212855,0.3754906420446108,476.26983452623904]
[null,null,null,null,null,501,1071.4768355268131,0.87060772832962896,0.4053484915535906,498.87165583598619]
[null,null,null,null,null,502,1096.0825561670722,0.91592207439720419,0.43362551658447579,518.9189975031245]
[null,null,null,null,null,503,639.187838393589,0.95065095572744851,0.3679076934202325,247.36957541446012]
[null,null,null,null,null,504,963.44795190507318,0.90120874855605115,0.42289908332944276,452.105304513634]
[null,null,null,null,null,505,701.12588428500794,0.95599614118021425,0.38425199196403603,281.80973337556014]
[null,null,null,null,null,506,1157.1922179240214,0.88100557487305964,0.40302636207054032,529.37119027136328]
[null,null,null,null,null,507,744.58369914361879,0.93689500555767935,0.38588102291103105,306.67333880960717]
[null,null,null,null,null,508,823.5737850978735,0.90514498066044191,0.38607485560305038,351.28199012728084]
[null,null,null,null,null,509,1106.9553416744959,0.90999714538833354,0.36419783722672072,443.02418242463381]
[null,null,null,null,null,510,1074.3877498040461,0.98330327100961012,0.3891351806077577,425.18120643847004]
[null,null,null,null,null,511,1077.5139524579697,0.92142788159799904,0.41103759273256318,480.66566032923828]
[null,null,null,null,null,512,895.48668547302884,0.92749882673199835,0.4049009189310917,390.92597358439099]
[null,null,null,null,null,513,967.67639660101941,0.91552801756420477,0.41311872854587633,436.64992762456149]
[null,null,null,null,null,514,1084.622751979397,0.96119983527885822,0.41048707721859151,463.19569251241296]
[null,null,null,null,null,515,669.15275792111083,0.89835844217213823,0.40184479131001294,299.31877715888839]
[null,null,null,null,null,516,1137.8176249422152,0.89206785537115607,0.45286493549600759,577.62164864834085]
[null,null,null,null,null,517,1201.375636533669,0.96476808008372217,0.39389836155017832,490.5011936089852]
[null,null,null,null,null,518,1104.2059956376752,0.88374481716263487,0.38165475213949657,476.86329514109997]
[null,null,null,null,null,519,1021.4696471027648,0.96067512537845889,0.43100674418245249,458.28219680979089]
[null,null,null,null,null,520,1114.4127099189845,0.87825563639160698,0.41830809649823819,530.78834918150562]
[null,null,null,null,null,521,1312.0418969329412,0.90783073923171376,0.35617304718449538,514.75890853818578]
[null,null,null,null,null,522,647.87245275412079,0.88563163907787534,0.42380264577377819,310.02738326628372]
[null,null,null,null,null,523,1083.1393864444058,0.92151164899421778,0.42029477390102987,494.01201170470307]
[null,null,null,null,null,524,933.37349855748062,0.98463469108557866,0.45169496087148825,428.17921176896891]
[null,null,null,null,null,525,804.51169032626763,0.94819157811980526,0.39240500303769771,332.94369995601664]
[null,null,null,null,null,526,1304.1354816226524,0.90072131209308559,0.38411895493491366,556.15777218632445]
[null,null,null,null,null,527,976.83732999454605,0.90252843266045901,0.38699209776161275,418.85475717601082]
[null,null,null,null,null,528,1154.7629825083277,0.8733616882417452,0.40344683579038648,533.4393272033451]
[null,null,null,null,null,529,901.21401208379882,0.9601798110706643,0.40163433670591936,376.96948821465969]
[null,null,null,null,null,530,1052.6555292911032,0.84909944109164037,0.39300907963256632,487.22583094031137]
[null,null,null,null,null,531,1258.1378636893166,0.89223970353446935,0.41615526229209782,586.8161779723132]
[null,null,null,null,null,532,925.61220726649663,0.94936576005395046,0.41054304241430323,400.2710732325246]
[null,null,null,null,null,533,1080.4059137817633,0.86593485215241395,0.39661773340003026,494.85032691661354]
[null,null,null,null,null,534,927.55961756402019,0.92664954222836793,0.40467294866023013,405.07038356177412]
[null,null,null,null,null,535,1420.6754582821352,0.92361644692992351,0.3960189267338784,609.14286671287334]
[null,null,null,null,null,536,656.30163663650217,0.91125582289709051,0.40666453917533735,292.88658126132344]
[null,null,null,null,null,537,1021.4831496223287,0.85650056252563855,0.38449838162017164,458.5620080901046]
[null,null,null,null,null,538,940.85719151174737,0.942476954676847,0.39697172846080497,396.28948346780436]
[null,null,null,null,null,539,771.20093781877222,0.91792514239095102,0.41813534803445362,351.29920474714328]
[null,null,null,null,null,540,1190.0041120720737,0.91266099414276658,0.4010762988123015,522.95698830602782]
[null,null,null,null,null,541,994.13341316777303,0.88033500364962924,0.41181971324497801,465.05447976137162]
[null,null,null,null,null,542,964.54366601926961,0.98965015235914544,0.44627719868465709,434.95556915136694]
[null,null,null,null,null,543,819.23864700213903,0.84319462866538164,0.3352198080875689,325.69588644161121]
[null,null,null,null,null,544,1367.4040663973904,0.90651486281347449,0.41197687519000609,621.43366590605774]
[null,null,null,null,null,545,819.3153719472491,1.0080892794879595,0.38337808312956628,311.5870421072915]
[null,null,null,null,null,546,1095.5317158010864,0.9760602816751891,0.37595400512277272,421.97141306432394]
[null,null,null,null,null,547,1166.0742382502651,0.92307574291182781,0.38884357626668159,491.20614475619504]
[null,null,null,null,null,548,1254.7236287005335,0.91247970473828577,0.42984519796964127,591.06731226494321]
[null,null,null,null,null,549,1255.2695354747125,0.91633865377081603,0.3584704281550869,491.05972555011328]
[null,null,null,null,null,550,817.79497186883464,0.92636255945708734,0.39632203224587842,349.87399037528945]
[null,null,null,null,null,551,928.99675629941453,0.91399805636968856,0.43722102224430287,444.39581530858692]
[null,null,null,null,null,552,839.05141988266678,1.0153999059030343,0.36922251242050974,305.09818988367954]
[null,null,null,null,null,553,1178.5688224083831,0.87368713164141831,0.42971177696449997,579.66391470204394]
[null,null,null,null,null,554,882.44892866703742,1.0262493575844418,0.3867077406777038,332.52135940091102]
[null,null,null,null,null,555,1419.6717664539322,0.90941424831867046,0.41057330395812996,640.93929555941725]
[null,null,null,null,null,556,739.42816167685305,0.89122131228430024,0.38061896968874698,315.79180297531792]
[null,null,null,null,null,557,1251.5566081118027,0.85830963989168318,0.42223090267529034,615.68209400393062]
[null,null,null,null,null,558,964.64878292939989,0.95670985426516819,0.39724312493139152,400.53951078665074]
[null,null,null,null,null,559,1209.3472332344602,0.84728724433160807,0.3786404813780464,540.43988223418876]
[null,null,null,null,null,560,879.50858701142579,0.93035250379119017,0.39780808962968306,376.06781234658104]
[null,null,null,null,null,561,906.13805043753382,0.89875990306665554,0.3764005511764143,379.49051850537893]
[null,null,null,null,null,562,1066.7834193598594,0.93494857568466583,0.41978950376667562,478.98300921165588]
[null,null,null,null,null,563,1352.6382733350811,0.91488210014103943,0.39105933399291259,578.17485140674921]
[null,null,null,null,null,564,1107.6413727727008,0.96901826381220235,0.39416843809632557,450.55628586304829]
[null,null,null,null,null,565,1278.5247794966219,0.88868520019347874,0.39051655480979003,561.82447059911226]
[null,null,null,null,null,566,786.98768728738696,0.90176535126605983,0.43191311897864915,376.93875256668719]
[null,null,null,null,null,567,1310.6594869529877,0.95532482947566177,0.39948209323130224,548.07012149869308]
[null,null,null,null,null,568,1135.2865388074561,0.92039130419304138,0.40211760960128862,496.00502212266156]
[null,null,null,null,null,569,1316.3345718312182,0.98771893105553998,0.4029166129481882,536.96760334647752]
[null,null,null,null,null,570,792.01588009896,0.9824447953229235,0.4241576730841477,341.94248302577341]
[null,null,null,null,null,571,1058.3546868949081,0.95053973997543872,0.38236150752573228,425.73085222982678]
[null,null,null,null,null,572,909.53114497997581,0.8303558091441462,0.38495210084518883,421.65770527341652]
[null,null,null,null,null,573,700.45531325480329,0.99242239303601321,0.39051499211220742,275.62689339752438]
[null,null,null,null,null,574,1059.2967771354558,0.96934531306828953,0.39817092257104436,435.11963109769977]
[null,null,null,null,null,575,1050.1105333811033,0.92369636074209904,0.38045982609551865,432.52835876745036]
[null,null,null,null,null,576,1122.3805761070528,0.8912149915460168,0.43183524449858579,543.84575562722307]
[null,null,null,null,null,577,853.58352570947898,0.96460341088532775,0.40526297462605754,358.61971336315861]
[null,null,null,null,null,578,1080.2470268649613,0.86764900205742979,0.36360080262353928,452.69306490113826]
[null,null,null,null,null,579,948.70922745406233,0.87843150419371985,0.40290502841608034,435.13889975612892]
[null,null,null,null,null,580,1047.7066530842988,0.93904500815045311,0.42797030711926504,477.49291482261339]
[null,null,null,null,null,581,1074.9380296384361,0.90757853356139284,0.37709054347609777,446.62687669448258]
[null,null,null,null,null,582,820.74943457827737,0.85952326416551206,0.38813275023339827,370.62374990472705]
[null,null,null,null,null,583,819.08489531418081,0.91513107116507231,0.38459214670903102,344.2278687191469]
[null,null,null,null,null,584,1021.0559078650218,0.909131137596911,0.36968146787008566,415.19361859578521]
[null,null,null,null,null,585,1206.1393775200925,0.87992777761609176,0.44813187462077025,614.26575458995194]
[null,null,null,null,null,586,817.16104150012416,0.98307331980111878,0.36598904221734518,304.22144604276582]
[null,null,null,null,null,587,828.10860991504774,0.83898011863555488,0.4134574693007585,408.09988527317495]
[null,null,null,null,null,588,961.79279850527803,0.8537168085548924,0.36705980663817656,413.52761841825503]
[null,null,null,null,null,589,679.82137440449264,0.93032885353527861,0.38240405346792611,279.43500646952316]
[null,null,null,null,null,590,1369.8994824782403,0.85794757691842727,0.39888430436884609,636.90535042507531]
[null,null,null,null,null,591,1364.0101983855761,0.8997198558953613,0.40912764521016781,620.25337870619046]
[null,null,null,null,null,592,909.13780141019345,0.87864524589826243,0.36859827045204135,381.39012618201826]
[null,null,null,null,null,593,937.64494320963126,0.98912158745120116,0.40589982749603642,384.77566916928379]
[null,null,null,null,null,594,1318.8675416729106,0.79936029752808735,0.3778855189912782,623.47472973951062]
[null,null,null,null,null,595,794.81084741703569,0.97028475899445521,0.4240460314808539,347.35821881239559]
[null,null,null,null,null,596,1038.4347991078187,0.9655375650344965,0.41565542226960056,447.03703983509638]
[null,null,null,null,null,597,1156.1504660110625,0.95423505790579499,0.42196486882893619,511.25231220024403]
[null,null,null,null,null,598,1168.1193078373055,0.92941320858579657,0.41142368846122579,517.0918056183765]
[null,null,null,null,null,599,794.50674996759244,0.91796338225446683,0.39565577629801318,342.44414429735775]
[null,null,null,null,null,600,1066.2964961791531,0.96684700208300711,0.38546432002372505,425.11302507828469]
[null,null,null,null,null,601,957.22593126205163,0.9885418492983461,0.41895628814803354,405.6842139412143]
[null,null,null,null,null,602,1050.8713181066778,0.91101470976239884,0.38815644863719356,447.74521688827548]
[null,null,null,null,null,603,724.58469632791343,0.8808316129000936,0.37834100205440901,311.22872529449756]
[null,null,null,null,null,604,897.10483129414524,0.91204146187279833,0.4068232016753624,400.16060120348027]
[null,null,null,null,null,605,1075.9584422699393,0.96683865836376492,0.40872469387153304,454.85436595959158]
[null,null,null,null,null,606,635.52862347666087,0.94320963661348056,0.379441264609231,255.66509843258476]
[null,null,null,null,null,607,1175.1134093725411,0.97092110702075107,0.42321742393908168,512.223358164454]
[null,null,null,null,null,608,1168.3350122584447,0.89633341698631575,0.40620245641249542,529.46877010092396]
[null,null,null,null,null,609,1013.5236430402043,0.9814751875194111,0.38163357444411489,394.09519017453971]
[null,null,null,null,null,610,1029.0656894064343,0.92124418302029909,0.43180607644904712,482.34423179107876]
[null,null,null,null,null,611,902.38981232909248,1.0228782762546762,0.39845069043042164,351.51576889133463]
[null,null,null,null,null,612,1048.8816928188314,0.80726664768942413,0.43354800611370542,563.30899817593183]
[null,null,null,null,null,613,1224.2047819319757,0.92845009644454646,0.39387376609470803,519.34094226193804]
[null,null,null,null,null,614,776.94155076129596,0.96694489326963173,0.42078368719255266,338.10027100611137]
[null,null,null,null,null,615,834.52526034979769,0.91772163210375535,0.41185686808668792,374.51984135864535]
[null,null,null,null,null,616,1184.8510868012359,0.80473360546631767,0.40721870747913291,599.56925477575328]
[null,null,null,null,null,617,1099.5709229885713,0.88081918323788033,0.38623687353199138,482.15893069065424]
[null,null,null,null,null,618,1065.2780807409877,0.97996428596616358,0.34173031567260359,371.48069580088003]
[null,null,null,null,null,619,994.0762610593564,0.92330632868621487,0.39039844100874671,420.32184823599033]
[null,null,null,null,null,620,1291.1869961298289,0.87372477209398425,0.38222831367769711,564.85548302639654]
[null,null,null,null,null,621,997.68703336192777,0.92077592116791096,0.38983966932162156,422.40242629168137]
[null,null,null,null,null,622,999.75690967931075,0.92643237095413877,0.38829585843971803,419.02839283903302]
[null,null,null,null,null,623,1422.2327542745695,0.81813421236849249,0.40163108447540091,698.18970388987236]
[null,null,null,null,null,624,1030.3358394059226,0.97741804862454218,0.38536705680236705,406.2309781455441]
[null,null,null,null,null,625,1231.9980493818848,1.0467662661537904,0.38572613775739367,453.98277024997196]
[null,null,null,null,null,626,808.03246718146988,0.86603003344947971,0.40704143114702096,379.78208509092133]
[null,null,null,null,null,627,1256.2186086848494,0.96437663674291885,0.43692897875997183,569.15347477280557]
[null,null,null,null,null,628,1038.1742531422719,0.91199818520265497,0.37550193140430088,427.45308435292026]
[null,null,null,null,null,629,1220.0355642391489,0.96646795826834153,0.41916268010098579,529.1364007983085]
[null,null,null,null,null,630,709.17883774340578,0.94849527246310616,0.42553325833417699,318.16624745310418]
[null,null,null,null,null,631,788.79267950225267,0.88397882276528905,0.42522089701762072,379.43344580318944]
[null,null,null,null,null,632,805.89110380482759,1.0357607972776468,0.3776103938364197,293.80611613883434]
[null,null,null,null,null,633,710.91417819537219,0.8895314351052428,0.43918277172547704,350.9951946800436]
[null,null,null,null,null,634,1078.1393125630382,0.82678626444520387,0.39892316909569403,520.20064893422671]
[null,null,null,null,null,635,834.90724756562327,1.0246256222152612,0.41568993768007456,338.72131848395549]
[null,null,null,null,null,636,1296.2433613926573,0.96599600822324194,0.3884815037027719,521.2925994640143]
[null,null,null,null,null,637,1130.5002048529648,0.92672472207740586,0.447752529114534,546.20785852428571]
[null,null,null,null,null,638,899.01025554907756,1.0019369460498186,0.41815933870209537,375.20278639182146]
[null,null,null,null,null,639,1183.9159841463452,0.84319859122473828,0.36483369958114575,512.25470842163793]
[null,null,null,null,null,640,954.61239423275254,0.97436942369180302,0.37502376302967216,367.41950600573171]
[null,null,null,null,null,641,1169.745496293998,0.89727949967037923,0.41365926416350979,539.27016212151216]
[null,null,null,null,null,642,758.99763525786796,0.90185752350700488,0.36874768151954868,310.3357359506299]
[null,null,null,null,null,643,1088.3047014693793,0.99789130994692443,0.42744551035643058,466.17397496689705]
[null,null,null,null,null,644,1166.5123987917189,0.92843658740092383,0.39402760917201224,495.0667582501527]
[null,null,null,null,null,645,738.46274411732725,0.8966352707278934,0.34921190203842611,287.60856044440351]
[null,null,null,null,null,646,1019.5570842320017,0.93560303745017936,0.41644365778124154,453.81220932276136]
[null,null,null,null,null,647,734.9991398707366,0.85509226704395902,0.37202500292802942,319.7760846414634]
[null,null,null,null,null,648,909.21923663722612,0.91933052602841969,0.37212290407230836,368.0300971159013]
[null,null,null,null,null,649,1062.874629175875,0.89075683473658085,0.4222887219657524,503.88607896254479]
[null,null,null,null,null,650,1142.9742835336801,0.89070482958570896,0.40227935766564477,516.21473841355794]
[null,null,null,null,null,651,737.1696798344401,0.93318901731332105,0.40643913725786335,321.06529666108219]
[null,null,null,null,null,652,854.96009158193885,0.85085212729381743,0.39436580210263394,396.26982347077302]
[null,null,null,null,null,653,849.29021561933871,0.85587312939381577,0.39145738059491031,388.44650188597819]
[null,null,null,null,null,654,1092.3839257149905,0.9020575467772538,0.39786013412135479,481.80519829329518]
[null,null,null,null,null,655,995.12033873891335,0.91512428066177676,0.39034488339703727,424.4670814658736]
[null,null,null,null,null,656,826.978962080016,0.91222596526992927,0.43737598260381999,396.50344311938795]
[null,null,null,null,null,657,1146.1933978800464,0.94441919992805679,0.34860098992814742,423.07923555612672]
[null,null,null,null,null,658,868.01827450307633,0.95959690111514795,0.4503866989033028,407.40428067959101]
[null,null,null,null,null,659,1340.4137345881256,0.8886185536942286,0.38937739940210675,587.34629378038369]
[null,null,null,null,null,660,888.78282658644127,0.93991635364674453,0.41553418930082409,392.92821098088461]
[null,null,null,null,null,661,1360.9746205859706,0.97139158861006769,0.3676913073087088,515.15634201986643]
[null,null,null,null,null,662,1104.814223790393,0.96681009053780798,0.41810302727318682,477.7837716653159]
[null,null,null,null,null,663,1175.8258974581986,0.93617327417610918,0.38619494736467269,485.0576630469638]
[null,null,null,null,null,664,1089.4516421981664,0.9528947264325609,0.40308700821351934,460.852380504851]
[null,null,null,null,null,665,1078.781275842387,0.86747352805468425,0.41487995628525887,515.94050318343716]
[null,null,null,null,null,666,1180.9934013020029,0.88830598261029692,0.40555009415983256,539.1745575018673]
[null,null,null,null,null,667,843.54456774720063,0.90778234205651642,0.44127836693481598,410.05200481091231]
[null,null,null,null,null,668,1009.1217209399397,0.96956401911238121,0.41116359902820998,427.9388575279981]
[null,null,null,null,null,669,1044.6577430052719,0.89904417557732597,0.40592751937141314,471.67351475021775]
[null,null,null,null,null,670,750.4467709313102,0.90566026998909244,0.38781853918559978,321.35358045753333]
[null,null,null,null,null,671,1295.3082016133476,0.95778450319377484,0.41111663975334739,555.99433224959296]
[null,null,null,null,null,672,1090.9212407084428,0.96617648630851949,0.40361072473045667,455.72161900614151]
[null,null,null,null,null,673,1070.9216275181893,0.89119196281261659,0.43226842006358129,519.4454385317905]
[null,null,null,null,null,674,995.0467362214398,0.96422207103400703,0.42543711200098983,439.0376682729239]
[null,null,null,null,null,675,850.91131280164734,1.0289027703560167,0.42457874248683275,351.13021907029679]
[null,null,null,null,null,676,467.55152783997448,0.99009793250240341,0.4149380638715166,195.94518820148892]
[null,null,null,null,null,677,950.26850455597355,0.94008827689465591,0.40561730729551582,410.00974216905666]
[null,null,null,null,null,678,870.38519273768657,0.84924733008282605,0.39260742582464081,402.37946931584639]
[null,null,null,null,null,679,869.37038963632961,0.92463034477385198,0.41864687014958479,393.62670139383357]
[null,null,null,null,null,680,1021.7660087390486,0.92391193263140281,0.38211180600222949,422.58232751576583]
[null,null,null,null,null,681,763.79682979563677,0.89580666468767967,0.40746348147092837,347.41795040506196]
[null,null,null,null,null,682,880.37013588702553,0.9703134517184534,0.42335776058172819,384.11456478530715]
[null,null,null,null,null,683,1229.8171721686269,0.96558923258855078,0.39377879765750601,501.53410068261582]
[null,null,null,null,null,684,1167.4129068203829,0.97782338959174764,0.4243095237602047,506.5786110222673]
[null,null,null,null,null,685,1028.8276738839675,0.87625228070926053,0.40170121982389789,471.64651172519962]
[null,null,null,null,null,686,1110.4898142963841,0.85837872202080634,0.39956105891852711,516.9145911188449]
[null,null,null,null,null,687,945.14808575237191,0.96268033074622994,0.39891796102655497,391.65290407899431]
[null,null,null,null,null,688,1103.6926012798679,0.9520802324950044,0.44658086955477094,517.69586719501262]
[null,null,null,null,null,689,1222.0839921974205,0.89625716733726812,0.39777653641216765,542.38488163533452]
[null,null,null,null,null,690,721.4168769075859,0.94470509820053528,0.39852461590509219,304.33029770314403]
[null,null,null,null,null,691,700.30954241151346,0.88651600804508701,0.36170446298242659,285.73097909196764]
[null,null,null,null,null,692,781.85933924169285,0.90259895042307192,0.37600055500609386,325.70339834073411]
[null,null,null,null,null,693,1198.7851951323619,0.86790698437738667,0.41321856842957094,570.7527547350212]
[null,null,null,null,null,694,832.20822104346234,0.92547921498107755,0.3950188581487783,355.20834600843625]
[null,null,null,null,null,695,827.56927960388566,0.95871758667519091,0.4011145981402513,346.24390293363109]
[null,null,null,null,null,696,1140.5481781356787,0.85970374655499837,0.34222016294970858,454.01521737885679]
[null,null,null,null,null,697,1354.5582936624094,1.0365087596566616,0.38741889628855908,506.29719642990358]
[null,null,null,null,null,698,909.67272870630381,0.94913349871181352,0.40197039420573222,385.25824433819002]
[null,null,null,null,null,699,628.87170306925623,0.92883245137709225,0.40080321112897649,271.36627020794731]
[null,null,null,null,null,700,1478.2349102465153,0.93250458658793667,0.40073570679497295,635.25855002406274]
[null,null,null,null,null,701,1195.2130894441043,1.0196301958899971,0.45434028269172744,532.57882624875936]
[null,null,null,null,null,702,877.44099757900233,0.95540495516877555,0.39219346925737736,360.18928627847845]
[null,null,null,null,null,703,881.02411728195,0.90950578972691809,0.37101907301882403,359.40040733475985]
[null,null,null,null,null,704,1173.8775681729576,0.88756233498448101,0.38262817761460644,506.05869238529391]
[null,null,null,null,null,705,887.62036250369863,0.93613483189053137,0.38400847418745815,364.10752965404254]
[null,null,null,null,null,706,1039.8426639473598,0.8883750605048456,0.37638122992515838,440.55408372534527]
[null,null,null,null,null,707,922.94398517177274,0.93564058492736646,0.35797847122453347,353.12071981498974]
[null,null,null,null,null,708,1161.8104776606056,0.8606877275427528,0.42332454884372511,571.43012565281219]
[null,null,null,null,null,709,967.8526069350678,0.83338003577211672,0.41599707777702905,483.12155189899829]
[null,null,null,null,null,710,1089.1605257944807,0.86585388945267794,0.42060223598364299,529.07697023091771]
[null,null,null,null,null,711,877.21233172704467,0.9260513637336516,0.36796536796747537,348.5592387965936]
[null,null,null,null,null,712,1078.7931248520977,1.0065997637218034,0.37816221394914373,405.28401772994346]
[null,null,null,null,null,713,1140.1680728112794,0.93296265345296925,0.41674378554580033,509.30008512477406]
[null,null,null,null,null,714,815.40430654716033,0.96813919965373763,0.38946438462214378,328.02197925795934]
[null,null,null,null,null,715,944.36556560847964,0.90949292314558183,0.43372220396029054,450.35239311516119]
[null,null,null,null,null,716,1023.2779915845678,0.95345028927503683,0.38408933296673575,412.21882844684137]
[null,null,null,null,null,717,1204.5345815325607,0.89799843638356636,0.39205695219575121,525.88750460621907]
[null,null,null,null,null,718,1170.1739631367202,0.91611869885001418,0.41939069951712049,535.69485872591804]
[null,null,null,null,null,719,1111.382115100738,0.90173155605344568,0.41534323450088001,511.90960253475976]
[null,null,null,null,null,720,1105.7997736600046,0.85865429402376336,0.36079624858801085,464.64381859244469]
[null,null,null,null,null,721,915.19852564536382,0.87563143877471339,0.37348474065770221,390.36136536997196]
[null,null,null,null,null,722,709.71133413345365,0.9135900638332487,0.35603099402240979,276.57834926565482]
[null,null,null,null,null,723,1036.2935377174529,0.92862522315869855,0.39832430267083502,444.50752626504351]
[null,null,null,null,null,724,729.63467429429249,0.90977376394152221,0.36558515646713102,293.19773457752586]
[null,null,null,null,null,725,1016.8331619889279,0.98157399382660371,0.39125673607165412,405.31108871196]
[null,null,null,null,null,726,1117.3765744755879,0.92603851287026917,0.40407934112408239,487.57020763868883]
[null,null,null,null,null,727,1012.0573889685284,0.90660929895062092,0.41141637127899183,459.2683739042493]
[null,null,null,null,null,728,1058.483546995807,0.95468614910421534,0.38505991546578561,426.92521045849821]
[null,null,null,null,null,729,976.83194396799615,0.9252289859274917,0.39953433670677407,421.81763514035362]
[null,null,null,null,null,730,1024.5108954723096,0.93184860182981299,0.38529848055878729,423.61225907971772]
[null,null,null,null,null,731,886.17500911706065,0.92329521396430181,0.39056618745665039,374.86384581605199]
[null,null,null,null,null,732,1011.4192350579735,0.98980186258170966,0.41460897449646172,423.66407630271027]
[null,null,null,null,null,733,887.58699864890627,0.94688611773712827,0.42294580767617612,396.45865853812472]
[null,null,null,null,null,734,1029.9217804756126,0.96947788049298267,0.41328318523571261,439.05009339888545]
[null,null,null,null,null,735,907.97295589994962,1.0050853449504364,0.40828191535803288,368.83329300399544]
[null,null,null,null,null,736,1037.3272215339396,0.88258331843613169,0.40844212832125532,480.05455040736399]
[null,null,null,null,null,737,753.11650975503176,0.97510575843319014,0.4254018957347756,328.55635215787618]
[null,null,null,null,null,738,1130.3606987613002,0.88874954543548867,0.42388763030065807,539.12367150426076]
[null,null,null,null,null,739,1250.5250503434586,1.0099064085146487,0.43318426743481364,536.39403936316057]
[null,null,null,null,null,740,1213.3171488780772,0.91611257175433281,0.39649622736750906,525.12724632652078]
[null,null,null,null,null,741,1113.1779230312336,0.93036862130758469,0.4011869654991731,480.01669743967739]
[null,null,null,null,null,742,766.95769226297352,0.90026952017420558,0.36411503890209007,310.19691736375989]
[null,null,null,null,null,743,1092.9728527988436,0.9879397386155061,0.35427487444607131,391.93971561556259]
[null,null,null,null,null,744,933.75330487593124,0.95405456047936976,0.40389528747135928,395.30082987151258]
[null,null,null,null,null,745,1360.7767472498499,0.9271937770754255,0.39429205781055426,578.67457392377321]
[null,null,null,null,null,746,1275.4016467839215,1.0198191769274221,0.39421868878851196,493.01599366732489]
[null,null,null,null,null,747,749.89306085663566,0.95171304497733999,0.39005029088931203,307.33634267876573]
[null,null,null,null,null,748,1070.4630155133218,0.91796337759686109,0.4212910863950125,491.27943200947863]
[null,null,null,null,null,749,747.02867484714841,0.94975313015498719,0.37050669823204635,291.42218015865996]
[null,null,null,null,null,750,1304.8825389209001,0.98055344618047524,0.43246535501926625,575.50814048029326]
[null,null,null,null,null,751,1086.1477571273956,0.8313857076711989,0.39246098295094256,512.72305075607972]
[null,null,null,null,null,752,1003.0941007129601,0.9923186954380353,0.42793218486537038,432.57902135379607]
[null,null,null,null,null,753,1103.8996182465398,0.96750471031287721,0.41034128313077911,468.1895405474321]
[null,null,null,null,null,754,1122.3265573978624,0.88096322426734908,0.35107444471668192,447.26063707928978]
[null,null,null,null,null,755,829.14208362768022,0.83932393542945538,0.36033566625011604,355.96442864115238]
[null,null,null,null,null,756,903.67592491028051,0.86862103745460228,0.41861463950150818,435.50864556660036]
[null,null,null,null,null,757,1106.4048550004766,0.94728159876353879,0.40345305564612383,471.2246285732773]
[null,null,null,null,null,758,1079.0109441178449,0.81371830136057288,0.39174397416967782,519.4623676455775]
[null,null,null,null,null,759,860.16239889843439,0.9094808159859914,0.40598586275514398,383.97046698310356]
[null,null,null,null,null,760,902.28379214262623,0.90319438712721889,0.44513737605566533,444.68859131135321]
[null,null,null,null,null,761,946.60192347348664,0.85803922413104672,0.41676740042313914,459.78413548765127]
[null,null,null,null,null,762,841.52239314952544,0.89966204960180052,0.41979883247024613,392.66980117489578]
[null,null,null,null,null,763,781.30551913560771,0.97620449125313635,0.38236600168625468,306.02672915773275]
[null,null,null,null,null,764,981.21700103167495,0.95797999470260675,0.39354576757238685,403.09171377421382]
[null,null,null,null,null,765,853.57382518567056,0.89683816346759482,0.3719809800169625,354.03625865087952]
[null,null,null,null,null,766,1168.6668311070266,0.96881873588903922,0.41861652557171519,504.96881435720053]
[null,null,null,null,null,767,989.46309846170698,0.90444817713602699,0.38892365241609811,425.48109655463378]
[null,null,null,null,null,768,1374.6854479998597,0.94360621603572625,0.36520513781774844,532.04629215142211]
[null,null,null,null,null,769,1027.0029738921353,0.93794399500265724,0.42778182301265028,468.40025284211799]
[null,null,null,null,null,770,868.67433404754775,0.87869089379323861,0.38248944127207779,378.12928644668909]
[null,null,null,null,null,771,852.95763289987008,0.85867071390126182,0.41043824610056789,407.70743566522873]
[null,null,null,null,null,772,960.87646215593998,0.8116969978819496,0.42708786887650624,505.58112392508974]
[null,null,null,null,null,773,1407.0897554515223,0.8040271147504745,0.43242229774293234,756.761773353526]
[null,null,null,null,null,774,824.46443000837417,0.99338327793262038,0.39052347723604686,324.11731022327979]
[null,null,null,null,null,775,712.81189294737851,1.0255229291649419,0.41024383378009105,285.14884983107328]
[null,null,null,null,null,776,1096.317318175197,0.93593915463380584,0.39202585641253107,459.20157675813641]
[null,null,null,null,null,777,1029.7986778046065,0.93934518216105656,0.38456005895068351,421.59096332702052]
[null,null,null,null,null,778,1073.3826613939177,0.93094178238208614,0.39138863413665098,451.27394827413951]
[null,null,null,null,null,779,999.34607515696712,0.90136782429016749,0.42509739178027284,471.30527470250786]
[null,null,null,null,null,780,962.09778441766036,0.91299735390731396,0.37548842570701429,395.68195997626947]
[null,null,null,null,null,781,1006.5372951294596,0.95500611249005063,0.41915157663964092,441.76857999378296]
[null,null,null,null,null,782,1005.6178300780998,0.92796671250079732,0.40692089741283899,440.97153955765475]
[null,null,null,null,null,783,1191.7078415001447,0.96767459171904036,0.42503120603864059,523.43321345113429]
[null,null,null,null,null,784,782.93760087755732,0.84699572098859977,0.38977427302035011,360.29572126546128]
[null,null,null,null,null,785,1126.7299372736127,0.86084795629549637,0.40082403185523013,524.62276638660671]
[null,null,null,null,null,786,1078.6725611684822,1.0058669518175298,0.39315967751381908,421.61694996112993]
[null,null,null,null,null,787,874.72713815717884,0.83506769697636618,0.41789063184896474,437.73729696825467]
[null,null,null,null,null,788,1208.7798558810421,0.93053615314419469,0.45644018929791319,592.92237531404203]
[null,null,null,null,null,789,810.54061983604129,0.94424990604491987,0.40890568606362387,351.00312545937857]
[null,null,null,null,null,790,822.95973878229415,0.98504599591064312,0.36161671960565606,302.11381229042303]
[null,null,null,null,null,791,839.67793367895342,0.88680965218784658,0.41486413808647299,392.81514512898048]
[null,null,null,null,null,792,967.84689214297532,0.98428531505074901,0.39594304538170527,389.33045132198316]
[null,null,null,null,null,793,718.59257071399372,0.96100907464847707,0.42523575339666531,317.96916517628625]
[null,null,null,null,null,794,872.81212735270037,0.91024544998442813,0.40990640703485764,393.04924088960456]
[null,null,null,null,null,795,1083.0883144111635,0.91178098232930371,0.371812495590786,441.66941067102579]
[null,null,null,null,null,796,1094.1377349625318,0.89084836157592573,0.41908778251571704,514.72256883433261]
[null,null,null,null,null,797,979.16102674700562,0.93412175676172426,0.37699747645522674,395.17464768898475]
[null,null,null,null,null,798,1185.1443847226587,0.8777692554807639,0.38860502590070339,524.68580033481805]
[null,null,null,null,null,799,1055.8422665943717,0.89777248852125024,0.35799592675894842,421.02786126061369]
[null,null,null,null,null,800,1190.4111730679124,0.88862584912735854,0.38075637714091876,510.06466445975337]
[null,null,null,null,null,801,940.8383060966388,0.94446775037997632,0.40896554578070171,407.39395409679446]
[null,null,null,null,null,802,1114.0848102479672,0.88351385137394756,0.41032383654920374,517.40621029455122]
[null,null,null,null,null,803,848.2417798561612,0.92677744560931674,0.43282203325068447,396.14443962233645]
[null,null,null,null,null,804,786.13058462681158,0.92211689576220324,0.3892586951686185,331.85398403424301]
[null,null,null,null,null,805,772.60663425265091,0.90519096087961093,0.43325749574516897,369.79778855406272]
[null,null,null,null,null,806,601.61935941059892,0.94673778058637659,0.39593135132048818,251.60078200795164]
[null,null,null,null,null,807,890.0814656712638,0.91136592135870509,0.40762465486613408,398.10480263085179]
[null,null,null,null,null,808,879.54816296033607,0.92275997440406154,0.45123978071339849,430.10872945308756]
[null,null,null,null,null,809,649.83646888475505,0.97781485042419525,0.40407203230690741,268.5383051152217]
[null,null,null,null,null,810,692.18343046644395,0.87420563687742425,0.42027787695977448,332.769968931189]
[null,null,null,null,null,811,1078.0382480009876,0.90263026853220096,0.41753855367717552,498.67874651596691]
[null,null,null,null,null,812,971.96958897016873,0.94176587888641872,0.4169104304793943,430.28131389681073]
[null,null,null,null,null,813,914.03560515593165,0.89604204838981671,0.36676431605005233,374.12936610823988]
[null,null,null,null,null,814,954.45302088002597,0.95675581148307776,0.41106562452334761,410.07624139545976]
[null,null,null,null,null,815,760.85962927879677,0.90806171367541566,0.40073138323758484,335.77049565985124]
[null,null,null,null,null,816,1127.0150570002888,0.83621084166173321,0.41474603688977657,558.97987100609703]
[null,null,null,null,null,817,1187.983704001148,0.88152964222073127,0.4016136961225964,541.23027002856827]
[null,null,null,null,null,818,1045.3191479677407,0.90395071681300343,0.41271579617377424,477.26022711749607]
[null,null,null,null,null,819,1076.5018376663108,0.85285458139535464,0.38324774629514002,483.74824051855347]
[null,null,null,null,null,820,1092.2901733636911,0.97767234910655354,0.42484405822822813,474.65082799848079]
[null,null,null,null,null,821,1212.9276567230572,0.88481975986415662,0.41807617163908273,573.10672093917981]
[null,null,null,null,null,822,1010.6069201106972,0.88656062062748953,0.39076653780750742,445.44203528513953]
[null,null,null,null,null,823,798.25622849005947,1.0229177507668268,0.41042544823401572,320.28447070942394]
[null,null,null,null,null,824,689.02417442517549,0.87167506637093684,0.42486443637348964,335.83829434704336]
[null,null,null,null,null,825,1035.6735266157243,0.91884618955938802,0.41534401214509542,468.15321509175448]
[null,null,null,null,null,826,985.01344039402966,0.94444607129444091,0.39578470673510308,412.78508904395147]
[null,null,null,null,null,827,1215.1085867977465,0.89128485728884355,0.40769567323886358,555.82063276576696]
[null,null,null,null,null,828,930.76200618775169,0.89701096165557648,0.42815724061517624,444.26713749771255]
[null,null,null,null,null,829,1029.3451082453037,0.89696862908351849,0.38619148707217438,443.18642277366405]
[null,null,null,null,null,830,658.75211582862596,0.96789536219143557,0.40736360247410819,277.25273363621517]
[null,null,null,null,null,831,993.31909203422049,0.98087123744871774,0.39727238110344187,402.31401005738564]
[null,null,null,null,null,832,740.33198261377788,0.9165995366697266,0.41297676840376407,333.55887439855348]
[null,null,null,null,null,833,825.03014910376726,0.97073156234321523,0.40073946793856013,340.59070067428047]
[null,null,null,null,null,834,1323.6155652051859,0.99845426241510771,0.41047413600319693,544.15107028918715]
[null,null,null,null,null,835,1051.5268546825948,0.88246953760067026,0.40927553943220668,487.68167323687993]
[null,null,null,null,null,836,791.4978185138641,0.92809633958725313,0.39821610982946631,339.60610421895564]
[null,null,null,null,null,837,1146.9076418772065,0.97975755191129299,0.39418522981775478,461.43461870864797]
[null,null,null,null,null,838,1001.4157041489156,0.96384090218626206,0.42336768881252962,439.87244289428043]
[null,null,null,null,null,839,920.55628375888057,0.93668781366232323,0.3838500881085653,377.23946599472333]
[null,null,null,null,null,840,1188.5030979412174,0.8564436089125973,0.38991002651627804,541.08556548319234]
[null,null,null,null,null,841,877.54228320262678,0.84331748494527237,0.38246698784692329,397.98884732788548]
[null,null,null,null,null,842,742.21879683935913,1.0033943351852408,0.38285079528866561,283.19778843049318]
[null,null,null,null,null,843,1121.2508157831007,0.96314708928391801,0.40694910123225325,473.75111944542988]
[null,null,null,null,null,844,1177.9564710768486,0.97049037884271094,0.39479817633705616,479.19595775915093]
[null,null,null,null,null,845,1022.0121484150035,0.92851228264914054,0.37244720622339456,409.95210996834265]
[null,null,null,null,null,846,1270.9603404944173,0.95986924023465259,0.37148931391491635,491.88802506882786]
[null,null,null,null,null,847,974.345650431237,0.98537739784721623,0.3777018786001079,373.47333455966168]
[null,null,null,null,null,848,834.14680472372947,0.94439573144603284,0.37874858722751814,334.53340936401173]
[null,null,null,null,null,849,1088.4702996829196,0.91942502132772885,0.41124088447099461,486.85154132047177]
[null,null,null,null,null,850,1291.3202233013908,0.89870185460480967,0.42565029251960246,611.60531489769301]
[null,null,null,null,null,851,952.49396072003674,0.89881957483688746,0.40359440226629173,427.69565939729171]
[null,null,null,null,null,852,692.35430403488294,0.86902601720102535,0.36590112800974811,291.51396599690764]
[null,null,null,null,null,853,810.87120754184696,0.8971148763686656,0.4085032893137826,369.23203952596168]
[null,null,null,null,null,854,1067.0558678326761,0.86385717574539156,0.40556338687107951,500.96104297040415]
[null,null,null,null,null,855,975.9134902740692,0.93003267955987234,0.39310206421958049,412.49476062284441]
[null,null,null,null,null,856,980.3360113935986,0.87253975038764597,0.36639863137513945,411.66465218667406]
[null,null,null,null,null,857,997.78934544550725,0.89385036515351657,0.38210745112015321,426.53978608326452]
[null,null,null,null,null,858,773.65485321225503,0.9787371814937369,0.39414361817385896,311.55567483137992]
[null,null,null,null,null,859,872.37276469258745,0.88872179674176766,0.41377873401232063,406.16681112662337]
[null,null,null,null,null,860,1139.0080066164955,0.92730238906602724,0.4033202106163995,495.39929427445969]
[null,null,null,null,null,861,1141.220651537539,0.91244515606037913,0.39448091763506848,493.38830597378802]
[null,null,null,null,null,862,779.20571203846623,0.88960089822875965,0.38901319633815623,340.73853258080396]
[null,null,null,null,null,863,1058.5831133477418,0.98730240328833685,0.39387577304962862,422.31259715201583]
[null,null,null,null,null,864,1169.3235642144641,0.97570584981088559,0.40590554147933505,486.45287366988043]
[null,null,null,null,null,865,908.43451944869366,0.81907317610938213,0.40042648600878933,444.1132404308471]
[null,null,null,null,null,866,1151.7772871219049,0.88902613029315347,0.40268539398302572,521.69882846125904]
[null,null,null,null,null,867,997.82144582744934,0.9446950106823927,0.39003901707313726,411.97348513983081]
[null,null,null,null,null,868,1059.7415068570494,0.95097509207984154,0.39185365588647514,436.67135681584438]
[null,null,null,null,null,869,1103.0955053292478,0.8631862425960205,0.39912316388141933,510.0532728907653]
[null,null,null,null,null,870,1173.2899159221988,0.89221540549244982,0.37575134666617854,494.12424760171251]
[null,null,null,null,null,871,1048.1476718542542,0.89542311997138568,0.36450951043965923,426.68073474389621]
[null,null,null,null,null,872,915.32459542824222,0.93926033426225153,0.37456933281235899,365.02395609583044]
[null,null,null,null,null,873,1058.2089645154263,0.94659906874234434,0.40943390785593342,457.70870263518395]
[null,null,null,null,null,874,966.66887398566394,0.88231547238875019,0.41908453089163561,459.1509321320533]
[null,null,null,null,null,875,913.89129058358822,0.94040606768257073,0.38008959435877465,369.37295692054477]
[null,null,null,null,null,876,1047.9078679521797,0.87054814701134908,0.42811651464298023,515.33814141677203]
[null,null,null,null,null,877,875.65778864353683,0.96976154225287003,0.40778899206305502,368.2179499442351]
[null,null,null,null,null,878,622.28142763938945,0.90000864783978296,0.40718367981090831,281.53378547235758]
[null,null,null,null,null,879,684.25853228058622,0.89313368603200038,0.45689877175175925,350.04489008654389]
[null,null,null,null,null,880,899.71354055933716,0.90352013553287691,0.39634863716368951,394.67879199847158]
[null,null,null,null,null,881,923.54771668289345,0.94664022260541991,0.38717479504556884,377.72998588350401]
[null,null,null,null,null,882,1016.4940367502555,0.8636296198339285,0.40439783094904608,475.97717145631191]
[null,null,null,null,null,883,917.60638281114677,0.927561006650651,0.40169575636928651,397.38474057203939]
[null,null,null,null,null,884,1160.2100849566814,0.96994553666752603,0.420519157700466,503.00820946898881]
[null,null,null,null,null,885,771.68303626170643,0.87481882568635938,0.40863503369217019,360.45946230646541]
[null,null,null,null,null,886,1234.4957144734913,0.97340716336170863,0.4118797774915795,522.35471376196347]
[null,null,null,null,null,887,718.56966163273523,0.90369053856142667,0.40244760273852914,320.00626916497635]
[null,null,null,null,null,888,1187.3606557832777,0.86960186361973157,0.39316892166584111,536.83568100872753]
[null,null,null,null,null,889,789.12321056849419,0.89925765985265449,0.42109517956974291,369.52254608700201]
[null,null,null,null,null,890,747.70939955773201,0.87003066799776674,0.37261279443285661,320.22559553456455]
[null,null,null,null,null,891,1088.8462004161636,0.86409054809679764,0.43142122734879512,543.63673484481944]
[null,null,null,null,null,892,957.46385937602429,0.90360278227956148,0.40225797466079943,426.23537735450776]
[null,null,null,null,null,893,1260.7001749353983,0.91874405109112212,0.39933287228353742,547.96438828356452]
[null,null,null,null,null,894,1099.4951007574432,0.94626104549770618,0.39239489347514978,455.9378883775596]
[null,null,null,null,null,895,956.09871902798523,0.90461963678332424,0.41333746495839635,436.85921099196111]
[null,null,null,null,null,896,1090.0296799898913,0.92387292283030897,0.38780425877084784,457.55010417633639]
[null,null,null,null,null,897,973.12366922636386,0.88168903439161217,0.37850707106537745,417.75974913584366]
[null,null,null,null,null,898,773.47234737043925,0.82090477534105788,0.38443642336405809,362.22342922850561]
[null,null,null,null,null,899,1059.7008928877879,0.96624528338612359,0.36407592847864656,399.28949007205352]
[null,null,null,null,null,900,874.05378538017476,0.92527734288041208,0.40951056583422885,386.83997071226929]
[null,null,null,null,null,901,965.62106438515684,0.95451420502153905,0.42195445429529765,426.86437471036805]
[null,null,null,null,null,902,1023.0783813352565,0.96024371682400089,0.38170276047955276,406.67992458647376]
[null,null,null,null,null,903,1226.1316718350968,0.8476689114100846,0.40287779587603639,582.75255675118831]
[null,null,null,null,null,904,897.56581513873175,0.89291671114647431,0.43883094614702189,441.11578489871096]
[null,null,null,null,null,905,1080.7638454691833,0.83839380977435396,0.42601165810989539,549.16674296232077]
[null,null,null,null,null,906,794.20142465853405,0.93976056097119987,0.37915180723542563,320.42513590593336]
[null,null,null,null,null,907,965.65713182841955,0.97971022409920494,0.401423890587289,395.66581351985036]
[null,null,null,null,null,908,1082.2407954100049,0.91326873635482042,0.38990906651804463,462.04964813567921]
[null,null,null,null,null,909,838.12654366757204,0.92156840733226486,0.44829176217254779,407.70193747414095]
[null,null,null,null,null,910,873.04212493855732,0.87212487087021229,0.38226126548669037,382.66330734176154]
[null,null,null,null,null,911,1071.5976932581118,0.92461514053944749,0.39404241849782545,456.68184328212647]
[null,null,null,null,null,912,968.9247656924573,0.79151352759813498,0.36241818171031215,443.65123216774452]
[null,null,null,null,null,913,837.58468759413745,0.84861743310941673,0.38986050946270318,384.79199257918947]
[null,null,null,null,null,914,995.78677006566625,0.81703412180344148,0.38072214174785157,464.01742804418933]
[null,null,null,null,null,915,878.26986856753922,0.91806819932300765,0.40462305178579794,387.08260973788367]
[null,null,null,null,null,916,1200.9659820959944,0.87407328069148138,0.38489940805484335,528.84707245262541]
[null,null,null,null,null,917,946.6506562917034,0.83833211225638526,0.37258350357617787,420.72397445749232]
[null,null,null,null,null,918,808.31175814191397,0.91151291363004594,0.38862973948441176,344.6292238887313]
[null,null,null,null,null,919,838.46124242188898,0.84933640518308096,0.37633485277893924,371.51614637273263]
[null,null,null,null,null,920,801.60525467617663,0.98407219404964263,0.38067104029483079,310.08691033900851]
[null,null,null,null,null,921,830.33774993607915,0.89963848287453441,0.37928956348033444,350.07222201989839]
[null,null,null,null,null,922,569.46516026120776,0.90023171284343417,0.40502778263182221,256.21093753535223]
[null,null,null,null,null,923,1223.1697031120191,0.99628818416143217,0.43065031397049808,528.72093141178857]
[null,null,null,null,null,924,966.15633832627339,0.83235675112060981,0.38007877226070147,441.17563098822609]
[null,null,null,null,null,925,691.02303098063533,0.88885094266341835,0.41843142026495023,325.30285384251306]
[null,null,null,null,null,926,779.47322571903669,0.87813380782854211,0.39534205164819913,350.92435971987146]
[null,null,null,null,null,927,1474.5571036407957,0.98648460386894055,0.39438226663248938,589.50658786982547]
[null,null,null,null,null,928,971.12352672089639,0.88990028837384039,0.4137746997392826,451.5408646658264]
[null,null,null,null,null,929,973.0560184399244,0.89022027683543514,0.37846998366681139,413.6869323118429]
[null,null,null,null,null,930,877.99707418467483,0.9122187334504005,0.40236998350610953,387.27517349029392]
[null,null,null,null,null,931,724.62696563197585,1.0200299653471456,0.38358513837076569,272.49800919773281]
[null,null,null,null,null,932,1109.713714758298,0.95330423465129321,0.41348877847950738,481.33025292309566]
[null,null,null,null,null,933,873.43202559880524,0.92193350901944626,0.37450897521192844,354.8066423707653]
[null,null,null,null,null,934,1041.5966650925598,0.94486465955711274,0.37042599901928208,408.34894324750866]
[null,null,null,null,null,935,805.25722430497126,0.87306464946661777,0.37466981236173696,345.57071268158433]
[null,null,null,null,null,936,892.71445681535124,0.99838374832991084,0.40743438146845518,364.31138141916176]
[null,null,null,null,null,937,1045.4371918397203,0.86254776436269187,0.37634749785696192,456.14595222583756]
[null,null,null,null,null,938,1099.9988053158754,0.94586259946669937,0.42389021001650096,492.96665801792568]
[null,null,null,null,null,939,757.58947597367137,0.90905000840487815,0.40853198233243565,340.46480122342001]
[null,null,null,null,null,940,950.68154079986698,0.93365025400596191,0.38956236702754177,396.66861304256855]
[null,null,null,null,null,941,908.1125908392047,0.94207705419491816,0.39963381138931836,385.22591568461286]
[null,null,null,null,null,942,943.41066690216655,1.013049037697703,0.39058540493688998,363.73603215811988]
[null,null,null,null,null,943,822.64992672391406,0.91333303226145468,0.38802068261236911,349.49484453448684]
[null,null,null,null,null,944,749.07629352379786,0.96081627230901923,0.37073740328262433,289.03611223631322]
[null,null,null,null,null,945,1121.8048914831363,0.86581846440766608,0.39349187099502358,509.83101399097427]
[null,null,null,null,null,946,818.06974736476855,0.95556321127481503,0.37429964262217247,320.44265671356129]
[null,null,null,null,null,947,850.46572344710455,0.89673905873169957,0.4085488442546964,387.46699500741425]
[null,null,null,null,null,948,1098.0304506453899,0.93970063832331807,0.40813746491143671,476.90439512905823]
[null,null,null,null,null,949,1159.2459535993062,0.96491500385319029,0.37061361300407897,445.25406850152513]
[null,null,null,null,null,950,1043.2083812973622,0.94445976954349198,0.41048136472616431,453.39951351839431]
[null,null,null,null,null,951,898.45804728737323,0.84929557477702389,0.41045507225771594,434.21474651705876]
[null,null,null,null,null,952,923.16015062610757,0.93022043697541101,0.40477640657737873,401.70419140742337]
[null,null,null,null,null,953,1111.1779645634226,1.00325148910155,0.37837014268310803,419.0739506150195]
[null,null,null,null,null,954,833.46971348140585,0.87781752329003393,0.40798232273077661,387.37083802728796]
[null,null,null,null,null,955,1079.9208456188962,0.93181015947275558,0.40688982175992272,471.56472369578756]
[null,null,null,null,null,956,855.34423591989014,0.88573961756413533,0.36373084918349224,351.24892136014171]
[null,null,null,null,null,957,927.9855168530612,0.9500459823974533,0.3684767272359441,359.92054332936533]
[null,null,null,null,null,958,1236.571667404171,0.85815581234430982,0.42832952988452988,617.20745038227062]
[null,null,null,null,null,959,783.80108112167716,0.82253634072048365,0.39217544965999762,373.70694304355754]
[null,null,null,null,null,960,1027.3104634586855,0.97787615625787783,0.4098169760033849,430.53434206064134]
[null,null,null,null,null,961,900.54344029964523,0.91157149595789821,0.38346103429485678,378.8219800377563]
[null,null,null,null,null,962,1076.1415785961542,0.85276564181193204,0.39004624783711311,492.21610755925343]
[null,null,null,null,null,963,992.66319384170333,0.97733851248191217,0.42278246705173633,429.41170196812277]
[null,null,null,null,null,964,953.86723217721908,1.0087864278614505,0.37050826287272731,350.33747624302595]
[null,null,null,null,null,965,875.35917197545098,0.93224820636728478,0.39897562967605632,374.628746342711]
[null,null,null,null,null,966,1194.0703661761927,0.88682463272001744,0.40226082262502233,541.6265065810851]
[null,null,null,null,null,967,1288.1401109866629,0.90071653855494271,0.39823322731271094,569.52456369033484]
[null,null,null,null,null,968,1008.2784961101233,0.94571936305779669,0.38287790183575299,408.20519293222878]
[null,null,null,null,null,969,1016.3200002153131,0.99746618524287378,0.42846374166451268,436.56243836947897]
[null,null,null,null,null,970,1035.3611057621865,0.98939317371793667,0.41909928948527841,438.57094966103881]
[null,null,null,null,null,971,1198.6544425362279,0.98190252350393981,0.39464285259252918,481.75903121946374]
[null,null,null,null,null,972,895.73246465289276,0.95433809269562642,0.39173746667100046,367.68098140876373]
[null,null,null,null,null,973,811.78620282885072,0.87610675022269635,0.42451125718730193,393.34519616768728]
[null,null,null,null,null,974,1223.691724622628,1.0192195551647465,0.40690009263008592,488.53092896077061]
[null,null,null,null,null,975,1228.8459245331703,0.90095020421117589,0.36243259160973512,494.33787909240061]
[null,null,null,null,null,976,1082.7297300662478,0.84213267267513525,0.41122442212763433,528.71111882232105]
[null,null,null,null,null,977,771.61670993176881,0.93933470225796201,0.36077834131914965,296.36145249840132]
[null,null,null,null,null,978,874.49276091523507,0.95266093198274115,0.40366342043273468,370.54184459944304]
[null,null,null,null,null,979,1041.1793975679723,0.91153282370974797,0.41069097599650933,469.10322025968679]
[null,null,null,null,null,980,1083.2129357816771,0.97098565685972549,0.38150521023620798,425.59987974741995]
[null,null,null,null,null,981,724.79852664353962,0.90013960261604731,0.41618706552434426,335.11665415393566]
[null,null,null,null,null,982,926.65365354019252,0.84963039151207076,0.39893047541608956,435.09552653236676]
[null,null,null,null,null,983,965.20559594329529,0.98032264473782438,0.40283889350048385,396.62692314351062]
[null,null,null,null,null,984,594.83750854045923,0.92520186372441815,0.39194138582383015,251.98980522891142]
[null,null,null,null,null,985,1146.8496047324654,0.90858951057897919,0.42104509150970787,531.45605485226349]
[null,null,null,null,null,986,1032.3675224393378,0.90266215870932298,0.36271350299628508,414.83254485707363]
[null,null,null,null,null,987,894.45224772045401,0.98346602166329855,0.41865560658442047,380.76297511212692]
[null,null,null,null,null,988,773.00402191857211,0.90820793173742898,0.42743916082538169,363.80676593677288]
[null,null,null,null,null,989,821.77078070801474,0.86055325538717731,0.39315534446615014,375.43704859511104]
[null,null,null,null,null,990,1026.3225879742542,0.9072651908517112,0.39671369727493083,448.77311791254419]
[null,null,null,null,null,991,1249.5585134219627,0.94089372366819946,0.37159843881261434,493.5031248612699]
[null,null,null,null,null,992,1018.378582035465,0.91098670283906213,0.43847442716721002,490.16408692437534]
[null,null,null,null,null,993,1023.7680247722964,0.94972787588255148,0.3461229011240135,373.10641059461642]
[null,null,null,null,null,994,821.67084454931114,0.93195093263534567,0.4037869327935415,356.00581368403891]
[null,null,null,null,null,995,793.99767106896309,0.89961303926094516,0.37482694347510059,330.82192807879187]
[null,null,null,null,null,996,1286.1158454713122,0.88617826179598425,0.39968777126716526,580.06926825988648]
[null,null,null,null,null,997,985.51762426623043,0.88996172476192925,0.38577255075267353,427.19325690843709]
[null,null,null,null,null,998,897.61874423335826,0.9142810939111472,0.37890894109939827,372.00350106056874]
[null,null,null,null,null,999,1117.2675914825513,0.91014201095247871,0.36122832537072047,443.4348664334899]
[null,null,null,null,null,1000,1161.2269506134671,0.90624145785132637,0.33916220471660508,434.59090216441632]
[]
[]
[null,null,null,"Chart Data"]
[]
[null,null,null,null,null,null,{"$f":"G31","v":1030.7159789326049},{"$f":"H31","v":0.91735289925008412},{"$f":"I31","v":0.41579367461890171},{"$f":"J31","v":467.17591966968104}]
[null,null,null,null,null,"MIN",{"$f":"MIN(G$32:G$1031)","v":426.6386690701039},{"$f":"MIN(H$32:H$1031)","v":0.74831700127295298},{"$f":"MIN(I$32:I$1031)","v":0.3352198080875689},{"$f":"MIN(J$32:J$1031)","v":185.65386824364199}]
[null,null,null,null,null,"MAX",{"$f":"MAX(G$32:G$1031)","v":1533.5698397202273},{"$f":"MAX(H$32:H$1031)","v":1.0544063967902766},{"$f":"MAX(I$32:I$1031)","v":0.46877474197640767},{"$f":"MAX(J$32:J$1031)","v":756.761773353526}]
[]
[null,null,null,null,null,"Chart Min",{"$f":"IF(MROUND(G1037,50)>G1037,MROUND(G1037,50)-50,MROUND(G1037,50))","v":400},{"$f":"IF(MROUND(H1037,0.02)>H1037,MROUND(H1037,0.02)-0.02,MROUND(H1037,0.02))","v":0.74},{"$f":"IF(MROUND(I1037,0.01)>I1037,MROUND(I1037,0.01)-0.01,MROUND(I1037,0.01))","v":0.33},{"$f":"IF(MROUND(J1037,50)>J1037,MROUND(J1037,50)-50,MROUND(J1037,50))","v":150}]
[null,null,null,null,null,"Chart Max",{"$f":"IF(MROUND(G1038,50)<G1038,MROUND(G1038,50)+50,MROUND(G1038,50))","v":1550},{"$f":"IF(MROUND(H1038,0.02)<H1038,MROUND(H1038,0.02)+0.02,MROUND(H1038,0.02))","v":1.06},{"$f":"IF(MROUND(I1038,0.01)<I1038,MROUND(I1038,0.01)+0.01,MROUND(I1038,0.01))","v":0.47000000000000003},{"$f":"IF(MROUND(J1038,50)<J1038,MROUND(J1038,50)+50,MROUND(J1038,50))","v":800}]
[null,null,null,null,null,"Interval",50,0.01,5.0000000000000001E-3,25]
[null,null,null,null,null,"No. Reqd",{"$f":"(G1041-G1040)/G1042+1","v":24},{"$f":"(H1041-H1040)/H1042+1","v":33.000000000000007},{"$f":"(I1041-I1040)/I1042+1","v":29.000000000000004},{"$f":"(J1041-J1040)/J1042+1","v":27}]
[null,null,null,null,null,null,null,null,null,null,null,null,null,null,null,1]
[]
[null,null,null,null,null,null,{"$f":"G12","v":"Sales (US$)"},null,{"$f":"G13","v":"Foreign Exchange (US$:A$)"},null,{"$f":"G14","v":"Gross Margin (%)"},null,"Gross Profit (A$)",null,null,{"$f":"INDEX(LU_Simulation_Outputs,DD_Simulations_Outputs)","v":"Sales (US$)"}]
[null,null,null,null,null,null,"Stratification","Count",{"$f":"G1047","v":"Stratification"},"Count","Stratification","Count","Stratification","Count",null,{"$f":"K1047","v":"Stratification"},{"$f":"N1047","v":"Count"}]
[null,null,null,null,null,{"$f":"N(F1047)+1","v":1},{"$f":"G$1040+IF($F1048<=G$1043,($F1048-1)*G$1042,-G$1040)","v":400},{"$f":"IF(G1048,SUMPRODUCT(--(G$32:G$1031<=G1048))-SUM(H$1047:H1047),)","v":0},{"$f":"H$1040+IF($F1048<=H$1043,($F1048-1)*H$1042,-H$1040)","v":0.74},{"$f":"IF(I1048,SUMPRODUCT(--(H$32:H$1031<=I1048))-SUM(J$1047:J1047),)","v":0},{"$f":"I$1040+IF($F1048<=I$1043,($F1048-1)*I$1042,-I$1040)","v":0.33},{"$f":"IF(K1048,SUMPRODUCT(--(I$32:I$1031<=K1048))-SUM(L$1047:L1047),)","v":0},{"$f":"J$1040+IF($F1048<=J$1043,($F1048-1)*J$1042,-J$1040)","v":150},{"$f":"IF(M1048,SUMPRODUCT(--(J$32:J$1031<=M1048))-SUM(N$1047:N1047),)","v":0},null,{"$f":"OFFSET(E1048,,2*DD_Simulations_Outputs)","v":400},{"$f":"OFFSET(F1048,,2*DD_Simulations_Outputs)","v":0}]
[null,null,null,null,null,{"$f":"N(F1048)+1","v":2},{"$f":"G$1040+IF($F1049<=G$1043,($F1049-1)*G$1042,-G$1040)","v":450},{"$f":"IF(G1049,SUMPRODUCT(--(G$32:G$1031<=G1049))-SUM(H$1047:H1048),)","v":1},0.75,{"$f":"IF(I1049,SUMPRODUCT(--(H$32:H$1031<=I1049))-SUM(J$1047:J1048),)","v":1},0.33500000000000002,{"$f":"IF(K1049,SUMPRODUCT(--(I$32:I$1031<=K1049))-SUM(L$1047:L1048),)","v":0},175,{"$f":"IF(M1049,SUMPRODUCT(--(J$32:J$1031<=M1049))-SUM(N$1047:N1048),)","v":0},null,450,1]
[null,null,null,null,null,3,500,{"$f":"IF(G1050,SUMPRODUCT(--(G$32:G$1031<=G1050))-SUM(H$1047:H1049),)","v":1},0.76,{"$f":"IF(I1050,SUMPRODUCT(--(H$32:H$1031<=I1050))-SUM(J$1047:J1049),)","v":0},0.34,{"$f":"IF(K1050,SUMPRODUCT(--(I$32:I$1031<=K1050))-SUM(L$1047:L1049),)","v":3},200,{"$f":"IF(M1050,SUMPRODUCT(--(J$32:J$1031<=M1050))-SUM(N$1047:N1049),)","v":2},null,500,1]
[null,null,null,null,null,4,550,{"$f":"IF(G1051,SUMPRODUCT(--(G$32:G$1031<=G1051))-SUM(H$1047:H1050),)","v":2},0.77,{"$f":"IF(I1051,SUMPRODUCT(--(H$32:H$1031<=I1051))-SUM(J$1047:J1050),)","v":0},0.34500000000000003,{"$f":"IF(K1051,SUMPRODUCT(--(I$32:I$1031<=K1051))-SUM(L$1047:L1050),)","v":5},225,{"$f":"IF(M1051,SUMPRODUCT(--(J$32:J$1031<=M1051))-SUM(N$1047:N1050),)","v":1},null,550,2]
[null,null,null,null,null,5,600,{"$f":"IF(G1052,SUMPRODUCT(--(G$32:G$1031<=G1052))-SUM(H$1047:H1051),)","v":4},0.78,{"$f":"IF(I1052,SUMPRODUCT(--(H$32:H$1031<=I1052))-SUM(J$1047:J1051),)","v":2},0.35000000000000003,{"$f":"IF(K1052,SUMPRODUCT(--(I$32:I$1031<=K1052))-SUM(L$1047:L1051),)","v":7},250,{"$f":"IF(M1052,SUMPRODUCT(--(J$32:J$1031<=M1052))-SUM(N$1047:N1051),)","v":2},null,600,4]
[null,null,null,null,null,6,650,{"$f":"IF(G1053,SUMPRODUCT(--(G$32:G$1031<=G1053))-SUM(H$1047:H1052),)","v":12},0.79,{"$f":"IF(I1053,SUMPRODUCT(--(H$32:H$1031<=I1053))-SUM(J$1047:J1052),)","v":1},0.35500000000000004,{"$f":"IF(K1053,SUMPRODUCT(--(I$32:I$1031<=K1053))-SUM(L$1047:L1052),)","v":6},275,{"$f":"IF(M1053,SUMPRODUCT(--(J$32:J$1031<=M1053))-SUM(N$1047:N1052),)","v":17},null,650,12]
[null,null,null,null,null,7,700,{"$f":"IF(G1054,SUMPRODUCT(--(G$32:G$1031<=G1054))-SUM(H$1047:H1053),)","v":13},0.8,{"$f":"IF(I1054,SUMPRODUCT(--(H$32:H$1031<=I1054))-SUM(J$1047:J1053),)","v":3},0.36,{"$f":"IF(K1054,SUMPRODUCT(--(I$32:I$1031<=K1054))-SUM(L$1047:L1053),)","v":15},300,{"$f":"IF(M1054,SUMPRODUCT(--(J$32:J$1031<=M1054))-SUM(N$1047:N1053),)","v":30},null,700,13]
[null,null,null,null,null,8,750,{"$f":"IF(G1055,SUMPRODUCT(--(G$32:G$1031<=G1055))-SUM(H$1047:H1054),)","v":45},0.81,{"$f":"IF(I1055,SUMPRODUCT(--(H$32:H$1031<=I1055))-SUM(J$1047:J1054),)","v":8},0.36499999999999999,{"$f":"IF(K1055,SUMPRODUCT(--(I$32:I$1031<=K1055))-SUM(L$1047:L1054),)","v":20},325,{"$f":"IF(M1055,SUMPRODUCT(--(J$32:J$1031<=M1055))-SUM(N$1047:N1054),)","v":41},null,750,45]
[null,null,null,null,null,9,800,{"$f":"IF(G1056,SUMPRODUCT(--(G$32:G$1031<=G1056))-SUM(H$1047:H1055),)","v":57},0.82,{"$f":"IF(I1056,SUMPRODUCT(--(H$32:H$1031<=I1056))-SUM(J$1047:J1055),)","v":8},0.37,{"$f":"IF(K1056,SUMPRODUCT(--(I$32:I$1031<=K1056))-SUM(L$1047:L1055),)","v":27},350,{"$f":"IF(M1056,SUMPRODUCT(--(J$32:J$1031<=M1056))-SUM(N$1047:N1055),)","v":68},null,800,57]
[null,null,null,null,null,10,850,{"$f":"IF(G1057,SUMPRODUCT(--(G$32:G$1031<=G1057))-SUM(H$1047:H1056),)","v":73},0.83,{"$f":"IF(I1057,SUMPRODUCT(--(H$32:H$1031<=I1057))-SUM(J$1047:J1056),)","v":8},0.375,{"$f":"IF(K1057,SUMPRODUCT(--(I$32:I$1031<=K1057))-SUM(L$1047:L1056),)","v":42},375,{"$f":"IF(M1057,SUMPRODUCT(--(J$32:J$1031<=M1057))-SUM(N$1047:N1056),)","v":91},null,850,73]
[null,null,null,null,null,11,900,{"$f":"IF(G1058,SUMPRODUCT(--(G$32:G$1031<=G1058))-SUM(H$1047:H1057),)","v":89},0.84,{"$f":"IF(I1058,SUMPRODUCT(--(H$32:H$1031<=I1058))-SUM(J$1047:J1057),)","v":20},0.38,{"$f":"IF(K1058,SUMPRODUCT(--(I$32:I$1031<=K1058))-SUM(L$1047:L1057),)","v":54},400,{"$f":"IF(M1058,SUMPRODUCT(--(J$32:J$1031<=M1058))-SUM(N$1047:N1057),)","v":105},null,900,89]
[null,null,null,null,null,12,950,{"$f":"IF(G1059,SUMPRODUCT(--(G$32:G$1031<=G1059))-SUM(H$1047:H1058),)","v":93},0.85,{"$f":"IF(I1059,SUMPRODUCT(--(H$32:H$1031<=I1059))-SUM(J$1047:J1058),)","v":22},0.38500000000000001,{"$f":"IF(K1059,SUMPRODUCT(--(I$32:I$1031<=K1059))-SUM(L$1047:L1058),)","v":68},425,{"$f":"IF(M1059,SUMPRODUCT(--(J$32:J$1031<=M1059))-SUM(N$1047:N1058),)","v":111},null,950,93]
[null,null,null,null,null,13,1000,{"$f":"IF(G1060,SUMPRODUCT(--(G$32:G$1031<=G1060))-SUM(H$1047:H1059),)","v":104},0.86,{"$f":"IF(I1060,SUMPRODUCT(--(H$32:H$1031<=I1060))-SUM(J$1047:J1059),)","v":30},0.39,{"$f":"IF(K1060,SUMPRODUCT(--(I$32:I$1031<=K1060))-SUM(L$1047:L1059),)","v":80},450,{"$f":"IF(M1060,SUMPRODUCT(--(J$32:J$1031<=M1060))-SUM(N$1047:N1059),)","v":102},null,1000,104]
[null,null,null,null,null,14,1050,{"$f":"IF(G1061,SUMPRODUCT(--(G$32:G$1031<=G1061))-SUM(H$1047:H1060),)","v":112},0.87,{"$f":"IF(I1061,SUMPRODUCT(--(H$32:H$1031<=I1061))-SUM(J$1047:J1060),)","v":49},0.39500000000000002,{"$f":"IF(K1061,SUMPRODUCT(--(I$32:I$1031<=K1061))-SUM(L$1047:L1060),)","v":98},475,{"$f":"IF(M1061,SUMPRODUCT(--(J$32:J$1031<=M1061))-SUM(N$1047:N1060),)","v":105},null,1050,112]
[null,null,null,null,null,15,1100,{"$f":"IF(G1062,SUMPRODUCT(--(G$32:G$1031<=G1062))-SUM(H$1047:H1061),)","v":110},0.88,{"$f":"IF(I1062,SUMPRODUCT(--(H$32:H$1031<=I1062))-SUM(J$1047:J1061),)","v":55},0.4,{"$f":"IF(K1062,SUMPRODUCT(--(I$32:I$1031<=K1062))-SUM(L$1047:L1061),)","v":81},500,{"$f":"IF(M1062,SUMPRODUCT(--(J$32:J$1031<=M1062))-SUM(N$1047:N1061),)","v":98},null,1100,110]
[null,null,null,null,null,16,1150,{"$f":"IF(G1063,SUMPRODUCT(--(G$32:G$1031<=G1063))-SUM(H$1047:H1062),)","v":83},0.89,{"$f":"IF(I1063,SUMPRODUCT(--(H$32:H$1031<=I1063))-SUM(J$1047:J1062),)","v":66},0.40500000000000003,{"$f":"IF(K1063,SUMPRODUCT(--(I$32:I$1031<=K1063))-SUM(L$1047:L1062),)","v":93},525,{"$f":"IF(M1063,SUMPRODUCT(--(J$32:J$1031<=M1063))-SUM(N$1047:N1062),)","v":79},null,1150,83]
[null,null,null,null,null,17,1200,{"$f":"IF(G1064,SUMPRODUCT(--(G$32:G$1031<=G1064))-SUM(H$1047:H1063),)","v":65},0.9,{"$f":"IF(I1064,SUMPRODUCT(--(H$32:H$1031<=I1064))-SUM(J$1047:J1063),)","v":64},0.41000000000000003,{"$f":"IF(K1064,SUMPRODUCT(--(I$32:I$1031<=K1064))-SUM(L$1047:L1063),)","v":84},550,{"$f":"IF(M1064,SUMPRODUCT(--(J$32:J$1031<=M1064))-SUM(N$1047:N1063),)","v":58},null,1200,65]
[null,null,null,null,null,18,1250,{"$f":"IF(G1065,SUMPRODUCT(--(G$32:G$1031<=G1065))-SUM(H$1047:H1064),)","v":53},0.91,{"$f":"IF(I1065,SUMPRODUCT(--(H$32:H$1031<=I1065))-SUM(J$1047:J1064),)","v":78},0.41500000000000004,{"$f":"IF(K1065,SUMPRODUCT(--(I$32:I$1031<=K1065))-SUM(L$1047:L1064),)","v":79},575,{"$f":"IF(M1065,SUMPRODUCT(--(J$32:J$1031<=M1065))-SUM(N$1047:N1064),)","v":33},null,1250,53]
[null,null,null,null,null,19,1300,{"$f":"IF(G1066,SUMPRODUCT(--(G$32:G$1031<=G1066))-SUM(H$1047:H1065),)","v":36},0.91999999999999993,{"$f":"IF(I1066,SUMPRODUCT(--(H$32:H$1031<=I1066))-SUM(J$1047:J1065),)","v":81},0.42000000000000004,{"$f":"IF(K1066,SUMPRODUCT(--(I$32:I$1031<=K1066))-SUM(L$1047:L1065),)","v":64},600,{"$f":"IF(M1066,SUMPRODUCT(--(J$32:J$1031<=M1066))-SUM(N$1047:N1065),)","v":25},null,1300,36]
[null,null,null,null,null,20,1350,{"$f":"IF(G1067,SUMPRODUCT(--(G$32:G$1031<=G1067))-SUM(H$1047:H1066),)","v":21},0.92999999999999994,{"$f":"IF(I1067,SUMPRODUCT(--(H$32:H$1031<=I1067))-SUM(J$1047:J1066),)","v":84},0.42500000000000004,{"$f":"IF(K1067,SUMPRODUCT(--(I$32:I$1031<=K1067))-SUM(L$1047:L1066),)","v":59},625,{"$f":"IF(M1067,SUMPRODUCT(--(J$32:J$1031<=M1067))-SUM(N$1047:N1066),)","v":17},null,1350,21]
[null,null,null,null,null,21,1400,{"$f":"IF(G1068,SUMPRODUCT(--(G$32:G$1031<=G1068))-SUM(H$1047:H1067),)","v":15},0.94,{"$f":"IF(I1068,SUMPRODUCT(--(H$32:H$1031<=I1068))-SUM(J$1047:J1067),)","v":56},0.43000000000000005,{"$f":"IF(K1068,SUMPRODUCT(--(I$32:I$1031<=K1068))-SUM(L$1047:L1067),)","v":47},650,{"$f":"IF(M1068,SUMPRODUCT(--(J$32:J$1031<=M1068))-SUM(N$1047:N1067),)","v":8},null,1400,15]
[null,null,null,null,null,22,1450,{"$f":"IF(G1069,SUMPRODUCT(--(G$32:G$1031<=G1069))-SUM(H$1047:H1068),)","v":7},0.95,{"$f":"IF(I1069,SUMPRODUCT(--(H$32:H$1031<=I1069))-SUM(J$1047:J1068),)","v":65},0.435,{"$f":"IF(K1069,SUMPRODUCT(--(I$32:I$1031<=K1069))-SUM(L$1047:L1068),)","v":28},675,{"$f":"IF(M1069,SUMPRODUCT(--(J$32:J$1031<=M1069))-SUM(N$1047:N1068),)","v":4},null,1450,7]
[null,null,null,null,null,23,1500,{"$f":"IF(G1070,SUMPRODUCT(--(G$32:G$1031<=G1070))-SUM(H$1047:H1069),)","v":3},0.96,{"$f":"IF(I1070,SUMPRODUCT(--(H$32:H$1031<=I1070))-SUM(J$1047:J1069),)","v":58},0.44,{"$f":"IF(K1070,SUMPRODUCT(--(I$32:I$1031<=K1070))-SUM(L$1047:L1069),)","v":16},700,{"$f":"IF(M1070,SUMPRODUCT(--(J$32:J$1031<=M1070))-SUM(N$1047:N1069),)","v":2},null,1500,3]
[null,null,null,null,null,24,1550,{"$f":"IF(G1071,SUMPRODUCT(--(G$32:G$1031<=G1071))-SUM(H$1047:H1070),)","v":1},0.97,{"$f":"IF(I1071,SUMPRODUCT(--(H$32:H$1031<=I1071))-SUM(J$1047:J1070),)","v":58},0.44500000000000001,{"$f":"IF(K1071,SUMPRODUCT(--(I$32:I$1031<=K1071))-SUM(L$1047:L1070),)","v":3},725,{"$f":"IF(M1071,SUMPRODUCT(--(J$32:J$1031<=M1071))-SUM(N$1047:N1070),)","v":0},null,1550,1]
[null,null,null,null,null,25,0,{"$f":"IF(G1072,SUMPRODUCT(--(G$32:G$1031<=G1072))-SUM(H$1047:H1071),)","v":0},0.98,{"$f":"IF(I1072,SUMPRODUCT(--(H$32:H$1031<=I1072))-SUM(J$1047:J1071),)","v":56},0.45,{"$f":"IF(K1072,SUMPRODUCT(--(I$32:I$1031<=K1072))-SUM(L$1047:L1071),)","v":8},750,{"$f":"IF(M1072,SUMPRODUCT(--(J$32:J$1031<=M1072))-SUM(N$1047:N1071),)","v":0},null,0,0]
[null,null,null,null,null,26,0,{"$f":"IF(G1073,SUMPRODUCT(--(G$32:G$1031<=G1073))-SUM(H$1047:H1072),)","v":0},0.99,{"$f":"IF(I1073,SUMPRODUCT(--(H$32:H$1031<=I1073))-SUM(J$1047:J1072),)","v":43},0.45500000000000002,{"$f":"IF(K1073,SUMPRODUCT(--(I$32:I$1031<=K1073))-SUM(L$1047:L1072),)","v":7},775,{"$f":"IF(M1073,SUMPRODUCT(--(J$32:J$1031<=M1073))-SUM(N$1047:N1072),)","v":1},null,0,0]
[null,null,null,null,null,27,0,{"$f":"IF(G1074,SUMPRODUCT(--(G$32:G$1031<=G1074))-SUM(H$1047:H1073),)","v":0},1,{"$f":"IF(I1074,SUMPRODUCT(--(H$32:H$1031<=I1074))-SUM(J$1047:J1073),)","v":24},0.46,{"$f":"IF(K1074,SUMPRODUCT(--(I$32:I$1031<=K1074))-SUM(L$1047:L1073),)","v":3},800,{"$f":"IF(M1074,SUMPRODUCT(--(J$32:J$1031<=M1074))-SUM(N$1047:N1073),)","v":0},null,0,0]
[null,null,null,null,null,28,0,{"$f":"IF(G1075,SUMPRODUCT(--(G$32:G$1031<=G1075))-SUM(H$1047:H1074),)","v":0},1.01,{"$f":"IF(I1075,SUMPRODUCT(--(H$32:H$1031<=I1075))-SUM(J$1047:J1074),)","v":21},0.46500000000000002,{"$f":"IF(K1075,SUMPRODUCT(--(I$32:I$1031<=K1075))-SUM(L$1047:L1074),)","v":1},0,{"$f":"IF(M1075,SUMPRODUCT(--(J$32:J$1031<=M1075))-SUM(N$1047:N1074),)","v":0},null,0,0]
[null,null,null,null,null,29,0,{"$f":"IF(G1076,SUMPRODUCT(--(G$32:G$1031<=G1076))-SUM(H$1047:H1075),)","v":0},1.02,{"$f":"IF(I1076,SUMPRODUCT(--(H$32:H$1031<=I1076))-SUM(J$1047:J1075),)","v":13},0.47000000000000003,{"$f":"IF(K1076,SUMPRODUCT(--(I$32:I$1031<=K1076))-SUM(L$1047:L1075),)","v":2},0,{"$f":"IF(M1076,SUMPRODUCT(--(J$32:J$1031<=M1076))-SUM(N$1047:N1075),)","v":0},null,0,0]
[null,null,null,null,null,30,0,{"$f":"IF(G1077,SUMPRODUCT(--(G$32:G$1031<=G1077))-SUM(H$1047:H1076),)","v":0},1.03,{"$f":"IF(I1077,SUMPRODUCT(--(H$32:H$1031<=I1077))-SUM(J$1047:J1076),)","v":15},0,{"$f":"IF(K1077,SUMPRODUCT(--(I$32:I$1031<=K1077))-SUM(L$1047:L1076),)","v":0},0,{"$f":"IF(M1077,SUMPRODUCT(--(J$32:J$1031<=M1077))-SUM(N$1047:N1076),)","v":0},null,0,0]
[null,null,null,null,null,31,0,{"$f":"IF(G1078,SUMPRODUCT(--(G$32:G$1031<=G1078))-SUM(H$1047:H1077),)","v":0},1.04,{"$f":"IF(I1078,SUMPRODUCT(--(H$32:H$1031<=I1078))-SUM(J$1047:J1077),)","v":5},0,{"$f":"IF(K1078,SUMPRODUCT(--(I$32:I$1031<=K1078))-SUM(L$1047:L1077),)","v":0},0,{"$f":"IF(M1078,SUMPRODUCT(--(J$32:J$1031<=M1078))-SUM(N$1047:N1077),)","v":0},null,0,0]
[null,null,null,null,null,32,0,{"$f":"IF(G1079,SUMPRODUCT(--(G$32:G$1031<=G1079))-SUM(H$1047:H1078),)","v":0},1.05,{"$f":"IF(I1079,SUMPRODUCT(--(H$32:H$1031<=I1079))-SUM(J$1047:J1078),)","v":4},0,{"$f":"IF(K1079,SUMPRODUCT(--(I$32:I$1031<=K1079))-SUM(L$1047:L1078),)","v":0},0,{"$f":"IF(M1079,SUMPRODUCT(--(J$32:J$1031<=M1079))-SUM(N$1047:N1078),)","v":0},null,0,0]
[null,null,null,null,null,33,0,{"$f":"IF(G1080,SUMPRODUCT(--(G$32:G$1031<=G1080))-SUM(H$1047:H1079),)","v":0},1.06,{"$f":"IF(I1080,SUMPRODUCT(--(H$32:H$1031<=I1080))-SUM(J$1047:J1079),)","v":2},0,{"$f":"IF(K1080,SUMPRODUCT(--(I$32:I$1031<=K1080))-SUM(L$1047:L1079),)","v":0},0,{"$f":"IF(M1080,SUMPRODUCT(--(J$32:J$1031<=M1080))-SUM(N$1047:N1079),)","v":0},null,{"$f":"OFFSET(E1080,,2*DD_Simulations_Outputs)","v":0},{"$f":"OFFSET(F1080,,2*DD_Simulations_Outputs)","v":0}]
[null,null,null,null,null,34,0,{"$f":"IF(G1081,SUMPRODUCT(--(G$32:G$1031<=G1081))-SUM(H$1047:H1080),)","v":0},0,{"$f":"IF(I1081,SUMPRODUCT(--(H$32:H$1031<=I1081))-SUM(J$1047:J1080),)","v":0},0,{"$f":"IF(K1081,SUMPRODUCT(--(I$32:I$1031<=K1081))-SUM(L$1047:L1080),)","v":0},0,{"$f":"IF(M1081,SUMPRODUCT(--(J$32:J$1031<=M1081))-SUM(N$1047:N1080),)","v":0},null,0,0]
[null,null,null,null,null,35,0,{"$f":"IF(G1082,SUMPRODUCT(--(G$32:G$1031<=G1082))-SUM(H$1047:H1081),)","v":0},0,{"$f":"IF(I1082,SUMPRODUCT(--(H$32:H$1031<=I1082))-SUM(J$1047:J1081),)","v":0},0,{"$f":"IF(K1082,SUMPRODUCT(--(I$32:I$1031<=K1082))-SUM(L$1047:L1081),)","v":0},0,{"$f":"IF(M1082,SUMPRODUCT(--(J$32:J$1031<=M1082))-SUM(N$1047:N1081),)","v":0},null,0,0]
[null,null,null,null,null,36,0,{"$f":"IF(G1083,SUMPRODUCT(--(G$32:G$1031<=G1083))-SUM(H$1047:H1082),)","v":0},0,{"$f":"IF(I1083,SUMPRODUCT(--(H$32:H$1031<=I1083))-SUM(J$1047:J1082),)","v":0},0,{"$f":"IF(K1083,SUMPRODUCT(--(I$32:I$1031<=K1083))-SUM(L$1047:L1082),)","v":0},0,{"$f":"IF(M1083,SUMPRODUCT(--(J$32:J$1031<=M1083))-SUM(N$1047:N1082),)","v":0},null,0,0]
[null,null,null,null,null,37,0,{"$f":"IF(G1084,SUMPRODUCT(--(G$32:G$1031<=G1084))-SUM(H$1047:H1083),)","v":0},0,{"$f":"IF(I1084,SUMPRODUCT(--(H$32:H$1031<=I1084))-SUM(J$1047:J1083),)","v":0},0,{"$f":"IF(K1084,SUMPRODUCT(--(I$32:I$1031<=K1084))-SUM(L$1047:L1083),)","v":0},0,{"$f":"IF(M1084,SUMPRODUCT(--(J$32:J$1031<=M1084))-SUM(N$1047:N1083),)","v":0},null,0,0]
[null,null,null,null,null,38,0,{"$f":"IF(G1085,SUMPRODUCT(--(G$32:G$1031<=G1085))-SUM(H$1047:H1084),)","v":0},0,{"$f":"IF(I1085,SUMPRODUCT(--(H$32:H$1031<=I1085))-SUM(J$1047:J1084),)","v":0},0,{"$f":"IF(K1085,SUMPRODUCT(--(I$32:I$1031<=K1085))-SUM(L$1047:L1084),)","v":0},0,{"$f":"IF(M1085,SUMPRODUCT(--(J$32:J$1031<=M1085))-SUM(N$1047:N1084),)","v":0},null,0,0]
[null,null,null,null,null,39,0,{"$f":"IF(G1086,SUMPRODUCT(--(G$32:G$1031<=G1086))-SUM(H$1047:H1085),)","v":0},0,{"$f":"IF(I1086,SUMPRODUCT(--(H$32:H$1031<=I1086))-SUM(J$1047:J1085),)","v":0},0,{"$f":"IF(K1086,SUMPRODUCT(--(I$32:I$1031<=K1086))-SUM(L$1047:L1085),)","v":0},0,{"$f":"IF(M1086,SUMPRODUCT(--(J$32:J$1031<=M1086))-SUM(N$1047:N1085),)","v":0},null,0,0]
[null,null,null,null,null,40,0,{"$f":"IF(G1087,SUMPRODUCT(--(G$32:G$1031<=G1087))-SUM(H$1047:H1086),)","v":0},0,{"$f":"IF(I1087,SUMPRODUCT(--(H$32:H$1031<=I1087))-SUM(J$1047:J1086),)","v":0},0,{"$f":"IF(K1087,SUMPRODUCT(--(I$32:I$1031<=K1087))-SUM(L$1047:L1086),)","v":0},0,{"$f":"IF(M1087,SUMPRODUCT(--(J$32:J$1031<=M1087))-SUM(N$1047:N1086),)","v":0},null,0,0]
[null,null,null,null,null,41,0,{"$f":"IF(G1088,SUMPRODUCT(--(G$32:G$1031<=G1088))-SUM(H$1047:H1087),)","v":0},0,{"$f":"IF(I1088,SUMPRODUCT(--(H$32:H$1031<=I1088))-SUM(J$1047:J1087),)","v":0},0,{"$f":"IF(K1088,SUMPRODUCT(--(I$32:I$1031<=K1088))-SUM(L$1047:L1087),)","v":0},0,{"$f":"IF(M1088,SUMPRODUCT(--(J$32:J$1031<=M1088))-SUM(N$1047:N1087),)","v":0},null,0,0]
[null,null,null,null,null,42,0,{"$f":"IF(G1089,SUMPRODUCT(--(G$32:G$1031<=G1089))-SUM(H$1047:H1088),)","v":0},0,{"$f":"IF(I1089,SUMPRODUCT(--(H$32:H$1031<=I1089))-SUM(J$1047:J1088),)","v":0},0,{"$f":"IF(K1089,SUMPRODUCT(--(I$32:I$1031<=K1089))-SUM(L$1047:L1088),)","v":0},0,{"$f":"IF(M1089,SUMPRODUCT(--(J$32:J$1031<=M1089))-SUM(N$1047:N1088),)","v":0},null,0,0]
[null,null,null,null,null,43,0,{"$f":"IF(G1090,SUMPRODUCT(--(G$32:G$1031<=G1090))-SUM(H$1047:H1089),)","v":0},0,{"$f":"IF(I1090,SUMPRODUCT(--(H$32:H$1031<=I1090))-SUM(J$1047:J1089),)","v":0},0,{"$f":"IF(K1090,SUMPRODUCT(--(I$32:I$1031<=K1090))-SUM(L$1047:L1089),)","v":0},0,{"$f":"IF(M1090,SUMPRODUCT(--(J$32:J$1031<=M1090))-SUM(N$1047:N1089),)","v":0},null,0,0]
[null,null,null,null,null,44,0,{"$f":"IF(G1091,SUMPRODUCT(--(G$32:G$1031<=G1091))-SUM(H$1047:H1090),)","v":0},0,{"$f":"IF(I1091,SUMPRODUCT(--(H$32:H$1031<=I1091))-SUM(J$1047:J1090),)","v":0},0,{"$f":"IF(K1091,SUMPRODUCT(--(I$32:I$1031<=K1091))-SUM(L$1047:L1090),)","v":0},0,{"$f":"IF(M1091,SUMPRODUCT(--(J$32:J$1031<=M1091))-SUM(N$1047:N1090),)","v":0},null,0,0]
[null,null,null,null,null,45,0,{"$f":"IF(G1092,SUMPRODUCT(--(G$32:G$1031<=G1092))-SUM(H$1047:H1091),)","v":0},0,{"$f":"IF(I1092,SUMPRODUCT(--(H$32:H$1031<=I1092))-SUM(J$1047:J1091),)","v":0},0,{"$f":"IF(K1092,SUMPRODUCT(--(I$32:I$1031<=K1092))-SUM(L$1047:L1091),)","v":0},0,{"$f":"IF(M1092,SUMPRODUCT(--(J$32:J$1031<=M1092))-SUM(N$1047:N1091),)","v":0},null,0,0]
[null,null,null,null,null,46,0,{"$f":"IF(G1093,SUMPRODUCT(--(G$32:G$1031<=G1093))-SUM(H$1047:H1092),)","v":0},0,{"$f":"IF(I1093,SUMPRODUCT(--(H$32:H$1031<=I1093))-SUM(J$1047:J1092),)","v":0},0,{"$f":"IF(K1093,SUMPRODUCT(--(I$32:I$1031<=K1093))-SUM(L$1047:L1092),)","v":0},0,{"$f":"IF(M1093,SUMPRODUCT(--(J$32:J$1031<=M1093))-SUM(N$1047:N1092),)","v":0},null,0,0]
[null,null,null,null,null,47,0,{"$f":"IF(G1094,SUMPRODUCT(--(G$32:G$1031<=G1094))-SUM(H$1047:H1093),)","v":0},0,{"$f":"IF(I1094,SUMPRODUCT(--(H$32:H$1031<=I1094))-SUM(J$1047:J1093),)","v":0},0,{"$f":"IF(K1094,SUMPRODUCT(--(I$32:I$1031<=K1094))-SUM(L$1047:L1093),)","v":0},0,{"$f":"IF(M1094,SUMPRODUCT(--(J$32:J$1031<=M1094))-SUM(N$1047:N1093),)","v":0},null,0,0]
[null,null,null,null,null,48,0,{"$f":"IF(G1095,SUMPRODUCT(--(G$32:G$1031<=G1095))-SUM(H$1047:H1094),)","v":0},0,{"$f":"IF(I1095,SUMPRODUCT(--(H$32:H$1031<=I1095))-SUM(J$1047:J1094),)","v":0},0,{"$f":"IF(K1095,SUMPRODUCT(--(I$32:I$1031<=K1095))-SUM(L$1047:L1094),)","v":0},0,{"$f":"IF(M1095,SUMPRODUCT(--(J$32:J$1031<=M1095))-SUM(N$1047:N1094),)","v":0},null,0,0]
[null,null,null,null,null,49,0,{"$f":"IF(G1096,SUMPRODUCT(--(G$32:G$1031<=G1096))-SUM(H$1047:H1095),)","v":0},0,{"$f":"IF(I1096,SUMPRODUCT(--(H$32:H$1031<=I1096))-SUM(J$1047:J1095),)","v":0},0,{"$f":"IF(K1096,SUMPRODUCT(--(I$32:I$1031<=K1096))-SUM(L$1047:L1095),)","v":0},0,{"$f":"IF(M1096,SUMPRODUCT(--(J$32:J$1031<=M1096))-SUM(N$1047:N1095),)","v":0},null,0,0]
[null,null,null,null,null,50,0,{"$f":"IF(G1097,SUMPRODUCT(--(G$32:G$1031<=G1097))-SUM(H$1047:H1096),)","v":0},0,{"$f":"IF(I1097,SUMPRODUCT(--(H$32:H$1031<=I1097))-SUM(J$1047:J1096),)","v":0},0,{"$f":"IF(K1097,SUMPRODUCT(--(I$32:I$1031<=K1097))-SUM(L$1047:L1096),)","v":0},0,{"$f":"IF(M1097,SUMPRODUCT(--(J$32:J$1031<=M1097))-SUM(N$1047:N1096),)","v":0},null,0,0]
[null,null,null,null,null,51,0,{"$f":"IF(G1098,SUMPRODUCT(--(G$32:G$1031<=G1098))-SUM(H$1047:H1097),)","v":0},0,{"$f":"IF(I1098,SUMPRODUCT(--(H$32:H$1031<=I1098))-SUM(J$1047:J1097),)","v":0},0,{"$f":"IF(K1098,SUMPRODUCT(--(I$32:I$1031<=K1098))-SUM(L$1047:L1097),)","v":0},0,{"$f":"IF(M1098,SUMPRODUCT(--(J$32:J$1031<=M1098))-SUM(N$1047:N1097),)","v":0},null,0,0]
[null,null,null,null,null,52,0,{"$f":"IF(G1099,SUMPRODUCT(--(G$32:G$1031<=G1099))-SUM(H$1047:H1098),)","v":0},0,{"$f":"IF(I1099,SUMPRODUCT(--(H$32:H$1031<=I1099))-SUM(J$1047:J1098),)","v":0},0,{"$f":"IF(K1099,SUMPRODUCT(--(I$32:I$1031<=K1099))-SUM(L$1047:L1098),)","v":0},0,{"$f":"IF(M1099,SUMPRODUCT(--(J$32:J$1031<=M1099))-SUM(N$1047:N1098),)","v":0},null,0,0]
[null,null,null,null,null,53,0,{"$f":"IF(G1100,SUMPRODUCT(--(G$32:G$1031<=G1100))-SUM(H$1047:H1099),)","v":0},0,{"$f":"IF(I1100,SUMPRODUCT(--(H$32:H$1031<=I1100))-SUM(J$1047:J1099),)","v":0},0,{"$f":"IF(K1100,SUMPRODUCT(--(I$32:I$1031<=K1100))-SUM(L$1047:L1099),)","v":0},0,{"$f":"IF(M1100,SUMPRODUCT(--(J$32:J$1031<=M1100))-SUM(N$1047:N1099),)","v":0},null,0,0]
[null,null,null,null,null,54,0,{"$f":"IF(G1101,SUMPRODUCT(--(G$32:G$1031<=G1101))-SUM(H$1047:H1100),)","v":0},0,{"$f":"IF(I1101,SUMPRODUCT(--(H$32:H$1031<=I1101))-SUM(J$1047:J1100),)","v":0},0,{"$f":"IF(K1101,SUMPRODUCT(--(I$32:I$1031<=K1101))-SUM(L$1047:L1100),)","v":0},0,{"$f":"IF(M1101,SUMPRODUCT(--(J$32:J$1031<=M1101))-SUM(N$1047:N1100),)","v":0},null,0,0]
[null,null,null,null,null,55,0,{"$f":"IF(G1102,SUMPRODUCT(--(G$32:G$1031<=G1102))-SUM(H$1047:H1101),)","v":0},0,{"$f":"IF(I1102,SUMPRODUCT(--(H$32:H$1031<=I1102))-SUM(J$1047:J1101),)","v":0},0,{"$f":"IF(K1102,SUMPRODUCT(--(I$32:I$1031<=K1102))-SUM(L$1047:L1101),)","v":0},0,{"$f":"IF(M1102,SUMPRODUCT(--(J$32:J$1031<=M1102))-SUM(N$1047:N1101),)","v":0},null,0,0]
[null,null,null,null,null,56,0,{"$f":"IF(G1103,SUMPRODUCT(--(G$32:G$1031<=G1103))-SUM(H$1047:H1102),)","v":0},0,{"$f":"IF(I1103,SUMPRODUCT(--(H$32:H$1031<=I1103))-SUM(J$1047:J1102),)","v":0},0,{"$f":"IF(K1103,SUMPRODUCT(--(I$32:I$1031<=K1103))-SUM(L$1047:L1102),)","v":0},0,{"$f":"IF(M1103,SUMPRODUCT(--(J$32:J$1031<=M1103))-SUM(N$1047:N1102),)","v":0},null,0,0]
[null,null,null,null,null,57,0,{"$f":"IF(G1104,SUMPRODUCT(--(G$32:G$1031<=G1104))-SUM(H$1047:H1103),)","v":0},0,{"$f":"IF(I1104,SUMPRODUCT(--(H$32:H$1031<=I1104))-SUM(J$1047:J1103),)","v":0},0,{"$f":"IF(K1104,SUMPRODUCT(--(I$32:I$1031<=K1104))-SUM(L$1047:L1103),)","v":0},0,{"$f":"IF(M1104,SUMPRODUCT(--(J$32:J$1031<=M1104))-SUM(N$1047:N1103),)","v":0},null,0,0]
[null,null,null,null,null,58,0,{"$f":"IF(G1105,SUMPRODUCT(--(G$32:G$1031<=G1105))-SUM(H$1047:H1104),)","v":0},0,{"$f":"IF(I1105,SUMPRODUCT(--(H$32:H$1031<=I1105))-SUM(J$1047:J1104),)","v":0},0,{"$f":"IF(K1105,SUMPRODUCT(--(I$32:I$1031<=K1105))-SUM(L$1047:L1104),)","v":0},0,{"$f":"IF(M1105,SUMPRODUCT(--(J$32:J$1031<=M1105))-SUM(N$1047:N1104),)","v":0},null,0,0]
[null,null,null,null,null,59,0,{"$f":"IF(G1106,SUMPRODUCT(--(G$32:G$1031<=G1106))-SUM(H$1047:H1105),)","v":0},0,{"$f":"IF(I1106,SUMPRODUCT(--(H$32:H$1031<=I1106))-SUM(J$1047:J1105),)","v":0},0,{"$f":"IF(K1106,SUMPRODUCT(--(I$32:I$1031<=K1106))-SUM(L$1047:L1105),)","v":0},0,{"$f":"IF(M1106,SUMPRODUCT(--(J$32:J$1031<=M1106))-SUM(N$1047:N1105),)","v":0},null,0,0]
[null,null,null,null,null,60,0,{"$f":"IF(G1107,SUMPRODUCT(--(G$32:G$1031<=G1107))-SUM(H$1047:H1106),)","v":0},0,{"$f":"IF(I1107,SUMPRODUCT(--(H$32:H$1031<=I1107))-SUM(J$1047:J1106),)","v":0},0,{"$f":"IF(K1107,SUMPRODUCT(--(I$32:I$1031<=K1107))-SUM(L$1047:L1106),)","v":0},0,{"$f":"IF(M1107,SUMPRODUCT(--(J$32:J$1031<=M1107))-SUM(N$1047:N1106),)","v":0},null,0,0]
[null,null,null,null,null,61,0,{"$f":"IF(G1108,SUMPRODUCT(--(G$32:G$1031<=G1108))-SUM(H$1047:H1107),)","v":0},0,{"$f":"IF(I1108,SUMPRODUCT(--(H$32:H$1031<=I1108))-SUM(J$1047:J1107),)","v":0},0,{"$f":"IF(K1108,SUMPRODUCT(--(I$32:I$1031<=K1108))-SUM(L$1047:L1107),)","v":0},0,{"$f":"IF(M1108,SUMPRODUCT(--(J$32:J$1031<=M1108))-SUM(N$1047:N1107),)","v":0},null,0,0]
[null,null,null,null,null,62,0,{"$f":"IF(G1109,SUMPRODUCT(--(G$32:G$1031<=G1109))-SUM(H$1047:H1108),)","v":0},0,{"$f":"IF(I1109,SUMPRODUCT(--(H$32:H$1031<=I1109))-SUM(J$1047:J1108),)","v":0},0,{"$f":"IF(K1109,SUMPRODUCT(--(I$32:I$1031<=K1109))-SUM(L$1047:L1108),)","v":0},0,{"$f":"IF(M1109,SUMPRODUCT(--(J$32:J$1031<=M1109))-SUM(N$1047:N1108),)","v":0},null,0,0]
[null,null,null,null,null,63,0,{"$f":"IF(G1110,SUMPRODUCT(--(G$32:G$1031<=G1110))-SUM(H$1047:H1109),)","v":0},0,{"$f":"IF(I1110,SUMPRODUCT(--(H$32:H$1031<=I1110))-SUM(J$1047:J1109),)","v":0},0,{"$f":"IF(K1110,SUMPRODUCT(--(I$32:I$1031<=K1110))-SUM(L$1047:L1109),)","v":0},0,{"$f":"IF(M1110,SUMPRODUCT(--(J$32:J$1031<=M1110))-SUM(N$1047:N1109),)","v":0},null,0,0]
[null,null,null,null,null,64,0,{"$f":"IF(G1111,SUMPRODUCT(--(G$32:G$1031<=G1111))-SUM(H$1047:H1110),)","v":0},0,{"$f":"IF(I1111,SUMPRODUCT(--(H$32:H$1031<=I1111))-SUM(J$1047:J1110),)","v":0},0,{"$f":"IF(K1111,SUMPRODUCT(--(I$32:I$1031<=K1111))-SUM(L$1047:L1110),)","v":0},0,{"$f":"IF(M1111,SUMPRODUCT(--(J$32:J$1031<=M1111))-SUM(N$1047:N1110),)","v":0},null,0,0]
[null,null,null,null,null,65,0,{"$f":"IF(G1112,SUMPRODUCT(--(G$32:G$1031<=G1112))-SUM(H$1047:H1111),)","v":0},{"$f":"H$1040+IF($F1112<=H$1043,($F1112-1)*H$1042,-H$1040)","v":0},{"$f":"IF(I1112,SUMPRODUCT(--(H$32:H$1031<=I1112))-SUM(J$1047:J1111),)","v":0},{"$f":"I$1040+IF($F1112<=I$1043,($F1112-1)*I$1042,-I$1040)","v":0},{"$f":"IF(K1112,SUMPRODUCT(--(I$32:I$1031<=K1112))-SUM(L$1047:L1111),)","v":0},{"$f":"J$1040+IF($F1112<=J$1043,($F1112-1)*J$1042,-J$1040)","v":0},{"$f":"IF(M1112,SUMPRODUCT(--(J$32:J$1031<=M1112))-SUM(N$1047:N1111),)","v":0},null,{"$f":"OFFSET(E1112,,2*DD_Simulations_Outputs)","v":0},{"$f":"OFFSET(F1112,,2*DD_Simulations_Outputs)","v":0}]
[null,null,null,null,null,{"$f":"N(F1112)+1","v":66},{"$f":"G$1040+IF($F1113<=G$1043,($F1113-1)*G$1042,-G$1040)","v":0},{"$f":"IF(G1113,SUMPRODUCT(--(G$32:G$1031<=G1113))-SUM(H$1047:H1112),)","v":0},0,{"$f":"IF(I1113,SUMPRODUCT(--(H$32:H$1031<=I1113))-SUM(J$1047:J1112),)","v":0},0,{"$f":"IF(K1113,SUMPRODUCT(--(I$32:I$1031<=K1113))-SUM(L$1047:L1112),)","v":0},0,{"$f":"IF(M1113,SUMPRODUCT(--(J$32:J$1031<=M1113))-SUM(N$1047:N1112),)","v":0},null,0,0]
[null,null,null,null,null,67,0,{"$f":"IF(G1114,SUMPRODUCT(--(G$32:G$1031<=G1114))-SUM(H$1047:H1113),)","v":0},0,{"$f":"IF(I1114,SUMPRODUCT(--(H$32:H$1031<=I1114))-SUM(J$1047:J1113),)","v":0},0,{"$f":"IF(K1114,SUMPRODUCT(--(I$32:I$1031<=K1114))-SUM(L$1047:L1113),)","v":0},0,{"$f":"IF(M1114,SUMPRODUCT(--(J$32:J$1031<=M1114))-SUM(N$1047:N1113),)","v":0},null,0,0]
[null,null,null,null,null,68,0,{"$f":"IF(G1115,SUMPRODUCT(--(G$32:G$1031<=G1115))-SUM(H$1047:H1114),)","v":0},0,{"$f":"IF(I1115,SUMPRODUCT(--(H$32:H$1031<=I1115))-SUM(J$1047:J1114),)","v":0},0,{"$f":"IF(K1115,SUMPRODUCT(--(I$32:I$1031<=K1115))-SUM(L$1047:L1114),)","v":0},0,{"$f":"IF(M1115,SUMPRODUCT(--(J$32:J$1031<=M1115))-SUM(N$1047:N1114),)","v":0},null,0,0]
[null,null,null,null,null,69,0,{"$f":"IF(G1116,SUMPRODUCT(--(G$32:G$1031<=G1116))-SUM(H$1047:H1115),)","v":0},0,{"$f":"IF(I1116,SUMPRODUCT(--(H$32:H$1031<=I1116))-SUM(J$1047:J1115),)","v":0},0,{"$f":"IF(K1116,SUMPRODUCT(--(I$32:I$1031<=K1116))-SUM(L$1047:L1115),)","v":0},0,{"$f":"IF(M1116,SUMPRODUCT(--(J$32:J$1031<=M1116))-SUM(N$1047:N1115),)","v":0},null,0,0]
[null,null,null,null,null,70,0,{"$f":"IF(G1117,SUMPRODUCT(--(G$32:G$1031<=G1117))-SUM(H$1047:H1116),)","v":0},0,{"$f":"IF(I1117,SUMPRODUCT(--(H$32:H$1031<=I1117))-SUM(J$1047:J1116),)","v":0},0,{"$f":"IF(K1117,SUMPRODUCT(--(I$32:I$1031<=K1117))-SUM(L$1047:L1116),)","v":0},0,{"$f":"IF(M1117,SUMPRODUCT(--(J$32:J$1031<=M1117))-SUM(N$1047:N1116),)","v":0},null,0,0]
[null,null,null,null,null,71,0,{"$f":"IF(G1118,SUMPRODUCT(--(G$32:G$1031<=G1118))-SUM(H$1047:H1117),)","v":0},0,{"$f":"IF(I1118,SUMPRODUCT(--(H$32:H$1031<=I1118))-SUM(J$1047:J1117),)","v":0},0,{"$f":"IF(K1118,SUMPRODUCT(--(I$32:I$1031<=K1118))-SUM(L$1047:L1117),)","v":0},0,{"$f":"IF(M1118,SUMPRODUCT(--(J$32:J$1031<=M1118))-SUM(N$1047:N1117),)","v":0},null,0,0]
[null,null,null,null,null,72,0,{"$f":"IF(G1119,SUMPRODUCT(--(G$32:G$1031<=G1119))-SUM(H$1047:H1118),)","v":0},0,{"$f":"IF(I1119,SUMPRODUCT(--(H$32:H$1031<=I1119))-SUM(J$1047:J1118),)","v":0},0,{"$f":"IF(K1119,SUMPRODUCT(--(I$32:I$1031<=K1119))-SUM(L$1047:L1118),)","v":0},0,{"$f":"IF(M1119,SUMPRODUCT(--(J$32:J$1031<=M1119))-SUM(N$1047:N1118),)","v":0},null,0,0]
[null,null,null,null,null,73,0,{"$f":"IF(G1120,SUMPRODUCT(--(G$32:G$1031<=G1120))-SUM(H$1047:H1119),)","v":0},0,{"$f":"IF(I1120,SUMPRODUCT(--(H$32:H$1031<=I1120))-SUM(J$1047:J1119),)","v":0},0,{"$f":"IF(K1120,SUMPRODUCT(--(I$32:I$1031<=K1120))-SUM(L$1047:L1119),)","v":0},0,{"$f":"IF(M1120,SUMPRODUCT(--(J$32:J$1031<=M1120))-SUM(N$1047:N1119),)","v":0},null,0,0]
[null,null,null,null,null,74,0,{"$f":"IF(G1121,SUMPRODUCT(--(G$32:G$1031<=G1121))-SUM(H$1047:H1120),)","v":0},0,{"$f":"IF(I1121,SUMPRODUCT(--(H$32:H$1031<=I1121))-SUM(J$1047:J1120),)","v":0},0,{"$f":"IF(K1121,SUMPRODUCT(--(I$32:I$1031<=K1121))-SUM(L$1047:L1120),)","v":0},0,{"$f":"IF(M1121,SUMPRODUCT(--(J$32:J$1031<=M1121))-SUM(N$1047:N1120),)","v":0},null,0,0]
[null,null,null,null,null,75,0,{"$f":"IF(G1122,SUMPRODUCT(--(G$32:G$1031<=G1122))-SUM(H$1047:H1121),)","v":0},0,{"$f":"IF(I1122,SUMPRODUCT(--(H$32:H$1031<=I1122))-SUM(J$1047:J1121),)","v":0},0,{"$f":"IF(K1122,SUMPRODUCT(--(I$32:I$1031<=K1122))-SUM(L$1047:L1121),)","v":0},0,{"$f":"IF(M1122,SUMPRODUCT(--(J$32:J$1031<=M1122))-SUM(N$1047:N1121),)","v":0},null,0,0]
[null,null,null,null,null,76,0,{"$f":"IF(G1123,SUMPRODUCT(--(G$32:G$1031<=G1123))-SUM(H$1047:H1122),)","v":0},0,{"$f":"IF(I1123,SUMPRODUCT(--(H$32:H$1031<=I1123))-SUM(J$1047:J1122),)","v":0},0,{"$f":"IF(K1123,SUMPRODUCT(--(I$32:I$1031<=K1123))-SUM(L$1047:L1122),)","v":0},0,{"$f":"IF(M1123,SUMPRODUCT(--(J$32:J$1031<=M1123))-SUM(N$1047:N1122),)","v":0},null,0,0]
[null,null,null,null,null,77,0,{"$f":"IF(G1124,SUMPRODUCT(--(G$32:G$1031<=G1124))-SUM(H$1047:H1123),)","v":0},0,{"$f":"IF(I1124,SUMPRODUCT(--(H$32:H$1031<=I1124))-SUM(J$1047:J1123),)","v":0},0,{"$f":"IF(K1124,SUMPRODUCT(--(I$32:I$1031<=K1124))-SUM(L$1047:L1123),)","v":0},0,{"$f":"IF(M1124,SUMPRODUCT(--(J$32:J$1031<=M1124))-SUM(N$1047:N1123),)","v":0},null,0,0]
[null,null,null,null,null,78,0,{"$f":"IF(G1125,SUMPRODUCT(--(G$32:G$1031<=G1125))-SUM(H$1047:H1124),)","v":0},0,{"$f":"IF(I1125,SUMPRODUCT(--(H$32:H$1031<=I1125))-SUM(J$1047:J1124),)","v":0},0,{"$f":"IF(K1125,SUMPRODUCT(--(I$32:I$1031<=K1125))-SUM(L$1047:L1124),)","v":0},0,{"$f":"IF(M1125,SUMPRODUCT(--(J$32:J$1031<=M1125))-SUM(N$1047:N1124),)","v":0},null,0,0]
[null,null,null,null,null,79,0,{"$f":"IF(G1126,SUMPRODUCT(--(G$32:G$1031<=G1126))-SUM(H$1047:H1125),)","v":0},0,{"$f":"IF(I1126,SUMPRODUCT(--(H$32:H$1031<=I1126))-SUM(J$1047:J1125),)","v":0},0,{"$f":"IF(K1126,SUMPRODUCT(--(I$32:I$1031<=K1126))-SUM(L$1047:L1125),)","v":0},0,{"$f":"IF(M1126,SUMPRODUCT(--(J$32:J$1031<=M1126))-SUM(N$1047:N1125),)","v":0},null,0,0]
[null,null,null,null,null,80,0,{"$f":"IF(G1127,SUMPRODUCT(--(G$32:G$1031<=G1127))-SUM(H$1047:H1126),)","v":0},0,{"$f":"IF(I1127,SUMPRODUCT(--(H$32:H$1031<=I1127))-SUM(J$1047:J1126),)","v":0},0,{"$f":"IF(K1127,SUMPRODUCT(--(I$32:I$1031<=K1127))-SUM(L$1047:L1126),)","v":0},0,{"$f":"IF(M1127,SUMPRODUCT(--(J$32:J$1031<=M1127))-SUM(N$1047:N1126),)","v":0},null,0,0]
[null,null,null,null,null,81,0,{"$f":"IF(G1128,SUMPRODUCT(--(G$32:G$1031<=G1128))-SUM(H$1047:H1127),)","v":0},0,{"$f":"IF(I1128,SUMPRODUCT(--(H$32:H$1031<=I1128))-SUM(J$1047:J1127),)","v":0},0,{"$f":"IF(K1128,SUMPRODUCT(--(I$32:I$1031<=K1128))-SUM(L$1047:L1127),)","v":0},0,{"$f":"IF(M1128,SUMPRODUCT(--(J$32:J$1031<=M1128))-SUM(N$1047:N1127),)","v":0},null,0,0]
[null,null,null,null,null,82,0,{"$f":"IF(G1129,SUMPRODUCT(--(G$32:G$1031<=G1129))-SUM(H$1047:H1128),)","v":0},0,{"$f":"IF(I1129,SUMPRODUCT(--(H$32:H$1031<=I1129))-SUM(J$1047:J1128),)","v":0},0,{"$f":"IF(K1129,SUMPRODUCT(--(I$32:I$1031<=K1129))-SUM(L$1047:L1128),)","v":0},0,{"$f":"IF(M1129,SUMPRODUCT(--(J$32:J$1031<=M1129))-SUM(N$1047:N1128),)","v":0},null,0,0]
[null,null,null,null,null,83,0,{"$f":"IF(G1130,SUMPRODUCT(--(G$32:G$1031<=G1130))-SUM(H$1047:H1129),)","v":0},0,{"$f":"IF(I1130,SUMPRODUCT(--(H$32:H$1031<=I1130))-SUM(J$1047:J1129),)","v":0},0,{"$f":"IF(K1130,SUMPRODUCT(--(I$32:I$1031<=K1130))-SUM(L$1047:L1129),)","v":0},0,{"$f":"IF(M1130,SUMPRODUCT(--(J$32:J$1031<=M1130))-SUM(N$1047:N1129),)","v":0},null,0,0]
[null,null,null,null,null,84,0,{"$f":"IF(G1131,SUMPRODUCT(--(G$32:G$1031<=G1131))-SUM(H$1047:H1130),)","v":0},0,{"$f":"IF(I1131,SUMPRODUCT(--(H$32:H$1031<=I1131))-SUM(J$1047:J1130),)","v":0},0,{"$f":"IF(K1131,SUMPRODUCT(--(I$32:I$1031<=K1131))-SUM(L$1047:L1130),)","v":0},0,{"$f":"IF(M1131,SUMPRODUCT(--(J$32:J$1031<=M1131))-SUM(N$1047:N1130),)","v":0},null,0,0]
[null,null,null,null,null,85,0,{"$f":"IF(G1132,SUMPRODUCT(--(G$32:G$1031<=G1132))-SUM(H$1047:H1131),)","v":0},0,{"$f":"IF(I1132,SUMPRODUCT(--(H$32:H$1031<=I1132))-SUM(J$1047:J1131),)","v":0},0,{"$f":"IF(K1132,SUMPRODUCT(--(I$32:I$1031<=K1132))-SUM(L$1047:L1131),)","v":0},0,{"$f":"IF(M1132,SUMPRODUCT(--(J$32:J$1031<=M1132))-SUM(N$1047:N1131),)","v":0},null,0,0]
[null,null,null,null,null,86,0,{"$f":"IF(G1133,SUMPRODUCT(--(G$32:G$1031<=G1133))-SUM(H$1047:H1132),)","v":0},0,{"$f":"IF(I1133,SUMPRODUCT(--(H$32:H$1031<=I1133))-SUM(J$1047:J1132),)","v":0},0,{"$f":"IF(K1133,SUMPRODUCT(--(I$32:I$1031<=K1133))-SUM(L$1047:L1132),)","v":0},0,{"$f":"IF(M1133,SUMPRODUCT(--(J$32:J$1031<=M1133))-SUM(N$1047:N1132),)","v":0},null,0,0]
[null,null,null,null,null,87,0,{"$f":"IF(G1134,SUMPRODUCT(--(G$32:G$1031<=G1134))-SUM(H$1047:H1133),)","v":0},0,{"$f":"IF(I1134,SUMPRODUCT(--(H$32:H$1031<=I1134))-SUM(J$1047:J1133),)","v":0},0,{"$f":"IF(K1134,SUMPRODUCT(--(I$32:I$1031<=K1134))-SUM(L$1047:L1133),)","v":0},0,{"$f":"IF(M1134,SUMPRODUCT(--(J$32:J$1031<=M1134))-SUM(N$1047:N1133),)","v":0},null,0,0]
[null,null,null,null,null,88,0,{"$f":"IF(G1135,SUMPRODUCT(--(G$32:G$1031<=G1135))-SUM(H$1047:H1134),)","v":0},0,{"$f":"IF(I1135,SUMPRODUCT(--(H$32:H$1031<=I1135))-SUM(J$1047:J1134),)","v":0},0,{"$f":"IF(K1135,SUMPRODUCT(--(I$32:I$1031<=K1135))-SUM(L$1047:L1134),)","v":0},0,{"$f":"IF(M1135,SUMPRODUCT(--(J$32:J$1031<=M1135))-SUM(N$1047:N1134),)","v":0},null,0,0]
[null,null,null,null,null,89,0,{"$f":"IF(G1136,SUMPRODUCT(--(G$32:G$1031<=G1136))-SUM(H$1047:H1135),)","v":0},0,{"$f":"IF(I1136,SUMPRODUCT(--(H$32:H$1031<=I1136))-SUM(J$1047:J1135),)","v":0},0,{"$f":"IF(K1136,SUMPRODUCT(--(I$32:I$1031<=K1136))-SUM(L$1047:L1135),)","v":0},0,{"$f":"IF(M1136,SUMPRODUCT(--(J$32:J$1031<=M1136))-SUM(N$1047:N1135),)","v":0},null,0,0]
[null,null,null,null,null,90,0,{"$f":"IF(G1137,SUMPRODUCT(--(G$32:G$1031<=G1137))-SUM(H$1047:H1136),)","v":0},0,{"$f":"IF(I1137,SUMPRODUCT(--(H$32:H$1031<=I1137))-SUM(J$1047:J1136),)","v":0},0,{"$f":"IF(K1137,SUMPRODUCT(--(I$32:I$1031<=K1137))-SUM(L$1047:L1136),)","v":0},0,{"$f":"IF(M1137,SUMPRODUCT(--(J$32:J$1031<=M1137))-SUM(N$1047:N1136),)","v":0},null,0,0]
[null,null,null,null,null,91,0,{"$f":"IF(G1138,SUMPRODUCT(--(G$32:G$1031<=G1138))-SUM(H$1047:H1137),)","v":0},0,{"$f":"IF(I1138,SUMPRODUCT(--(H$32:H$1031<=I1138))-SUM(J$1047:J1137),)","v":0},0,{"$f":"IF(K1138,SUMPRODUCT(--(I$32:I$1031<=K1138))-SUM(L$1047:L1137),)","v":0},0,{"$f":"IF(M1138,SUMPRODUCT(--(J$32:J$1031<=M1138))-SUM(N$1047:N1137),)","v":0},null,0,0]
[null,null,null,null,null,92,0,{"$f":"IF(G1139,SUMPRODUCT(--(G$32:G$1031<=G1139))-SUM(H$1047:H1138),)","v":0},0,{"$f":"IF(I1139,SUMPRODUCT(--(H$32:H$1031<=I1139))-SUM(J$1047:J1138),)","v":0},0,{"$f":"IF(K1139,SUMPRODUCT(--(I$32:I$1031<=K1139))-SUM(L$1047:L1138),)","v":0},0,{"$f":"IF(M1139,SUMPRODUCT(--(J$32:J$1031<=M1139))-SUM(N$1047:N1138),)","v":0},null,0,0]
[null,null,null,null,null,93,0,{"$f":"IF(G1140,SUMPRODUCT(--(G$32:G$1031<=G1140))-SUM(H$1047:H1139),)","v":0},0,{"$f":"IF(I1140,SUMPRODUCT(--(H$32:H$1031<=I1140))-SUM(J$1047:J1139),)","v":0},0,{"$f":"IF(K1140,SUMPRODUCT(--(I$32:I$1031<=K1140))-SUM(L$1047:L1139),)","v":0},0,{"$f":"IF(M1140,SUMPRODUCT(--(J$32:J$1031<=M1140))-SUM(N$1047:N1139),)","v":0},null,0,0]
[null,null,null,null,null,94,0,{"$f":"IF(G1141,SUMPRODUCT(--(G$32:G$1031<=G1141))-SUM(H$1047:H1140),)","v":0},0,{"$f":"IF(I1141,SUMPRODUCT(--(H$32:H$1031<=I1141))-SUM(J$1047:J1140),)","v":0},0,{"$f":"IF(K1141,SUMPRODUCT(--(I$32:I$1031<=K1141))-SUM(L$1047:L1140),)","v":0},0,{"$f":"IF(M1141,SUMPRODUCT(--(J$32:J$1031<=M1141))-SUM(N$1047:N1140),)","v":0},null,0,0]
[null,null,null,null,null,95,0,{"$f":"IF(G1142,SUMPRODUCT(--(G$32:G$1031<=G1142))-SUM(H$1047:H1141),)","v":0},0,{"$f":"IF(I1142,SUMPRODUCT(--(H$32:H$1031<=I1142))-SUM(J$1047:J1141),)","v":0},0,{"$f":"IF(K1142,SUMPRODUCT(--(I$32:I$1031<=K1142))-SUM(L$1047:L1141),)","v":0},0,{"$f":"IF(M1142,SUMPRODUCT(--(J$32:J$1031<=M1142))-SUM(N$1047:N1141),)","v":0},null,0,0]
[null,null,null,null,null,96,0,{"$f":"IF(G1143,SUMPRODUCT(--(G$32:G$1031<=G1143))-SUM(H$1047:H1142),)","v":0},0,{"$f":"IF(I1143,SUMPRODUCT(--(H$32:H$1031<=I1143))-SUM(J$1047:J1142),)","v":0},0,{"$f":"IF(K1143,SUMPRODUCT(--(I$32:I$1031<=K1143))-SUM(L$1047:L1142),)","v":0},0,{"$f":"IF(M1143,SUMPRODUCT(--(J$32:J$1031<=M1143))-SUM(N$1047:N1142),)","v":0},null,0,0]
[null,null,null,null,null,97,0,{"$f":"IF(G1144,SUMPRODUCT(--(G$32:G$1031<=G1144))-SUM(H$1047:H1143),)","v":0},{"$f":"H$1040+IF($F1144<=H$1043,($F1144-1)*H$1042,-H$1040)","v":0},{"$f":"IF(I1144,SUMPRODUCT(--(H$32:H$1031<=I1144))-SUM(J$1047:J1143),)","v":0},0,{"$f":"IF(K1144,SUMPRODUCT(--(I$32:I$1031<=K1144))-SUM(L$1047:L1143),)","v":0},0,{"$f":"IF(M1144,SUMPRODUCT(--(J$32:J$1031<=M1144))-SUM(N$1047:N1143),)","v":0},null,0,0]
[null,null,null,null,null,98,0,{"$f":"IF(G1145,SUMPRODUCT(--(G$32:G$1031<=G1145))-SUM(H$1047:H1144),)","v":0},{"$f":"H$1040+IF($F1145<=H$1043,($F1145-1)*H$1042,-H$1040)","v":0},{"$f":"IF(I1145,SUMPRODUCT(--(H$32:H$1031<=I1145))-SUM(J$1047:J1144),)","v":0},0,{"$f":"IF(K1145,SUMPRODUCT(--(I$32:I$1031<=K1145))-SUM(L$1047:L1144),)","v":0},0,{"$f":"IF(M1145,SUMPRODUCT(--(J$32:J$1031<=M1145))-SUM(N$1047:N1144),)","v":0},null,0,0]
[null,null,null,null,null,99,0,{"$f":"IF(G1146,SUMPRODUCT(--(G$32:G$1031<=G1146))-SUM(H$1047:H1145),)","v":0},{"$f":"H$1040+IF($F1146<=H$1043,($F1146-1)*H$1042,-H$1040)","v":0},{"$f":"IF(I1146,SUMPRODUCT(--(H$32:H$1031<=I1146))-SUM(J$1047:J1145),)","v":0},0,{"$f":"IF(K1146,SUMPRODUCT(--(I$32:I$1031<=K1146))-SUM(L$1047:L1145),)","v":0},0,{"$f":"IF(M1146,SUMPRODUCT(--(J$32:J$1031<=M1146))-SUM(N$1047:N1145),)","v":0},null,0,0]
[null,null,null,null,null,100,0,{"$f":"IF(G1147,SUMPRODUCT(--(G$32:G$1031<=G1147))-SUM(H$1047:H1146),)","v":0},{"$f":"H$1040+IF($F1147<=H$1043,($F1147-1)*H$1042,-H$1040)","v":0},{"$f":"IF(I1147,SUMPRODUCT(--(H$32:H$1031<=I1147))-SUM(J$1047:J1146),)","v":0},0,{"$f":"IF(K1147,SUMPRODUCT(--(I$32:I$1031<=K1147))-SUM(L$1047:L1146),)","v":0},0,{"$f":"IF(M1147,SUMPRODUCT(--(J$32:J$1031<=M1147))-SUM(N$1047:N1146),)","v":0},null,0,0]

{"sheet":"Lookups","index":7,"n_rows":14,"n_cols":9,"rows_kept":14,"cut":false,"hidden":false,"merged":[[2,0,2,4]]}
[{"$f":"IF(ISERROR(RIGHT(CELL(\"filename\",A1),LEN(CELL(\"filename\",A1))-FIND(\"]\",CELL(\"filename\",A1)))),\n\"\",\nRIGHT(CELL(\"filename\",A1),LEN(CELL(\"filename\",A1))-FIND(\"]\",CELL(\"filename\",A1))))","v":"Lookups"}]
["Simulation Example.xlsm"]
["Navigator"]
[null,null,null,null,"Error Checks:",null,null,null,0]
[]
[null,{"$f":"MAX($B$5:$B5)+1","v":1},{"$f":"A1","v":"Lookups"}]
[]
[null,null,"Simulation Outputs"]
[]
[null,null,null,null,null,null,"List"]
[null,null,null,null,null,null,{"$f":"'Simulation Example'!G12","v":"Sales (US$)"},null,"LU_Simulation_Outputs"]
[null,null,null,null,null,null,{"$f":"'Simulation Example'!G13","v":"Foreign Exchange (US$:A$)"}]
[null,null,null,null,null,null,{"$f":"'Simulation Example'!G14","v":"Gross Margin (%)"}]
[null,null,null,null,null,null,{"$f":"'Simulation Example'!M1046","v":"Gross Profit (A$)"}]

{"sheet":"Error Checks","index":8,"n_rows":17,"n_cols":9,"rows_kept":17,"cut":false,"hidden":false,"merged":[[0,8,0,9],[2,0,2,4]]}
[{"$f":"IF(ISERROR(RIGHT(CELL(\"filename\",A1),LEN(CELL(\"filename\",A1))-FIND(\"]\",CELL(\"filename\",A1)))),\n\"\",\nRIGHT(CELL(\"filename\",A1),LEN(CELL(\"filename\",A1))-FIND(\"]\",CELL(\"filename\",A1))))","v":"Error Checks"}]
[{"$f":"Model_Name","v":"Agile Excel vLB1.02_for blog.xlsm"}]
["Navigator"]
[null,"Error Checks:",null,null,null,{"$f":"Overall_Error_Check","v":0}]
[]
[null,{"$f":"MAX($B$5:$B5)+1","v":1},"Error Checks"]
[]
[null,null,"Summary of Errors"]
[]
[null,null,null,"Assumptions"]
[]
[null,null,null,null,"Example"]
[]
[]
[]
[]
[null,null,null,null,{"$f":"C8","v":"Summary of Errors"},null,null,null,{"$f":"MIN(1,SUM(I11:I15))","v":0}]